##TITLE=$$ Begin of the data block
##JCAMP-DX=5.00 $$ ACD/SpecManager v 10.08
##SPECTROMETER/DATA SYSTEM=Alpha
##DATE=26 Dec 2014 10:25:20
##DATA TYPE=INFRARED SPECTRUM
##DATA CLASS=XYDATA
##ORIGIN=
##OWNER=
##NPOINTS=1765
##FIRSTX=399.76428223
##LASTX=3997.64306641
##MAXX=3997.64306641
##MINX=399.76428223
##MAXY=0.83705401
##MINY=0.19477944
##XFACTOR=1.0000000000
##YFACTOR=1.000000000000000e-9
##FIRSTY=0.53004307
##DELTAX=2.03961372
##XUNITS=1/CM
##YUNITS=ARBITRARY UNITS
##XYDATA=(X++(Y..Y))
399.8E30043066m881740m314840l075063o33121J020193J138688J047968J141370Q50081
418.1E22336602o62803k339423k932131k770126k393663k389074l023743l594756k721250
436.5D99509633l52204K427518M620433N038202M081964L200949K766132K181530P59184
454.8E24233341q28445j426220j221180j449287k222657l309607m039705l799975l147006
473.2E02789259k699077k637088k446503j555860l32892L65257J64032n34415j086563
491.5D92026150j153826j167506j606286k207488k626747k683073k502024k737791
507.9D75341409l618508m581839m946917m749358m575342m575074m309535l351271
524.2D40633565j761317k12610O50525J113743J819461L370583N558223O712198N689174
$$ plain form
399.8 530043066 525161326 520846486 517771423 517138302 518158495 519297183 520345151 521486521 522336602
418.1 522336602 521673799 519334376 516402245 513632119 511238456 508849382 505825639 502230883 499509633
436.5 499509633 499157429 501584947 506205380 511243582 515325546 518526495 521292627 523474157 524233341
454.8 524233341 523404896 521978676 520757496 519308209 517085552 513775945 509736240 505936265 502789259
473.2 502789259 500090182 497453094 495006591 493450731 493117839 493483096 493647128 493112713 492026150
491.5 492026150 490872324 489704818 488098532 485891044 483264297 480581224 478079200 475341409
507.9 475341409 471722901 467141062 462194145 457444787 452869445 448294371 443984836 440633565
524.2 440633565 438872248 438659638 439310163 440423906 442243367 445613950 451172173 457884371 463573545
542.5D63573545L485412J586496L16978o21200j466870k516508l601372m318178m855901
560.9D51582402n603254o675750p863402q148164o614983l949672j295209J114935
577.2D12546903L487676N798042P612497Q330077P638335N749643L640085K109796
593.5D56913054J174718M85420j79410o45786n83321m2289N69820R90868J282274J713902
613.9D61679250K449721L391475M180729M514992M465431M298121M102081L765255
630.2D92847055L265649K546341J786381J405835J508474J661837J502216J148701
646.6E07672489R04619R86040J316309J532614J335860R27865P60615R48131J283586
664.9E17668128J933217K154052J156152J162648J766205K042234J948595J642346
$$ plain form
542.5 463573545 467058957 468645453 468962431 468341231 466874361 464357853 460756481 456438303 451582402
560.9 451582402 445979148 439303398 431439996 423291832 416676849 412727177 411431968 412546903
577.2 412546903 416034579 421832621 429445118 437775195 445413530 451163173 454803258 456913054
593.5 456913054 458087772 458573192 458393782 457747996 457164675 457122386 457692206 458683074 459965348 461679250
613.9 461679250 464128971 467520446 471701175 476216167 480681598 484979719 489081800 492847055
630.2 492847055 496112704 498659045 500445426 501851261 503359735 505021572 506523788 507672489
646.6 507672489 508577108 509563148 510879457 512412071 513747931 514675796 515436411 516384542 517668128
664.9 517668128 519601345 521755397 522911549 524074197 525840402 527882636 529831231 531473577
681.2E31473577J342058J191378J149893R08613J38283r79245j907230k488017k960324
699.6E27868986l429949l599227l064334j746178R4533J876116L112674M040837N049050
717.9E30202508O130815O894886P133186O909430O280005N613506N080282M470289
734.3E78714907L549218K298892J169264L35813n93961j959562l632784n058884n743027
752.6E69079876n783856n543232n180657m554987l347039j280189J412154M049539
768.9E48851609O285250P998944R220540J0061622J0180294R256125P645369O127834
785.3F15627587N219757M862011M653036M323960M083633M355490M974843N215466
801.6F53315783M616200L450335K469003K105772K089858J903713J294076L26217m99964
$$ plain form
681.2 531473577 532815635 534007013 535156906 536065519 536203802 535224557 533317327 530829310 527868986
699.6 527868986 524439037 520839810 517775476 516029298 516123831 517999947 521112621 525153458 530202508
717.9 530202508 536333323 543228209 550361395 557270825 563550830 569164336 574244618 578714907
734.3 578714907 582264125 584563017 585732281 586068094 585474133 583514571 579881787 574822903 569079876
752.6 569079876 563296020 557752788 552572131 548017144 544670105 543389916 544802070 548851609
768.9 548851609 555136859 563135803 572356343 582417965 592598259 601854384 609499753 615627587
785.3 615627587 620847344 625709355 630362391 634686351 638769984 643125474 648100317 653315783
801.6 653315783 657931983 661382318 663851321 665957093 668046951 669950664 671244740 671570957 671070993
819.9F71070993r43840j401305k326608l768026n222142o116152o311476o166935o090224
838.3F32724285o084263n755365m910410l938138l478825l734291m312336m769206
854.6E95741451m832626m086196j780450K233088O765544J0446310J2760341J3454557
870.9F30702019J2237489R447098O079197K886653j48178l158509n740524p278144
887.2F45027101p626593p240892o689429o276607n990327n717456n565703n828679
903.5E94091415o719172q086860r425461j0356486j0899007j1154890j0866642r596348
919.9E16986549p332087m637777k289415p11679L38554J371086K622008L981411N122841
938.2E15451491N780041N673349M171968R61661l327787p778704j1633218j4348089
$$ plain form
819.9 671070993 670127153 668725848 666399240 662631214 657409072 651292920 644981444 638814509 632724285
838.3 632724285 626640022 620884657 615974247 612036109 608557284 604822993 600510657 595741451
854.6 595741451 590908825 586822629 585042179 587275267 594040811 604487121 617247462 630702019
870.9 630702019 642939508 652386606 658465803 661352456 661204278 658045769 652305245 645027101
887.2 645027101 637400508 630159616 623470187 617193580 611203253 605485797 599920094 594091415
903.5 594091415 587372243 579285383 569859922 559503436 548604429 537449539 526582897 516986549
919.9 516986549 509654462 505016685 502727270 502015591 502354145 503725231 506347239 510328650 515451491
938.2 515451491 521231532 526904881 531076849 532038510 528710723 520932019 509298801 494950712
954.5D94950712j5966714j7039567j8053472j9091159j9980550k0671874k1209985
968.8C62937391k1563947k1679134k1441906k0609200j9012362j6703367j3913870
983.1B28013605j1011750q295580n870596l781825k119825r02369n2437N25608P84591
1001.4A97289422O58736K50071k81066p98627j098395r15333l25367M14356J182840
1019.8A96376637J942858K679497L328740L757552L923624L860325L478572K760142
1036.1B22107947J896143J222268R47222J036465J348242J897410K853930M215478
1052.4B37525105N755499P178978Q431166R716660J0990798J1300355R016574L144890
1068.8C03060025m766852j0712504j1780649q801401m650563j114577J558542L502518
$$ plain form
954.5 494950712 478983998 461944431 443890959 424799800 404819250 384147376 362937391
968.8 362937391 341373444 319694310 298252404 277643204 258630842 241927475 228013605
983.1 228013605 217001855 208706275 202835679 199053854 196934029 196031660 195979223 196504831 197289422
1001.4 197289422 197948158 198198229 197917163 197118536 196020141 195104808 194779441 195193797 196376637
1019.8 196376637 198319495 200998992 204327732 208085284 212008908 215869233 219347805 222107947
1036.1 222107947 224004090 225226358 226173580 227210045 228558287 230455697 233309627 237525105
1052.4 237525105 243280604 250459582 258890748 268607408 279598206 290898561 299915135 303060025
1068.8 303060025 298293173 287580669 275800020 266998619 262348056 261233479 262792021 266294539
1085.1B66294539M863143N891383O675392P017255O653875N483001L809780K199352
1101.4C08887720J216054J224667K160877L472686M508733M903794M660904L986061
1117.7C35021496L119677K414584K191067K613246L592343M627168M883736L724337
1134C62187654J153260k216846n500018p950574r168476r241849q466959p065773n268902
1152.4C08461517l338784j457423L20673K095968M087537O340534Q696586J0949820
1168.7C36156428J2942731J4521182J5555531J6037672J6075194J5764594J5118033
1183D42171365J4132291J2719840J0764033Q418589O112397M225880K931178K150714
1199.3E03626287J782119J823843K276301L132522M169166N017102N460739N443335
$$ plain form
1085.1 266294539 271157682 277049065 283724457 290741712 297395587 302878588 306688368 308887720
1101.4 308887720 310103774 311328441 313489318 316962004 321470737 326374531 331035435 335021496
1117.7 335021496 338141173 340555757 342746824 345360070 348952413 353579581 358463317 362187654
1134 362187654 363340914 361124068 355624050 347673476 338505000 329263151 320796192 313730419 308461517
1152.4 308461517 305122733 303665310 303985983 306081951 310169488 316510022 325206608 336156428
1168.7 336156428 349099159 363620341 379175872 395213544 411288738 427053332 442171365
1183 442171365 456303656 469023496 479787529 488206118 494318515 498544395 501475573 503626287
1199.3 503626287 505408406 507232249 509508550 512641072 516810238 521827340 527288079 532731414
1215.6E32731414M989207M100382K790749J224220k58804j283407j748979j890957
1231.9E40653825j962066j978874j778722j284778n76139K14816R32157J510381J993716
1250.3E37724316K350807K426207K102256J517117J075447J079023J479566J974284
1266.6E51729023K194584K038538J663268J152754N05686k14339q36193j122654j037419
1285E56073248q97526r96948j365184j833499k121866k163469k138973k171099k243042
1303.3E40141642k282977k183735j873136j561046j522123j657069j737595j785218
1319.6E25538743k121509l072261m471124n674362o113231n754411m934132l937871
1336D89459842k860814j610011l41862M40150O27309L52979j17391m36455n94348p94381
$$ plain form
1215.6 532731414 537720621 541821003 544611752 545835972 545577168 544293761 542544782 540653825
1231.9 540653825 538691759 536712885 534934163 533649385 533073246 533288062 534220219 535730600 537724316
1250.3 537724316 540075123 542501330 544603586 546120703 547196150 548275173 549754739 551729023
1266.6 551729023 553923607 555962145 557625413 558778167 559283853 559069514 558233321 557110667 556073248
1285 556073248 555175722 554178774 552813590 550980091 548858225 546694756 544555783 542384684 540141642
1303.3 540141642 537858665 535674930 533801794 532240748 530718625 529061556 527323961 525538743
1319.6 525538743 523417234 520344973 515873849 510199487 504086256 498331845 493397713 489459842
1336 489459842 486599028 484989017 484647155 485087305 485714614 486067593 485950202 485513747 484919399 484125018
1356.4D84125018j140863j555621j764864j344651p42972m65900k05695K28584P83533
1374.7D77916569J162081J266003J288623J547098K426028L877223M472732L440291
1391D97396648K041221P17997l15726r30428j226068j575648k118648k256691k069384
1409.4D89663273j889557j590400j276702j167596q16613N0396P61389J123757J268655
1427.7D86126602J474201J785815K037406K494753K764344K261191J998157J837194
1444.1E02779663J411438O71506k10107q84414j259327j732707j482099R2864J252800
1462.4E00639617K760590M525125N540967P198453J0573327J1586845R964585Q995056
1478.7E61784565Q643151Q273899P235051O576657O772041O699026N303621M461408
$$ plain form
1356.4 484125018 482984155 481428534 479663670 478319019 477576047 477110147 476904452 477133036 477916569
1374.7 477916569 479078650 480344653 481633276 483180374 485606402 489483625 493956357 497396648
1391 497396648 499437869 500155866 499840140 498909712 497683644 496107996 493989348 491732657 489663273
1409.4 489663273 487773716 486183316 484906614 483739018 482922405 482972801 483734190 484857947 486126602
1427.7 486126602 487600803 489386618 491424024 493918777 496683121 498944312 500942469 502779663
1444.1 502779663 504191101 504862607 504652500 503768086 502508759 500776052 499293953 499386817 500639617
1462.4 500639617 503400207 507925332 513466299 520664752 531238079 542824924 552789509 561784565
1478.7 561784565 570427716 578701615 585936666 592513323 599285364 605984390 611288011 615749419
1495F15749419M594922M295826L620982L009975K920508L507912K920270K196193K099931
1513.4F44915938K075494K125919J909256J761257J687467J550019J515210J200378
1529.7F58740938Q15808O10829O27994N55635L42190p8499k67089k13563j98722l10361
1550.1F60625160n07117p45236r21190j414538j545965p06017q09014j103997j235486
1568.5F51636600j121342o17146o72400j219571j083433p07150o59704p24852r89139
1586.8F43841863j315892j510918j523674j559555j778901k184570k656221k902150
1603.2F28409982k908826l061116l564954l861487l749609m121184m675746l613651
1619.5E98853409l240764m014730l807962l310919l073752k461791k264142k656817
$$ plain form
1495 615749419 620344341 624640167 628261149 631271124 634191632 637699544 640619814 642816007 644915938
1513.4 644915938 646991432 649117351 651026607 652787864 654475331 656025350 657540560 658740938
1529.7 658740938 659556746 660167575 660795569 661351204 661693394 661614895 661347806 661134243 660935521 660625160
1550.1 660625160 660118043 659372807 658451617 657037079 655491114 654785097 653976083 652872086 651636600
1568.5 651636600 650515258 649898112 649225712 648006141 646922708 646215558 645555854 644831002 643841863
1586.8 643841863 642525971 641015053 639491379 637931824 636152923 633968353 631312132 628409982
1603.2 628409982 625501156 622440040 618875086 615013599 611263990 607142806 602467060 598853409
1619.5 598853409 595612645 591597915 587789953 584479034 581405282 578943491 576679349 574022532
1635.8E74022532j743675n14745n5373J55210M77314J155258J425981K080202L673911
1654.1E80676615L239215K847671L405810M384219M819215M251241M588604N583704
1670.5F13796294N234360N450964N973757N221724M670799N320013P211625O290972
1686.8F59170508M935086M965902M442155M561841M903376M544795M784346L818392
1703.1F96126401L207744L485143L188848K747655K397299K171934K151668J670181
1719.4G17146873J069367J075507J544416J867890J985848J888156K023041K117693
1735.7G30718791J754284J887262K164841K199233K260327K434254K884388L238379
1752G49541759K910615K677261K618432K381862K353370K145529J778364J578569J425564
$$ plain form
1635.8 574022532 572278857 571764112 571708739 571863949 572341263 573496521 574922502 577002704 580676615
1654.1 580676615 583915830 586763501 590169311 594553530 599372745 603623986 608212590 613796294
1670.5 613796294 619030654 624481618 630455375 635677099 640347898 645667911 652879536 659170508
1686.8 659170508 664105594 669071496 673513651 678075492 682978868 687523663 692308009 696126401
1703.1 696126401 699334145 702819288 706008136 708755791 711153090 713325024 715476692 717146873
1719.4 717146873 718216240 719291747 720836163 722704053 724689901 726578057 728601098 730718791
1735.7 730718791 732473075 734360337 736525178 738724411 740984738 743418992 746303380 749541759
1752 749541759 752452374 755129635 757748067 760129929 762483299 764628828 766407192 767985761 769411325
1770.4G69411325J451910J525760J351654J184762J131057J132787J139819J088143
1786.7G79417217R34541Q00371R28581J051724R74655Q65221Q56757R39489R39130
1805.1G87707686Q41916P47383P55965P74026P61330P57635P33852O21737N25236N82933
1825.5G94809699O32107N94020N79477N31315M57824M70698M49657K95460J55509K45869
1845.9G99221635L92377M33386L83257K47121J61708J91509K95222L18945K44856J23381
1866.3H02013397P4208K85685M66287M06981K87533K58982L15726M12762M55796L61741
1886.7H05339098K17438K38180L50714L80158L26335J78814Q5950J38581K34127K08676
1907.1H07698071Q3566L7968Q6009J33515J68621K02418J35243P0989J48952K33590
$$ plain form
1770.4 769411325 770863235 772388995 773740649 774925411 776056468 777189255 778329074 779417217
1786.7 779417217 780351758 781152129 782080710 783132434 784107089 784972310 785829067 786768556 787707686
1805.1 787707686 788549602 789296985 790052950 790826976 791588306 792345941 793079793 793701530 794226766 794809699
1825.5 794809699 795441806 796035826 796615303 797146618 797604442 798075140 798524797 798820257 798975766 799221635
1845.9 799221635 799614012 800047398 800430655 800677776 800839484 801030993 801326215 801645160 801890016 802013397
1866.3 802013397 802087605 802373290 802839577 803246558 803534091 803793073 804108799 804521561 804977357 805339098
1886.7 805339098 805556536 805794716 806145430 806525588 806851923 807030737 807116687 807255268 807489395 807698071
1907.1 807698071 807781637 807819605 807905614 808039129 808207750 808410168 808545411 808616400 808765352 808998942
1927.5H08998942K26438J56522O3539K7179J06454J74225J41680J20640J52528J79112
1947.9H10347259K19286K55882K45452J89364J55151K08736K72572K34246J18673R1433
1968.3H12338054J57952K12312K28524J71066Q4042M9770Q9288J48117J38701M3511
1988.7H13661337m8876k1875J17541J56700K7895r4712j35243j14441q1837j12235
2009H13354254k28286l47614l81947l48985l58284m94957p39157p55429l09408K3902
2029.4H09414089j14143l62814m72128m34458l41833k85089k99990l34263k97427j75893
2049.8H06296051m7267o497n1141p4207j5021P5519J33992J06096K9385L517M2080
2072.3H06492507R8646J24157O8009J609L7968J26958J61290J32620J03832J06036
$$ plain form
1927.5 808998942 809225380 809381902 809445441 809472620 809579074 809753299 809894979 810015619 810168147 810347259
1947.9 810347259 810566545 810822427 811067879 811257243 811412394 811621130 811893702 812127948 812246621 812338054
1968.3 812338054 812496006 812708318 812936842 813107908 813191950 813241720 813331008 813479125 813617826 813661337
1988.7 813661337 813612461 813590586 813708127 813864827 813892722 813798010 813662767 813548326 813466489 813354254
2009 813354254 813125968 812778354 812396407 812047422 811689138 811194181 810455024 809699595 809390187 809414089
2029.4 809414089 809299946 808937132 808465004 808030546 807688713 807403624 807103634 806769371 806471944 806296051
2049.8 806296051 806248784 806242287 806191146 806116939 806101918 806177437 806311429 806417525 806446910 806450427 806492507
2072.3 806492507 806591153 806715310 806783319 806784928 806822896 806949854 807111144 807243764 807347596 807453632
2092.7H07453632J43767J87874K04086J64628J22070J52231J84774J62423J29044J09553
2113.1H09014082Q9407Q7202Q7916M5598j0312k5153J2994O9737Q1599K9743l58O318
2137.5H09488773K0266N9426P8380L0637n484M9770J35183J73271J77085J87338K21908
2160H10616553K94328L34799L13043L31223M15564M98354N34475N21243M78744M72725
2180.4H14811051N05566N13554M86255M47750M21286M27782M55201M38273L79681L35455
2200.8H19221854L54767M34578N18500N39780M43995L23892L36527M49181M71592L39091
2221.2H23433757K15351K72513M04775M05550L06845K08974J77025K65360L58045K88427
2241.6H26336622J47581J25766K11597K91526K93672K17319J42037J48595K32637L29017
$$ plain form
2092.7 807453632 807597399 807785273 807989359 808153987 808276057 808428288 808613062 808775485 808904529 809014082
2113.1 809014082 809103489 809190691 809278607 809324205 809313893 809288740 809301734 809371471 809453070 809482813 809482455 809488773
2137.5 809488773 809509039 809568465 809646845 809677482 809671998 809721768 809856951 810030222 810207307 810394645 810616553
2160 810616553 810910881 811245680 811558723 811889946 812305510 812803864 813338339 813859582 814338326 814811051
2180.4 814811051 815316617 815830171 816316426 816764176 817185462 817613244 818068445 818506718 818886399 819221854
2200.8 819221854 819576621 820011199 820529699 821069479 821513474 821837366 822173893 822623074 823094666 823433757
2221.2 823433757 823649108 823921621 824326396 824731946 825038791 825247765 825424790 825690150 826048195 826336622
2241.6 826336622 826484203 826609969 826821566 827113092 827406764 827624083 827766120 827914715 828147352 828476369
2262H28476369L13282J76728P5162J19745K62976L38078K61843J37627J15335J98185
2282.3H30475330K89023K88129J83404J27554J88171K56300K70129K49147J71542J04845
2302.7H32603574J87635L76284M45009K99573J35958J58071L71397N19454M05133K21372
2323.1H35723460J67489K01106K54929K26855M6432j55926k28107q4042L6240l00825
2343.5H35887611q87871q83877k15471N94139J065612R38356M96566N8949k11537n32388
2363.9H36310089q27492r59813j152456j188815r33468p48575p76171q12710p24792
2382.3H28185797n34594l08991j77085k25604l33130l43919k27392j18792j92880l72053
2402.7H25351357m60088l80397k59518k79010m12404n29766n69463n01156m10020m41432
$$ plain form
2262 828476369 828789651 828966379 829041541 829161286 829424262 829762340 830024183 830161810 830277145 830475330
2282.3 830475330 830764353 831052482 831235886 831363440 831551611 831807911 832078040 832327187 832498729 832603574
2302.7 832603574 832791209 833167493 833612502 833912075 834048033 834206104 834577501 835096955 835502088 835723460
2323.1 835723460 835890949 836092055 836346984 836573839 836620271 836464345 836236238 836152196 836188436 835887611
2343.5 835887611 834999740 834115863 833900392 834494531 835560143 836498499 836995065 837054014 836842477 836310089
2363.9 836310089 835482597 834522784 833370328 832181513 831248045 830499470 829723299 828910589 828185797
2382.3 828185797 827651203 827342212 827165127 826939523 826606393 826262474 826035082 825916290 825723410 825351357
2402.7 825351357 824891269 824510872 824251354 823972344 823559940 823030174 822460711 821959555 821549535 821108103
2423.1H21108103n74827o91474o86705n61059m71949n44667o67990o72578o04988n63204
2443.5H15068662n69999o54697p34270o74903n60225n08844n25713o03557o75380o39081
2463.9H08921993n27621m89294n50568o02722n99027n53489m60088l99172m58896n58854
2484.3H03722262n72204m77612l47913l06189m09305m81546l85582k65300k51115l29733
2504.7G99895763m15444m12881l24190k51710k81811l86834m79341n11348m53413l67939
2525.1G96010852m14908o12140p45415o75679n33640n05328o36936p75277p71642o80625
2545.5G89659262o05822n96344o63877p40468p17998o11722n54085n88834o63341p06553
2565.8G83210218o46651n53608n69820o66857p22587o86526n84126m99964n20706o14345
$$ plain form
2423.1 821108103 820533276 819841802 819155097 818594038 818122089 817577422 816909432 816236854 815631866 815068662
2443.5 815068662 814498663 813843966 813109696 812434793 811874568 811365724 810840011 810236454 809561074 808921993
2463.9 808921993 808394372 807905078 807354510 806751788 806152761 805599272 805139184 804740012 804281116 803722262
2484.3 803722262 803150058 802672446 802324533 802018344 801609039 801127493 800741911 800476611 800225496 799895763
2504.7 799895763 799480319 799067438 798743248 798491538 798209727 797822893 797343552 796832204 796378791 796010852
2525.1 796010852 795595944 794983804 794238389 793562710 793029070 792523742 791886806 791111529 790339887 789659262
2545.5 789659262 789053440 788457096 787793219 787052751 786334753 785723031 785168946 784580112 783916771 783210218
2565.8 783210218 782563567 782009959 781440139 780773282 780050695 779364169 778780043 778280079 777759373 777145028
2586.2G77145028o44743n54622m19735l38912l70622m76778n65707n71072m90249m70519
2606.6G72242069o00517p65264q18729p39813o89626p86602r88901j160085j167059
2625G64525473j054406j014888j152873j336754j340985j189172j109004j171649j298606
2643.4G53857136j371861j330793j221656j116872j135886j289308j356363j203120
2659.7G43831277j018107j002193j123428j233339j199007j037896r12666r28700j019001
2678G34356940j075030j018822q76307q10147q95738j035750j084566j038730r97544
2696.4G25524306j015663j105130j231193j277447j162708j074075j153052j259446
2712.7G16245592j271069j165569j024783r69648j031935j119614j086593r21607p80403
$$ plain form
2586.2 777145028 776500285 775945663 775525928 775187016 774816394 774339616 773773909 773202837 772712588 772242069
2606.6 772242069 771641552 770876288 770057559 769317746 768628120 767841518 766852617 765692532 764525473
2625 764525473 763471067 762456179 761303306 759966552 758625567 757436395 756327391 755155742 753857136
2643.4 753857136 752485275 751154482 749932826 748815954 747680068 746390760 745034397 743831277
2659.7 743831277 742813170 741810977 740687549 739454210 738255203 737217307 736304641 735375941 734356940
2678 734356940 733281910 732263088 731386781 730576634 729680896 728645146 727560580 726521850 725524306
2696.4 725524306 724508643 723403513 722172320 720894873 719732165 718658090 717505038 716245592
2712.7 716245592 714974523 713808954 712784171 711814523 710782588 709662974 708576381 707654774 706874371
2731.1G06874371p99239q92043r27448q84474p68423o96361p75039r07064r07838p49230
2751.4F98567212o01769n92887o81997p47978o99342n66363n23686o47664p86245q38638
2771.8F91880643q05318p47502q01742r68099j112163j137495j059532j054168j206755
2790.2F82987869j393140j541137j595915j547098j560807j690328j837492j929402
2806.5F69892550j938522j954794k059043k206325k322793k366901k375602k426982
2822.8F52241588k566934k750218k859831k886295k918303l024876l221452l460765
2839.1F28552914l677667l877222m101873m284560m321277m160107l765940l284633
2855.5E97079635l047645l219426l658891m144132m623651n121351n590796n980075
$$ plain form
2731.1 706874371 706075132 705183089 704255641 703371167 702602744 701906383 701131344 700224280 699316442 698567212
2751.4 698567212 697965443 697372556 696690559 695942581 695243239 694676876 694153190 693505526 692719281 691880643
2771.8 691880643 691075325 690327823 689526081 688557982 687445819 686308324 685248792 684194624 682987869
2790.2 682987869 681594729 680053592 678457677 676910579 675349772 673659444 671821952 669892550
2806.5 669892550 667954028 665999234 663940191 661733866 659411073 657044172 654668570 652241588
2822.8 652241588 649674654 646924436 644064605 641178310 638260007 635235131 632013679 628552914
2839.1 628552914 624875247 620998025 616896152 612611592 608290315 604130208 600364268 597079635
2855.5 597079635 594031990 590812564 587153673 583009541 578385890 573264539 567673743 561693668
2871.8E61693668o209075o187856n897403n436003m878521m188359l416538k626658
2888.1E22853255j865685j282334r69172q81373q93712r22442j044989j332283j725316
2906.5E11935949k168893k646328l149569l672897m119754m331529m228235l813684
2922.8D83805060l178745k387852j446217l98368P96617K143353L431409M476697N258888
2941.1D92500842N794942O152928O422222O610751O694555O627142O481469O425202
2957.4E43710053O386757O175160N760908N306364M990041M775584M603743M475832
2973.8E86184442M323900M192948M092693L891886L602445L271043K912641K623260
2990.1F15095258K378106K070188J707673J296878Q95143N90861L04818k5153l16680
$$ plain form
2871.8 561693668 555484593 549296737 543399334 537963331 533084810 528896451 525479913 522853255
2888.1 522853255 520987570 519705236 518736064 517854691 516960979 516038537 514993548 513661265 511935949
2906.5 511935949 509767056 507120728 503971159 500298262 496178508 491846979 487618744 483805060
2922.8 483805060 480626315 478238463 476792246 476393878 477190495 479333848 482765257 487241954 492500842
2941.1 492500842 498295784 504448712 510870934 517481685 524176240 530803382 537284851 543710053
2957.4 543710053 550096810 556271970 562032878 567339242 572329283 577104867 581708610 586184442
2973.8 586184442 590508342 594701290 598793983 602685869 606288314 609559357 612471998 615095258
2990.1 615095258 617473364 619543552 621251225 622548103 623443246 624034107 624338925 624313772 623997092
3008.4F23997092n55277q45492j165270j414597j621664j856267k059341k178967k276122
3026.8F10024095k316416k349555k484381k663851k769947k720177k679408k827644
3043.1E89212716l043354l140330l081024l004253l026783l099919l183305l234327
3059.4E64399421l176749l071665l032208l130376l298283l326893l180325l011763
3075.7E39171159k988994l164112l293992l225564l167153l173828l214598l316641
3092.1E13626277l351628l250301l082872l050267l192008l240764l097773k983123
3108.4D88377541l080040l126323k975226k909839k963721l066183l216564l232926
3124.7D63806719l074944k952427k963245k999127k926081k779872k750337k895534
$$ plain form
3008.4 623997092 623441815 622596323 621431053 620016456 618394792 616538525 614479184 612300217 610024095
3026.8 610024095 607707679 605358124 602873743 600209892 597439945 594719768 592040360 589212716
3043.1 589212716 586169362 583029032 579948008 576943755 573916972 570817053 567633748 564399421
3059.4 564399421 561222672 558151007 555118799 551988423 548690140 545363247 542182922 539171159
3075.7 539171159 536182165 533018053 529724061 526498497 523331344 520157516 516942918 513626277
3092.1 513626277 510274649 507024348 503941476 500891209 497699201 494458437 491360664 488377541
3108.4 488377541 485297501 482171178 479195952 476286113 473322392 470256209 467039645 463806719
3124.7 463806719 460731775 457779348 454816103 451816976 448890895 446111023 443360686 440465152
3141D40465152k974093k893060k814531k696097k551228k606452k804637k862602k748668
3159.4D15513784k617389k544433k527505k514184k477169k462953k434820k341211
3175.7C95594120k273738k264530k286047k298742k239287k141565k091676k094656
3192C77903879k115965k123833k052188j959115j926839j911879j911730j918703j826227
3210.3C60157400j699566j701773j740426j709431j657337j620084j593828j562476
3226.7C46872479j508236j390547j299798j437038j622200j563281j389265j262486
3243C35399628j171530j188695j345813j407445j254231j107871j106232j139731j131802
3261.3C24546278j090765j030475r25601q08984q61198j002103j048445j056910j016140
$$ plain form
3141 440465152 437491059 434597999 431783468 429087371 426536143 423929691 421125054 418262452 415513784
3159.4 415513784 412896395 410351962 407824457 405310273 402833104 400370151 397935331 395594120
3175.7 395594120 393320382 391055852 388769805 386471063 384231776 382090211 379998535 377903879
3192 377903879 375787914 373664081 371611893 369652778 367725939 365814060 363902330 361983627 360157400
3210.3 360157400 358457834 356756061 355015635 353306204 351648867 350028783 348434955 346872479
3226.7 346872479 345364243 343973696 342673898 341236860 339614660 338051379 336662114 335399628
3243 335399628 334228098 333039403 331693590 330286145 329031914 327924043 326817811 325678080 324546278
3261.3 324546278 323455513 322425038 321499437 320690453 319829255 318827152 317778707 316721797 315705657
3279.7C15705657r27657q78781q64178q20577o92964o33746p66575r14306r86397r49621
3300.1C07270855p42287n26577n80162r09447j175106j134157r49294q87632q92192
3318.4B99474001q47995q03620p91311q80927r90599r56595q77887p83354o73205p56234
3338.8B91112274r41277r88870j009018r54032p29620p30157r97573j055271q67843
3357.2B82838613p42048p99507q20309o00129m93318p69526j097173j075208p94798
3375.5B75646597o33508o19232o61850o62357n15074k88814j10030k23428n83530o39677
3395.9B70709097k37882K4617k67983o42418n21958j91927r3788j90497l18229l25709
3416.3B67943323j58131k7627l9727K0862K00152L16501K67267K91497M19497K72602
$$ plain form
3279.7 315705657 314778000 313899219 313035041 312214464 311521500 310887754 310121179 309206873 308220476 307270855
3300.1 307270855 306528568 306001991 305421829 304512382 303337276 302203119 301253825 300366193 299474001
3318.4 299474001 298626006 297822386 297031075 296150148 295159549 294202954 293325067 292541713 291868508 291112274
3338.8 291112274 290170997 289182127 288173109 287219077 286489457 285759300 284761727 283706456 282838613
3357.2 282838613 282096565 281297058 280476749 279876620 279383302 278613776 277516603 276441395 275646597
3375.5 275646597 275013089 274393857 273732007 273069650 272554576 272265762 272155732 271932304 271348774 270709097
3395.9 270709097 270471215 270495832 270227849 269585431 269063473 268871546 268777758 268587261 268269032 267943323
3416.3 267943323 267785192 267757565 267717838 267738700 267938852 268255353 268522620 268814117 269233614 269506216
3436.7B69506216n2094q3000K12908M97341N21541L71962M06236N76913O52045P20591
3457.1B73330659P88867O80894O82086J029402J175850P87437L77536M56870P86930
3475.5B80096531J043886J032024P52837P27564R93848J022875R12279R92596J101852
3493.8B88676292J126080J081259J089900J139492J000732Q89093J057714J278490
3510.2B97339052J390070J301527J088023J066446J274675J517564J451284J177788
3526.5C07606429J160174J386703J599937J731426J650005J488418J677632J931250
3542.8C20231974J825959J525908J514972J733332J914353K086043K238035K353311
3559.1C35423887K361923K192348K110094K604842L134013L005027K794862K900839
$$ plain form
3436.7 269506216 269454122 269371122 269584030 270081371 270602912 270974874 271381110 271958023 272610068 273330659
3457.1 273330659 274119526 274800420 275482506 276511908 277687758 278475195 278852731 279309601 280096531
3475.5 280096531 281140417 282172441 282925278 283652842 284646690 285669565 286581844 287574440 288676292
3493.8 288676292 289802372 290883631 291973531 293113023 294113755 295002848 296060562 297339052
3510.2 297339052 298729122 300030649 301118672 302185118 303459793 304977357 306428641 307606429
3526.5 307606429 308766603 310153306 311753243 313484669 315134674 316623092 318300724 320231974
3542.8 320231974 322057933 323583841 325098813 326832145 328746498 330832541 333070576 335423887
3559.1 335423887 337785810 339978158 342088252 344693094 347827107 350832134 353626996 356527835
3575.4C56527835L133774L403664L618031L587693L383100L379464L730536L774375
3591.7C84538472L686785L910423M207015M243940M204422M136145L901452L899455
3608.1D16728109M150391M334271M509151M409283M332215M733532M694462M208386
3624.4D52099800L749073L894239M777372M792541M518092M389972M255980M274130
3640.7D86751199M283279M017979L701597M039020M770159M504681M031062M302502
3657E20401478M443407M012406L719449L680885L404915L106534L483177L426551L070951
3675.4E52749753L498733L588676L326834L237605L085494K784669K508641K615571
3691.7E77395976K799689K720595K460539K093971J950800K227962K314508J958132
$$ plain form
3575.4 356527835 359661609 363065273 366683304 370270997 373654097 377033561 380764097 384538472
3591.7 384538472 388225257 392135680 396342695 400586635 404791057 408927202 412828654 416728109
3608.1 416728109 420878500 425212771 429721922 434131205 438463420 443196952 447891414 452099800
3624.4 452099800 455848873 459743112 464520484 469313025 473831117 478221089 482477069 486751199
3640.7 486751199 491034478 495052457 498754054 502793074 507563233 512067914 516098976 520401478
3657 520401478 524844885 528857291 532576740 536257625 539662540 542769074 546252251 549678802 552749753
3675.4 552749753 556248486 559837162 563163996 566401601 569487095 572271764 574780405 577395976
3691.7 577395976 580195665 582916260 585376799 587470770 589421570 591649532 593964040 595922172
3708E95922172J490653J575052K192498K219438J885712J663208J598180J609444J685500
3726.4F11841857J808167J592338J203477J041532J399338J875580J657962Q12650
3742.7F23232901N61833J398921J193345O53148J375377J834512J358211J004457J276970
3761F33889675J409948J202464J038730R13203J056433J316964J274407J055539Q59857
3779.4F44017220Q27968P70986Q47816J115084J133561R84192Q46684P71999Q04723
3797.7F52120233N31613M59254J002014Q78811P85768J181960J141429O31690L81529
3816.1F59114301O91295N04672N32389R50277Q56519Q04782P76469P06733P73072N07772
3836.5F66218281J30176M27485Q73744J065135J035154P44283P2360o94751K24948
$$ plain form
3708 595922172 597412825 598987877 601180375 603399813 605285525 606948733 608546913 610156357 611841857
3726.4 611841857 613650024 615242362 616445839 617487371 618886709 620762289 622420251 623232901
3742.7 623232901 623794734 625193655 626387000 627040148 628415525 630250037 631608248 632612705 633889675
3761 633889675 635299623 636502087 637540817 638454020 639510453 640827417 642101824 643157363 644017220
3779.4 644017220 644845188 645616174 646463990 647579074 648712635 649696827 650543511 651315510 652120233
3797.7 652120233 652651846 653111100 654113114 654991925 655777693 656959653 658101082 658732772 659114301
3816.1 659114301 659805596 660310268 660842657 661792934 662649453 663454235 664230704 664937437 665710509 666218281
3836.5 666218281 666348457 666775942 667649686 668714821 669749975 670494258 670566618 669871867 670096815
3854.8F70096815J388609J157641O42598K82586M35114O16490K96951L43501O47724
3873.2F75908029P69913P12276L09527L55839O43552M91500N24103L99292J66893N21362
3893.6F80802286O97136L27646N8592O6161J72734N12481O96301N37277M27723L60190
3914F84658527J84715J80543L30984K74062J38879K29359L51310K60830K51531L82066
3934.4F87242806L76999K92480J68443J15454K42114K67268K42471L23713K80678J76192
3954.8F89728618J91033K60174K53081K29478K38299J92881TK52068K44617K17557
3975.2F92000687K07543J67490J77323K58983K83122K03311J16527J10269J40011J60992
3995.6F93826258J86861
$$ plain form
3854.8 670096815 671485424 672643065 673285663 673568249 674003363 674619853 674916804 675260305 675908029
3873.2 675908029 676677942 677390218 677699745 678055584 678699136 679190636 679714739 680114031 680280924 680802286
3893.6 680802286 681499422 681827068 681885660 681951821 682124555 682637036 683333337 683870614 684298337 684658527
3914 684658527 684843242 685023785 685354769 685628831 685767710 685997069 686348379 686609209 686860740 687242806
3934.4 687242806 687619805 687912285 688080728 688196182 688438296 688705564 688948035 689271748 689552426 689728618
3954.8 689728618 689919651 690179825 690432906 690662384 690900683 691093564 691286445 691538513 691783130 692000687
3975.2 692000687 692208230 692375720 692553043 692812026 693095148 693298459 693414986 693525255 693665266 693826258
3995.6 693826258 694013119
3997.6F94013119
$$ plain form
3997.6 694013119
##END=$$ End of the data block
