##TITLE=$$ Begin of the data block
##JCAMP-DX=5.00 $$ ACD/SpecManager v 10.08
##SPECTROMETER/DATA SYSTEM=16PC
##DATE=Thu Aug 15 12:55:22 2013
##DATA TYPE=INFRARED SPECTRUM
##DATA CLASS=XYDATA
##ORIGIN=
##OWNER=
##NPOINTS=3601
##FIRSTX=400.00000000
##LASTX=4000.00000000
##MAXX=4000.00000000
##MINX=400.00000000
##MAXY=35.16903305
##MINY=9.35510254
##XFACTOR=1.0000000000
##YFACTOR=0.000000100000000
##FIRSTY=17.43255043
##DELTAX=1.00000000
##XUNITS=1/CM
##YUNITS=TRANSMITTANCE
##XYDATA=(X++(Y..Y))
400 174325504 220481834 257867813 283705940 298860359 306493206 310051556 311787643 312471504
408 312471504 312092705 310768509 309126053 307973194 307658520 307720318 307140522 305029373 301247730
417 301247730 296551380 292204838 289366741 288643475 290013885 293040009 297125168 301640835 305934143
426 305934143 309349556 311364517 311791115 310883255 309222736 307415733 305785370 304267845 302582626
435 302582626 300552425 298344631 296460323 295480442 295744781 297180386 299386311 301901398 304464836
444 304464836 307095642 309953346 313094616 316310902 319166927 321221466 322281418 322518959 322373238
453 322373238 322298279 322520065 322953377 323320122 323378448 323107338 322729607 322571678 322862968 323606186
463 323606186 324588814 325506248 326104431 326257172 325959702 325281487 324332199 323259048 322246094 321475830
473 321475830 321049919 320917397 320871658 320641518 320036011 319057350 317911339 316905613 316293373 316148434
483 316148434 316330624 316547260 316467190 315833797 314539452 312644615 310348930 307923470 305626354
492 305626354 303630505 301994095 300687599 299660854 298906288 298476028 298443108 298834820 299591446 300580902
502 300580902 301662083 302752743 303858032 305046635 306399460 307966938 309757385 311745377 313876820
511 313876820 316059799 318155003 319991207 321417427 322370758 322919540 323246536 323575516 324075699
520 324075699 324793282 325640945 326445503 327027359 327280922 327229652 327038651 326976166 327324600 328265533
530 328265533 329782562 331635208 333429375 334766235 335399895 335328712 334777603 334090080 333593979 333506317
540 333506317 333904381 334744530 335890388 337132912 338214989 338889771 339015236 338645020 338054276 337655334
550 337655334 337826843 338737183 340259476 342031403 343628883 344758835 345368385 345619125 345755539
559 345755539 345953979 346235580 346483955 346539879 346307831 345812759 345182076 344573479 344096527 343768501
569 343768501 343524361 343266525 342924652 342495575 342044754 341672821 341465340 341451378 341593094 341811981
579 341811981 342039299 342262459 342538986 342965202 343617134 344495583 345512695 346529274 347423058 348143234
589 348143234 348719482 349220772 349698448 350153389 350550652 350863914 351108360 351327400 351540298 351690331
599 351690331 351645622 351266556 350503845 349462242 348378410 347516327 347040520 346941338 347056236 347169724
609 347169724 347128639 346910553 346614647 346397324 346392708 346657181 347149925 347744598 348265953 348546982 348497772
620 348497772 348160210 347711182 347389832 347367134 347623177 347911148 347853165 347133904 345694504 343813057
630 343813057 342016258 340859299 340685043 341487007 342939148 344566727 345959320 346916885 347466698
639 347466698 347764969 347958145 348086319 348080101 347836380 347315140 346586723 345801048 345100555 344540596
649 344540596 344074631 343613777 343113899 342617569 342215157 341953201 341772270 341543312 341197891 340855484
659 340855484 340824966 341428261 342725906 344325905 345444717 345244446 343284492 339823799 335770340
668 335770340 332278214 330206032 329737396 330366096 331227570 331563225 331050873 329850006 328399582
677 328399582 327139206 326326027 326015244 326143837 326613197 327307091 328064270 328672142 328922310 328704643
687 328704643 328067780 327194061 326294365 325491447 324761772 323962021 322905197 321427956 319415417 316796093
697 316796093 313544006 309707680 305445957 301025448 296753922 292871189 289458771 286424656 283573017
706 283573017 280714283 277747059 274666328 271498070 268203201 264596767 260310593 254807873 247452164
715 247452164 237635155 224961338 209452267 191694851 172842979 154422894 137978897 124683695
723 124683695 115067062 108971033 105731859 104489374 104484100 105238371 106597395 108680611 111807861
732 111807861 116437216 123102226 132314405 144419146 159436712 176956940 196148911 215902119
740 215902119 235057182 252641239 268029060 280986519 291604671 300173855 307054615 312587185
748 312587185 317051392 320665054 323598671 325988731 327942505 329539223 330834198 331867332 332673035
757 332673035 333286934 333744087 334073677 334295731 334424591 334476585 334473724 334435959 334363251 334218864 333928986
768 333928986 333407440 332596664 331504669 330213280 328851738 327543297 326355362 325277596 324235878
777 324235878 323132324 321885986 320454674 318831635 317024364 315029831 312813549 310298042 307365856
786 307365856 303887100 299780293 295101795 290129776 285390053 281577568 279369125 279184856 281002827
795 281002827 284323006 288317776 292112675 295072498 296964664 297936497 298342419 298529263 298694286
804 298694286 298872070 299019222 299115658 299205589 299359226 299598770 299855328 299997330 299915276 299602737 299176712
815 299176712 298820992 298686829 298812065 299104824 299393406 299507008 299338341 298860912 298106632 297130165
825 297130165 295985565 294722347 293388653 292027988 290663204 289278755 287816410 286192169 284330177
834 284330177 282197380 279824200 277304764 274776707 272388649 270264378 268471088 267003136 265790100
843 265790100 264731483 263748455 262828121 262036266 261486340 261277523 261435299 261889820 262505322 263142853
853 263142853 263716030 264203091 264609451 264906654 264991779 264695988 263834629 262259312 259871864 256588249
863 256588249 252285385 246789341 239945374 231759205 222541656 212969151 203998318 196648102 191730022
872 191730022 189638233 190283985 193189087 197682800 203108845 208963680 214932632 220845432 226599197
881 226599197 232097301 237227402 241872997 245941410 249385262 252208767 254458179 256203632 257522602
890 257522602 258491402 259187279 259697132 260124969 260589008 261207848 262080860 263276253 264835186 266790237
900 266790237 269185944 272082806 275538006 279569530 284123535 289066830 294210281 299353447 304327545
909 304327545 309018307 313362808 317330685 320905075 324073753 326832314 329189453 331169090 332805901
918 332805901 334138985 335208588 336056900 336729355 337273636 337734451 338147202 338534279 338904915 339257431
928 339257431 339581184 339859657 340074615 340213318 340276184 340277901 340238991 340172195 340070915 339911919 339671707
939 339671707 339348869 338975830 338610458 338309250 338097725 337954865 337820702 337619476 337283630 336766930
949 336766930 336043663 335105057 333959999 332640839 331203651 329713097 328211708 326689606 325075035
958 325075035 323258362 321138191 318665924 315860119 312784176 309503345 306054840 302453613 298736687
967 298736687 295018578 291521263 288552284 286433392 285407124 285562325 286809196 288911819 291563091
976 291563091 294467525 297402496 300236664 302907143 305374508 307581997 309443130 310865440 311797371
985 311797371 312271309 312416420 312428665 312507610 312787380 313291492 313928032 314525337 314889698 314864674 314371948
996 314371948 313425484 312113018 310551071 308824902 306933670 304766273 302117538 298737545 294382267
1005 294382267 288831139 281861000 273204765 262552872 249646034 234457302 217389011 199373569
1013 199373569 181784134 166149883 153772659 145404215 141124773 140462847 142678938 147059212
1021 147059212 153080082 160390778 168670692 177482471 186225414 194222031 200883045 205858059 209094143
1030 209094143 210787945 211272926 210905647 209996700 208791313 207477493 206194801 205036030 204050961
1039 204050961 203265247 202713490 202470741 202661858 203438931 204937725 207236328 210335693 214167671
1048 214167671 218620644 223564548 228864479 234380913 239964867 245454521 250679016 255467052 259660740
1057 259660740 263131046 265795193 267626629 268654766 268946400 268575611 267594452 266018810 263835106
1066 263835106 261020088 257556896 253434372 248629799 243091965 236744633 229519081 221404781 212492733
1075 212492733 202985306 193165588 183338604 173772697 164665241 156139994 148267660 141090412 134635105
1084 134635105 128911705 123904209 119564457 115816889 112573719 109754505 107301416 105183554 103389864
1093 103389864 101913652 100737162 99824553 99126968 98596382 98199530 97922697 97763062 97712765 97746229
1103 97746229 97821302 97892923 97931471 97931576 97905350 97864923 97806826 97709999 97549400 97315340 97024136 96713505
1115 96713505 96425543 96189308 96015434 95903025 95852394 95872288 95976295 96173124 96457996 96815481
1125 96815481 97229576 97695398 98223963 98835955 99552956 100393181 101377325 102542591 103954048 105704880
1135 105704880 107901869 110641890 113991404 117978134 122597818 127830715 133656082 140057821 147017136
1144 147017136 154499407 162442913 170756493 179326839 188029385 196737080 205322475 213656158 221608524
1153 221608524 229059181 235913601 242117958 247663803 252575302 256883926 260600224 263695793 266102848
1162 266102848 267730217 268490067 268325882 267237453 265299225 262670326 259593277 256377163 253366013
1171 253366013 250895405 249249191 248627033 249128342 250753212 253413067 256944981 261126575 265694942
1180 265694942 270371399 274894276 279051800 282705803 285796642 288327618 290335464 291858921 292919235
1189 292919235 293517914 293649063 293318729 292557125 291420822 289981976 288313999 286480560 284533005
1198 284533005 282514172 280463085 278413124 276384201 274372959 272349567 270266171 268075371 265749435
1207 265749435 263290672 260725040 258083172 255376415 252581215 249637737 246463776 242976513 239113998
1216 239113998 234848862 230191574 225184708 219888763 214365215 208656616 202770157 196668587 190274391
1225 190274391 183490524 176235142 168482418 160295582 151840868 143373203 135197048 127612190 120861454
1234 120861454 115095015 110358648 106605682 103724089 101568060 99985666 98838739 98011665 97413349
1243 97413349 96972380 96630564 96338568 96056690 95760612 95448103 95139656 94870071 94672070 94560213
1253 94560213 94524240 94535923 94566345 94600706 94643679 94709215 94803343 94910698 94993258 95004358 94908695 94699383
1265 94699383 94403772 94077511 93788786 93600025 93551025 93646765 93854208 94109850 94338503 94478111
1275 94478111 94501200 94424410 94300365 94196491 94169798 94248810 94429007 94680605 94963036 95240498 95492725
1286 95492725 95721254 95948973 96213694 96557846 97017012 97613964 98361359 99272337 100371294 101696796
1296 101696796 103291502 105183954 107373476 109828701 112502937 115359316 118391924 121630249 125125837
1305 125125837 128927460 133057652 137500563 142205324 147100849 152115326 157192535 162300644 167431183
1314 167431183 172589703 177782574 183006744 188247414 193483391 198695679 203867893 208974075 213954411
1323 213954411 218690434 222994232 226618767 229287319 230730076 230715065 229068813 225691261 220573158
1332 220573158 213819904 205676537 196539879 186948414 177545471 169024200 162064972 157274323 155127525
1341 155127525 155914965 159695120 166265297 175164375 185719242 197133713 208604107 219435501
1349 219435501 229129333 237420959 244261360 249750137 254043255 257263622 259441452 260500965 260293941
1358 260293941 258665390 255527649 250919514 245034084 238211327 230898590 223591099 216765118 210820332
1367 210820332 206042557 202595215 200533867 199831810 200400658 202097931 204725933 208036079 211750183
1376 211750183 215597095 219349823 222843418 225965748 228632927 230772038 232328835 233297024 233744812
1385 233744812 233809185 233647118 233361931 232942371 232251968 231077538 229214725 226546726 223079739
1394 223079739 218920288 214210320 209054585 203474388 197407017 190749836 183429432 175470295 167039127
1403 167039127 158454733 150168152 142726746 136735439 132818003 131566839 133467674 138799696 147534742
1412 147534742 159278030 173289928 188600311 204185886 219153194 232865028 244976692 255386581
1420 255386581 264134884 271299801 276928101 281019573 283560753 284583797 284215851 282684555 280267525
1429 280267525 277204895 273624382 269530830 264879456 259699669 254194202 248744507 243805962 239744854
1438 239744854 236708336 234597073 233144131 232042465 231045609 230001907 228842506 227567062 226251297
1447 226251297 225054798 224184589 223800964 223912048 224343395 224836578 225243874 225698605 226632233 228593979
1457 228593979 231959915 236703434 242371502 248285694 253845119 258749943 263023701 266849155 270351505
1466 270351505 273480873 276067982 278000164 279389420 280612984 282194767 284591312 288000183 292286339
1475 292286339 297057381 301843147 306290703 310284653 313941383 317482719 321053467 324580345 327756233
1484 327756233 330174561 331552963 331923523 331667099 331345482 331401367 331883163 332352219 332037621 330164719
1494 330164719 326283073 320420494 312993221 304549084 295521564 286159286 276680069 267541847 259628143
1503 259628143 254175758 252414551 255069828 261982365 272060013 283610439 294900646 304675083
1511 304675083 312399921 318164234 322359238 325350685 327319107 328302155 328342209 327602425 326375046
1520 326375046 325006943 323818588 323070335 322959557 323598022 324947624 326765709 328645287 330187378
1529 330187378 331233940 332003746 333001251 334703941 337198906 340003204 342213631 342931137 341729774
1538 341729774 338903999 335360107 332219887 330355415 330085335 331146088 332900848 334652824 335920372
1547 335920372 336584015 336874886 337218170 337980385 339209633 340490227 341020889 339935799 336752892
1556 336752892 331726494 325887642 320697556 317446747 316689110 317999306 320179939 321811447 321862907
1565 321862907 320063438 316874542 313114510 309456615 306069317 302573490 298321915 292844238 286223907
1574 286223907 279213963 273033180 268938942 267779903 269727783 274288425 280551491 287530823 294435215
1583 294435215 300778790 306343517 311073189 314983273 318120613 320558701 322394142 323728485 324646072
1592 324646072 325204773 325444069 325396042 325087967 324537964 323761101 322789612 321692543 320563049 319465656
1602 319465656 318374767 317163067 315674706 313852329 311829681 309905720 308389950 307411861 306831646
1611 306831646 306335239 305668621 304859581 304264450 304389114 305581627 307786865 310517635 313060989
1620 313060989 314796696 315451164 315165329 314377632 313615704 313309269 313683090 314724636 316192188
1629 316192188 317652512 318565598 318439064 317030163 314514503 311520157 308958664 307686825 308128891
1638 308128891 310042343 312569141 314588547 315232525 314315624 312440281 310683002 309990788 310599613
1647 310599613 311814709 312321186 310895710 307139397 301801987 296479397 292824516 291704483 292779694
1656 292779694 294736118 296016617 295614586 293481445 290359421 287208080 284613762 282533646 280473156
1665 280473156 277910423 274655590 270921669 267110996 263510246 260125313 256755314 253222961 249571285
1674 249571285 246074085 243051128 240618801 238554249 236372261 233577557 229943676 225657749 221251698
1683 221251698 217361813 214447308 212607250 211569252 210830460 209861012 208268929 205864086 202624683
1692 202624683 198613167 193903313 188552361 182616501 176181087 169375172 162356682 155278797 148260422
1701 148260422 141379271 134691706 128265629 122204666 116647072 111736736 107579880 104209824 101579304
1710 101579304 99585714 98114834 97077723 96418476 96089983 96016989 96078320 96128750 96054296 95827036
1720 95827036 95520020 95264540 95169439 95250559 95416784 95524769 95471268 95267057 95045443 94998713 95279293
1731 95279293 95923367 96840210 97871933 98891382 99886522 100994158 102471390 104626236 107738810
1740 107738810 112004919 117512598 124248323 132118034 140968304 150602102 160791378 171290436
1748 171290436 181853561 192254314 202301369 211845951 220783939 229052448 236626244 243511086
1756 243511086 249734917 255339565 260380096 264936581 269129982 273121643 277074776 281078510 285068493
1765 285068493 288801403 291925049 294136715 295356331 295817223 296006927 296474800 297602539 299458904
1774 299458904 301810856 304270058 306479511 308239880 309531555 310460091 311190853 311912289 312815514
1783 312815514 314052143 315653725 317455807 319100494 320162735 320361977 319744129 318710251 317850323
1792 317850323 317659340 318293056 319503593 320789146 321667786 321918449 321663322 321265945 321120872 321457100
1802 321457100 322250519 323268700 324202652 324809494 325000572 324848213 324522476 324200325 323993645 323927498
1812 323927498 323970375 324089317 324287491 324598618 325045547 325599518 326177673 326686783 327078705 327372742
1822 327372742 327619553 327835808 327966576 327918701 327650452 327250366 326934090 326943779 327412796 328292961
1832 328292961 329402046 330561752 331721153 332966042 334398651 335974884 337430573 338374786 338508911
1841 338508911 337834549 336709366 335701714 335324783 335804291 337008400 338563385 340067749 341275482
1850 341275482 342154160 342816887 343396416 343950996 344450226 344833412 345087585 345291176 345592957 346135101
1860 346135101 346959724 347948875 348838425 349315376 349161911 348379631 347223015 346110764 345449181 345454903
1870 345454903 346069603 347012215 347931061 348567085 348839760 348823242 348653336 348438911 348230438 348046379
1880 348046379 347910728 347857552 347896385 347974815 347982788 347809753 347419930 346888161 346365395 345991554 345815125
1891 345815125 345772247 345737648 345607605 345357513 345040207 344736366 344500656 344341850 344240417 344178047
1901 344178047 344147224 344132500 344088554 343944397 343643837 343197517 342702179 342303162 342112579 342134132 342245712
1912 342245712 342256737 342009430 341462898 340711861 339930115 339278030 338827820 338546104 338335609 338100853
1922 338100853 337797508 337439842 337072182 336727562 336402664 336059952 335651245 335146942 334553719 333913727
1932 333913727 333286362 332721596 332234306 331791763 331319275 330726089 329944267 328962860 327841492 326693954
1942 326693954 325645905 324787369 324142952 323674202 323311844 322997437 322711258 322471581 322309380 322235985
1952 322235985 322225800 322224998 322180862 322074280 321936417 321839333 321865768 322074776 322478333 323041840 323703842
1963 323703842 324404602 325108147 325808792 326520309 327256317 328013840 328767738 329479866 330114250 330651817
1973 330651817 331093025 331452026 331745148 331983528 332175293 332333832 332486267 332672119 332929268 333273430
1983 333273430 333682480 334096107 334434662 334630318 334656982 334544868 334371605 334235077 334218140 334361534
1993 334361534 334654732 335046616 335469666 335865974 336204262 336482697 336718979 336934738 337142258 337340202
2003 337340202 337518158 337667542 337791710 337908440 338042526 338212013 338413963 338620186 338786125 338871727
2013 338871727 338863907 338787575 338697853 338654861 338694496 338810806 338961067 339091187 339165573 339185143 339183311 339201584
2025 339201584 339264183 339364166 339470062 339546890 339575920 339562874 339529495 339498367 339479408 339466820 339445610 339400444
2037 339400444 339323425 339215927 339087982 338955345 338836288 338745880 338689804 338660049 338636971 338597717 338526726
2048 338526726 338422737 338295479 338157501 338014717 337864647 337701950 337525063 337337990 337143593 336935959
2058 336935959 336699028 336417503 336091805 335747185 335425835 335164795 334972496 334821358 334663506 334459763
2068 334459763 334204254 333927040 333673096 333471870 333317871 333175659 333003540 332780228 332515869 332242012
2078 332242012 331988258 331763840 331554985 331338539 331100197 330844498 330590248 330356598 330150414 329963303
2088 329963303 329778824 329583473 329373741 329155617 328938942 328732681 328543205 328376579 328239670 328138313
2098 328138313 328072815 328034286 328006287 327970810 327916336 327842674 327759514 327679787 327611809 327555084 327501297 327440376
2110 327440376 327366028 327280922 327196274 327129707 327099495 327119179 327193222 327313232 327458611 327601204 327711906
2121 327711906 327770004 327769127 327718544 327639046 327554970 327486115 327443199 327426949 327431908 327450447 327476768 327508545
2133 327508545 327546883 327594223 327653236 327723961 327803192 327884445 327958527 328015785 328049431 328057632 328044777 328020592
2145 328020592 327997437 327987099 327997284 328031197 328087845 328163223 328252907 328351440 328453064 328551903 328643456 328727989
2157 328727989 328812408 328910522 329037437 329202576 329402771 329620209 329827690 329999275 330120087 330192680
2167 330192680 330234528 330270271 330322456 330404243 330516205 330647926 330781631 330897102 330977898 331017723 331024323
2178 331024323 331018295 331024017 331058426 331118851 331182098 331214790 331189804 331102867 330976028 330846939 330749207 330694656
2190 330694656 330667419 330633850 330560913 330433617 330262146 330075150 329906006 329777946 329695969 329647408 329608421
2201 329608421 329553947 329465866 329338799 329181366 329013214 328859024 328739586 328664894 328631363 328624687 328626175
2212 328626175 328619881 328596535 328552895 328490982 328415375 328334122 328257217 328193893 328146591 328106346 328053665 327967606
2224 327967606 327838211 327676659 327512550 327379684 327296410 327251968 327210045 327127304 326978035 326770058 326541672
2235 326541672 326341972 326204987 326132812 326096344 326052208 325965652 325826454 325651245 325471954 325319214 325208588
2246 325208588 325136871 325088120 325045319 325000343 324956398 324922714 324903603 324890175 324859924 324786606 324655571 324476089
2258 324476089 324282799 324123116 324038277 324044800 324127922 324247894 324355736 324411049 324393578 324306412 324170647
2269 324170647 324013939 323857841 323706818 323545532 323347511 323093376 322790642 322482529 322238235 322125397
2279 322125397 322179413 322384872 322682152 322992935 323251038 323421478 323500481 323504143 323456421 323384590 323321228
2290 323321228 323302956 323360100 323502731 323712311 323949471 324174805 324370117 324546661 324735527 324968414
2300 324968414 325262070 325615425 326014099 326434593 326841087 327182541 327400284 327452850 327348404 327160645
2310 327160645 327013168 327026405 327253036 327635727 328011475 328167534 327925339 327218590 326130676 324875946
2320 324875946 323726463 322907181 322501984 322410851 322388229 322155228 321538544 320562668 319441757 318466053
2330 318466053 317846775 317607098 317583408 317526264 317223511 316558361 315471478 313883400 311679173 308819027
2340 308819027 305534534 302469482 300615501 300995312 304206562 310057602 317507286 324975471 330890923
2349 330890923 334218826 334728241 332910233 329639664 325782776 321937180 318377151 315151596 312221794
2358 312221794 309546490 307096024 304831924 302703094 300671673 298748798 297003841 295534668 294416962
2367 294416962 293667412 293244190 293079662 293121185 293353634 293795071 294474678 295410099 296596260 298004189
2377 298004189 299585590 301276932 303003788 304688854 306262951 307675171 308897781 309923668 310760365
2386 310760365 311425037 311943073 312346401 312668858 312937737 313166199 313353691 313495369 313596401 313679905
2396 313679905 313782406 313937092 314154644 314413948 314669056 314869595 314983406 315009651 314976826 314928360
2406 314928360 314903431 314924183 314991493 315091190 315203819 315313721 315413227 315502148 315584888 315666428 315750790
2417 315750790 315841408 315941849 316055927 316185589 316327915 316473503 316607990 316717491 316796112 316850567
2427 316850567 316899452 316965847 317066803 317204056 317361946 317514076 317634640 317710209 317744617 317754955 317760468
2438 317760468 317771111 317781868 317775955 317735806 317654552 317542324 317423134 317324486 317265148 317248020 317260628 317281971
2450 317281971 317291946 317277069 317231159 317152710 317041874 316899834 316731091 316546364 316362476 316199169 316071949
2461 316071949 315986595 315936565 315905495 315873451 315823498 315746078 315638866 315504627 315347710 315171986 314981384
2472 314981384 314780617 314576836 314378796 314195652 314034691 313899918 313790798 313701820 313621979 313536568
2482 313536568 313430614 313293877 313126011 312937508 312745285 312564945 312402477 312253036 312106018 311955051
2492 311955051 311805115 311671333 311568470 311499004 311446400 311381416 311277771 311128483 310952110 310783920
2502 310783920 310656052 310578518 310532761 310480556 310384712 310228462 310023651 309803982 309607887 309461651 309369736
2513 309369736 309317493 309281273 309239597 309179802 309098167 308995152 308870583 308721714 308544807 308339748 308113098
2524 308113098 307879333 307658215 307469845 307329330 307242661 307205276 307204227 307223034 307247829 307272701 307301121
2535 307301121 307343903 307411041 307504959 307615108 307719383 307791862 307813015 307777557 307696018 307589550 307481136
2546 307481136 307388382 307319946 307276592 307253838 307243652 307235050 307214165 307167053 307083817 306962738 306811161 306642628
2558 306642628 306470947 306306076 306153641 306017990 305905228 305823212 305777836 305767403 305781040 305801640 305813351
2569 305813351 305807781 305785446 305750675 305704117 305639000 305543442 305409527 305241184 305057278 304886189 304754944
2580 304754944 304679165 304660492 304691010 304761982 304871006 305021935 305218773 305457516 305721035 305980873 306204243
2591 306204243 306363506 306442242 306438961 306367340 306254005 306135750 306052227 306035118 306096020 306218796 306362972
2602 306362972 306478806 306528378 306501751 306418381 306312313 306210480 306117496 306017036 305889206 305731010 305566292
2613 305566292 305436668 305378590 305401516 305480156 305566769 305613995 305594769 305508881 305374889 305216389 305053253
2624 305053253 304901600 304778824 304704857 304696426 304756565 304868298 304998741 305113487 305192604 305238247 305269585
2635 305269585 305309334 305370884 305454884 305553856 305661850 305778389 305905457 306040230 306170025 306274605 306334972
2646 306334972 306341820 306299305 306221027 306122932 306018372 305918407 305834370 305780125 305768127 305802727 305875168 305963745
2658 305963745 306042633 306091785 306105270 306091366 306066799 306049519 306052475 306082134 306137943 306212158 306289234 306348190
2670 306348190 306368999 306341858 306274529 306191139 306122379 306090393 306098404 306129990 306159878 306168137 306149521 306112881
2682 306112881 306072311 306037807 306011467 305991440 305977802 305975666 305992680 306032352 306090260 306155071 306214581 306260548
2694 306260548 306289444 306298599 306282139 306231117 306139030 306009216 305857697 305709591 305589981 305515022 305488014
2705 305488014 305501881 305544930 305603867 305663872 305706825 305710697 305653934 305523624 305322781 305072422 304807053
2716 304807053 304563961 304371777 304242611 304169559 304130535 304096413 304040222 303944302 303804302 303628445 303433189
2727 303433189 303238697 303063393 302920933 302817726 302751141 302708950 302671013 302614288 302520275 302382259 302208729
2738 302208729 302020855 301845207 301705093 301614571 301575928 301581573 301616020 301659260 301689777 301689548 301649399 301572227
2750 301572227 301470947 301362247 301257763 301159935 301064091 300966587 300872250 300795078 300750523 300743923 300763435
2761 300763435 300783138 300775318 300725956 300643024 300553761 300491409 300479851 300523167 300605049 300696507 300767307 300795612
2773 300795612 300772266 300699635 300586014 300439968 300265465 300061989 299828663 299571323 299308033 299068565
2783 299068565 298886890 298787174 298771877 298817291 298881111 298918495 298899918 298820400 298697281 298557224 298421516
2794 298421516 298297119 298179092 298059807 297939053 297827148 297738304 297679901 297644596 297613068 297565002 297492542
2805 297492542 297406845 297332153 297291431 297291889 297321663 297358208 297384052 297397099 297409763 297435150 297472095 297498779
2817 297498779 297480927 297390118 297220001 296991711 296743774 296515560 296332359 296199703 296106586 296032009 295949860
2828 295949860 295832405 295654659 295402870 295083656 294726810 294376659 294073772 293834839 293644371 293463192
2838 293463192 293249645 292980118 292657204 292300701 291929016 291544685 291132202 290669727 290144863 289563980
2848 289563980 288949471 288329277 287726250 287154865 286625271 286148968 285739307 285404720 285138798 284915104
2858 284915104 284691868 284426174 284091587 283689060 283245983 282803555 282397556 282042713 281727638 281422291
2868 281422291 281094456 280726051 280320873 279899635 279484196 279081554 278675709 278234615 277727585 277144165
2878 277144165 276501980 275840302 275201569 274614410 274086685 273613110 273190289 272828293 272549019 272374554
2888 272374554 272311687 272344894 272442684 272572060 272711811 272855415 273002357 273146248 273266945 273335056 273324261
2899 273324261 273224640 273048820 272829571 272612534 272449894 272397289 272510414 272835979 273396072 274170723
2909 274170723 275091534 276053696 276946583 277690678 278262539 278695030 279052258 279392395 279738407 280070858
2919 280070858 280344334 280514584 280560760 280489712 280324097 280082855 279769402 279372673 278878937 278284492
2929 278284492 277599430 276840248 276015511 275114498 274105263 272943554 271586876 270007019 268196259
2938 268196259 266165981 263941612 261556892 259049530 256458206 253819714 251166782 248526764 245923367
2947 245923367 243379631 240922127 238581753 236391487 234380608 232568188 230960331 229551353 228330288
2956 228330288 227288017 226423016 225741749 225254230 224966984 224877605 224974327 225241585 225668468 226256428
2966 226256428 227020206 227980537 229151421 230527458 232077198 233746834 235472240 237194958 238875446
2975 238875446 240498772 242071323 243611488 245137920 246659470 248169918 249648380 251064053 252385521
2984 252385521 253589211 254667282 255629330 256499348 257307339 258080482 258836040 259580021 260310402 261023197
2994 261023197 261717796 262397709 263068333 263732319 264387150 265026073 265642605 266236095 266813736 267388325
3004 267388325 267971058 268564816 269162045 269749298 270317936 270874233 271443329 272063675 272772541 273590069
3014 273590069 274508686 275493813 276494808 277461185 278356800 279165611 279889145 280538158 281123905 281654606
3024 281654606 282135010 282570133 282966995 283333778 283676605 283995419 284282894 284526691 284714508 284838867
3034 284838867 284900017 284904385 284859753 284768238 284620285 284392090 284047108 283543243 282844582 281934338 280825787
3045 280825787 279566307 278232098 276915417 275706100 274676857 273873959 273316841 273002453 272910690
3054 272910690 273006477 273239269 273543663 273845367 274075451 274187107 274169674 274051361 273888035 273742905
3064 273742905 273664341 273673611 273764420 273913479 274094009 274284592 274469814 274636002 274767494 274849205 274874821
3075 274874821 274855328 274821625 274816704 274882050 275044117 275309010 275666847 276101170 276595421 277132397 277688255
3086 277688255 278228111 278709106 279091320 279350853 279485798 279511127 279445686 279301472 279081593 278788967
3096 278788967 278438377 278062286 277706146 277415943 277226410 277157154 277216396 277406425 277724571 278158474
3106 278158474 278682022 279257107 279845695 280423489 280986614 281544456 282101879 282642918 283127193 283503742
3116 283503742 283733997 283810406 283760128 283632679 283480816 283345222 283250294 283207932 283223553 283298550 283428440
3127 283428440 283602486 283806210 284028511 284266415 284523907 284804325 285101471 285396423 285664234 285886288
3137 285886288 286061497 286207600 286352100 286517467 286708565 286910534 287097893 287248611 287356453 287434711
3147 287434711 287509747 287607803 287742863 287909279 288084068 288235264 288334541 288366528 288333092 288251038 288145275
3158 288145275 288039837 287952213 287890778 287856426 287846470 287858200 287889786 287939129 288000450 288062382 288109474 288128071
3170 288128071 288113918 288076744 288039455 288029003 288063030 288139992 288236446 288316364 288345966 288307629 288206196 288064823
3182 288064823 287915287 287786884 287700310 287666016 287684765 287748089 287838802 287932720 288005524 288040600 288035564 288001633
3194 288001633 287954865 287904625 287847118 287768707 287657833 287517586 287370319 287249413 287183666 287181854 287229080
3205 287229080 287293968 287343655 287355900 287322292 287243881 287124538 286969414 286789322 286607513 286459255 286381550
3216 286381550 286394997 286487865 286612663 286699791 286684132 286532288 286257973 285917683 285588722 285339870 285207005
3227 285207005 285183926 285229836 285290108 285319920 285301075 285245838 285187187 285161018 285187550 285261574 285354538 285427437
3239 285427437 285448475 285405636 285311451 285195713 285093803 285034599 285033226 285089855 285191154 285311871 285417995
3250 285417995 285471725 285440578 285309563 285089893 284819679 284552727 284340057 284213142 284176216 284211254 284290600
3261 284290600 284388237 284483604 284557819 284588966 284552956 284433174 284231930 283977127 283715343 283494740 283346119
3272 283346119 283272705 283254280 283262062 283274632 283285427 283299103 283321228 283349133 283370171 283367481 283328876 283252048
3284 283252048 283144855 283020020 282888794 282756481 282621727 282478199 282318974 282141457 281952515 281770382
3294 281770382 281621857 281533794 281521797 281581841 281689987 281810684 281910973 281971550 281990223 281977062 281944752
3305 281944752 281902695 281856461 281811695 281776237 281757469 281756382 281762180 281755066 281715965 281639347 281538506 281440163
3317 281440163 281368752 281329536 281301384 281243382 281113453 280888710 280577412 280217247 279861450 279560051 279344769
3328 279344769 279222450 279179039 279189606 279229107 279280548 279335365 279390182 279440708 279478703 279494934 279486027 279461727 279446030
3341 279446030 279469128 279552612 279696426 279875202 280048046 280178318 280251846 280284214 280312214 280375080 280495224
3352 280495224 280669422 280872917 281072464 281239262 281355972 281417141 281425838 281391754 281330948 281265316 281217594
3363 281217594 281202755 281220665 281254425 281277943 281270142 281226578 281163025 281107388 281084614 281102734 281146545 281182499
3375 281182499 281172028 281086731 280920181 280691681 280440788 280214462 280050812 279965515 279946251 279957943 279957218
3386 279957218 279909039 279799633 279639702 279458027 279290066 279165707 279100323 279089031 279104118 279097137 279008942
3397 279008942 278787251 278408184 277892227 277303963 276731834 276254559 275909195 275677719 275498390 275295925
3407 275295925 275014076 274633980 274171028 273654575 273105049 272521935 271887474 271182899 270405655 269577618
3417 269577618 268739185 267932816 267184162 266491318 265827579 265157299 264456825 263732128 263022518 262389755
3427 262389755 261896877 261588078 261477737 261553059 261786861 262150497 262621117 263179512 263802490 264456482
3437 264456482 265097561 265679436 266165600 266540928 266817913 267034302 267242413 267493076 267818813 268223400
3447 268223400 268682728 269156971 269609642 270023670 270406151 270780602 271171303 271589355 272028313 272470055
3457 272470055 272895927 273294697 273663254 274001942 274308014 274573441 274787807 274943008 275038357 275083485
3467 275083485 275099220 275115395 275164242 275268860 275429592 275616035 275772572 275840397 275786514 275624866 275414562
3478 275414562 275233250 275139599 275145588 275216656 275297565 275347404 275360107 275358047 275365849 275385361 275392056 275355530
3490 275355530 275268345 275157852 275069122 275026798 275003853 274924049 274702206 274301643 273770714 273231411 272821960
3501 272821960 272624531 272621937 272709293 272753582 272665768 272443485 272161674 271922493 271796837 271792278 271861629
3512 271861629 271938839 271976395 271960983 271903000 271813393 271686230 271498032 271221848 270844345 270375614 269847775
3523 269847775 269306164 268799534 268369942 268044205 267825584 267690258 267593670 267490578 267361126 267229748
3533 267229748 267161026 267227077 267459373 267809887 268148613 268307934 268157692 267673721 266961040 266212730
3543 266212730 265622311 265294895 265205650 265230598 265228348 265124912 264950542 264810581 264816647 265027523 265436935
3554 265436935 266007385 266709290 267523785 268396912 269184093 269643898 269515247 268655052 267156563 265367393
3564 265367393 263777542 262825432 262723427 263393021 264534245 265778446 266837177 267578754 268022804
3573 268022804 268288364 268538818 268939152 269612103 270579910 271709385 272705517 273194561 272884693 271731014
3583 271731014 270006237 268217793 266898212 266374512 266639004 267386608 268185959 268683090 268730526 268393841
3593 268393841 267866249 267363186 267055721 267054482 267413578 268120823 269071827 270056305 270794296 271026173
3603 271026173 270621643 269650612 268374424 267157440 266337414 266107159 266446171 267119045 267740002 267895031
3613 267895031 267302094 265963631 264242802 262791328 262311993 263226051 265397663 268081532 270166817
3622 270166817 270638962 269045067 265721874 261659908 258067532 255860863 255335083 256159515 257651386
3631 257651386 259147358 260272236 261007214 261591396 262361794 263619747 265539188 268088245 270955677
3640 270955677 273534050 275038548 274783573 272522812 268668003 264223289 260415134 258186207 257814941
3649 257814941 258866062 260484467 261852665 262555046 262676029 262636909 262919159 263844509 265497475
3658 265497475 267760010 270376377 272998772 275230827 276710873 277237835 276869965 275908279 274736328
3667 274736328 273595581 272443600 271005917 269006481 266434975 263672791 261388607 260261879 260697422
3676 260697422 262684040 265842724 269589272 273292084 276358376 278269520 278640003 277333241 274588356
3685 274588356 271049404 267622662 265188141 264293823 264987793 266865444 269286823 271632309 273471222
3694 273471222 274601364 275007229 274817162 274293385 273821659 273831577 274626579 276186600 278070698 279521141
3704 279521141 279765072 278383331 275556011 272043667 268899670 267052402 266956348 268467827 270974178
3713 270974178 273680344 275902920 277248936 277645302 277258625 276383686 275354156 274490681 274067154
3722 274067154 274272690 275161247 276601963 278256855 279613914 280096779 279248276 276945724 273562584
3731 273562584 269967194 267294369 266524868 268035774 271352577 275274372 278364925 279589252 278763924
3740 278763924 276566391 274093838 272225323 271165123 270434132 269295979 267331638 264789295 262487049
3749 262487049 261338978 261812420 263656483 266055470 268090973 269217968 269479599 269371395 269480972
3758 269480972 270139656 271273613 272494850 273333206 273462639 272820683 271605568 270191860 269015121
3767 269015121 268451672 268707275 269738064 271239300 272732372 273735256 273951511 273385582 272323895
3776 272323895 271188297 270340328 269938507 269919128 270095062 270301723 270498619 270771198 271245728 271983471
3786 271983471 272931194 273957367 274941788 275844345 276693783 277500439 278160038 278436680 278061752 276899147
3796 276899147 275066929 272918530 270880032 269243164 268056946 267195911 266558170 266241684 266552029
3805 266552029 267810402 270079002 272996998 275858154 277902985 278653336 278087406 276562939 274562531
3814 274562531 272444267 270356388 268338966 266499214 265100422 264482059 264864559 266182804 268076973
3823 268076973 270057564 271741467 273008804 273986740 274878407 275756969 276456928 276633148 275950985
3832 275950985 274294281 271870842 269155045 266702709 264945374 264080181 264111652 265001373 266803131
3841 266803131 269657536 273606224 278318386 282922134 286114750 286590748 283629208 277547359 269752388
3850 269752388 262306900 257175350 255494080 257201538 261182957 265827351 269704800 272050266 272872086
3859 272872086 272708435 272215004 271810875 271536999 271149921 270358315 269056911 267437553 265931263
3868 265931263 265021782 265030308 265976582 267579823 269387054 270956707 272004108 272450256 272376060 271934719
3878 271934719 271283112 270559769 269889050 269376144 269073162 268940105 268847256 268644428 268273106 267852383
3888 267852383 267667828 268045387 269166317 270923157 272902584 274514503 275208035 274673939 272945557
3897 272945557 270369835 267478962 264828835 262864704 261845188 261824703 262680168 264162483 265960007
3906 265960007 267762108 269310589 270431499 271043892 271152630 270835075 270224667 269489155 268798008
3915 268798008 268281326 267996120 267919636 267978916 268104153 268271656 268505764 268835564 269234447 269590645
3925 269590645 269741096 269557762 269038067 268337040 267712936 267410011 267543163 268047791 268719521 269316006
3935 269316006 269660473 269697380 269483795 269137669 268777237 268479996 268266926 268109360 267951374 267741985
3945 267741985 267467136 267165451 266914101 266787262 266811466 266948414 267120857 267263107 267358723 267436066
3955 267436066 267526569 267624302 267684021 267661839 267562618 267448483 267394924 267428036 267498264 267516041 267422848 267235947
3967 267235947 267027836 266858349 266722355 266563854 266344204 266098785 265919743 265871754 265916996 265928192
3977 265928192 265794640 265531216 265281849 265192642 265257244 265282803 265037804 264473133 263808441 263361130
3987 263361130 263219490 263048820 262273293 260581074 258359375 256580696 255976925 255901165 253680420
3996 253680420 245152321 226416626 196007614 156257982
4000 156257982
##END=$$ End of the data block
