##TITLE=$$ Begin of the data block
##JCAMP-DX=5.00 $$ ACD/SpecManager v 10.08
##SPECTROMETER/DATA SYSTEM=16PC
##DATE=17 Jul 2013 16:24:06
##DATA TYPE=INFRARED SPECTRUM
##DATA CLASS=XYDATA
##ORIGIN=
##OWNER=
##NPOINTS=3601
##FIRSTX=400.00000000
##LASTX=4000.00000000
##MAXX=4000.00000000
##MINX=400.00000000
##MAXY=380.45974731
##MINY=15.04151726
##XFACTOR=1.0000000000
##YFACTOR=0.000001000000000
##FIRSTY=37.63835144
##DELTAX=1.00000000
##XUNITS=1/CM
##YUNITS=TRANSMITTANCE
##XYDATA=(X++(Y..Y))
400 37638351 26529453 65263153 112365082 180952362 304121887 380459747 266018829 121495316
408 121495316 83756920 80341866 88742111 95964119 69854691 45384598 54503918 74121399
416 74121399 76528122 107526871 259266449 365000000 212782043 30357121 15041517
423 15041517 46174118 58978603 83116867 137688873 189603943 214916748 205290985 118395157
431 118395157 32269478 30788231 54117630 67925545 79581139 87334183 84210510 50465321
439 50465321 22660088 42347622 74809143 103926613 115450623 73083473 26851820 19297861
447 19297861 36577175 91335747 146644287 167334656 160769196 104505562 52789688 73311516
455 73311516 103296684 89098068 71023605 76175453 90523674 111893631 131821396 139354187
463 139354187 139783722 133171875 124255135 118169258 113778091 111580917 111807037 116485641 120716164
472 120716164 119534607 115160248 106082962 98526886 100005699 105140282 112307068 117753006 114819290
481 114819290 110599350 111383743 112922241 112668465 111801216 110711952 109216263 106458687 104843422
490 104843422 108107994 111396767 109581757 107217453 107888268 109376144 110655426 111733124 112338425
499 112338425 112278938 110980751 109317566 107972214 106943321 106559326 106513260 106582855 106842346 107318970
509 107318970 107931374 108715057 109346695 109337021 109219383 109391357 109771034 110633347 111305046 111047867
519 111047867 110331535 109190460 108192253 108209824 108361557 107801773 107295464 107445786 107892464 108580276
529 108580276 109197136 109245682 109226318 109653542 109987785 109624649 109272957 109647514 110125877 110163185 110241508
540 110241508 110907600 111422272 110991882 110326477 109913872 109626862 109621353 109535744 108803680 108195259 108541252
551 108541252 109092972 109374237 109398270 108837891 108237862 108134171 108225754 108414413 108627388 108756943
561 108756943 108809517 108735725 108595276 108362556 108243866 108569405 108941673 109077263 108964134 108238266
571 108238266 107671974 108242485 108970978 108998726 108942314 109243347 109567665 109623909 109725166 110223434 110710449
582 110710449 110821770 110777878 110780861 110521317 109478447 108488533 108389664 108655571 109144165 109540726 109313293
593 109313293 108971237 108877708 108938980 109217453 109607956 110028885 110471680 111042305 111315491 110688377
603 110688377 109799316 109021996 108547188 108857468 109450958 110044121 110464523 110296776 109985924 109899567
613 109899567 109854675 109753319 109707565 109887718 110020851 109775711 109497429 109565231 109545395 108902000 108320808
624 108320808 108451202 108866074 109457565 109917236 109772232 109407898 108988998 108704445 108901810 109269882
634 109269882 109611153 109931847 110180618 110332367 110265038 110217903 110559486 110779785 110270187 109694885
644 109694885 109657265 109730957 109652283 109536385 109419319 109274574 109047600 108858559 108840485 108900093 108977722
655 108977722 109105492 109400078 109547874 109064674 108578896 108723640 109000656 109069038 109089828 109099075 109130859
666 109130859 109281036 109400200 109369446 109192825 108776688 108295151 107841705 107564255 107763954 108074493
676 108074493 108147575 108230354 108539650 108818054 108753990 108726738 109162308 109608795 109706902 109604836 109234001
687 109234001 108885452 108918091 109059525 109124161 109210274 109393547 109556053 109520485 109540680 110000992 110332512
698 110332512 109892845 109286713 108937599 108746643 108877922 108965942 108583878 108079529 107609749 107320549
708 107320549 107608246 107878517 107483147 106979965 106850052 106675385 106130646 105418633 104591820 103775787
718 103775787 103111862 102605225 102322746 102220604 102324699 102492615 102510574 102618622 103097893 103611397
728 103611397 103854774 104011322 104137444 104309364 104694649 105075600 105236145 105338951 105475403 105643082
738 105643082 105929398 106156250 106080627 105984520 106120850 106333755 106593826 106774643 106639267 106489731
748 106489731 106664085 106816956 106627632 106360123 106115959 106061623 106500168 107123138 107794334 108299683
758 108299683 108295105 108034134 107603958 107159447 106987427 106779289 106153130 105615356 105627914 105942108 106570435
769 106570435 107190849 107407448 107454086 107329369 107343056 108071396 108713295 108452965 107910660 107380600
779 107380600 107024910 107248451 107616997 107801483 107891037 107809425 107723618 107806320 107964035 108249207 108396362
790 108396362 108026909 107532547 107152649 106965538 107266327 107643959 107764717 107691574 107242706 106818413
800 106818413 106859543 107062531 107203651 107484146 108206558 108843086 108828255 108577393 108283516 108047958
810 108047958 108121826 108248566 108248589 108141991 107774117 107489540 107703522 108049393 108265755 108451843 108628677
821 108628677 108769371 108914185 108882477 108356667 107787628 107574585 107554718 107771225 108005402 107983017 107913567
832 107913567 107924171 107987686 108193398 108318779 108079720 107750130 107490707 107356926 107551476 107793167
842 107793167 107798477 107776978 107871460 107998611 108143326 108243706 108191849 108110573 108098724 108120247 108195946 108253983
854 108253983 108207062 108122017 108028221 107950592 107962296 107947945 107740616 107567787 107690170 107841011 107800575
865 107800575 107688263 107476135 107386322 107779434 108211731 108282753 108223320 108118843 108004929 107957672 107940742
876 107940742 107957245 107964874 107888817 107829544 107925179 107987640 107812286 107586739 107444000 107343033 107254532
887 107254532 107276199 107603668 107913658 107876801 107706734 107464241 107278397 107340004 107524391 107829712 108078308
898 108078308 108049316 107870384 107510849 107224510 107343246 107601929 107869431 108075569 108066559 107961823 107791687
909 107791687 107669571 107780815 107939888 108031677 108030029 107844208 107552742 107128021 106797455 106836578 107073257
920 107073257 107514404 107898376 107885620 107716705 107471634 107292435 107457710 107637787 107548927 107331894
930 107331894 106948853 106651520 106753754 107031227 107430290 107752632 107671974 107518478 107560272 107657005 107786797
941 107786797 107862236 107767990 107565544 107213684 106905151 106864426 106954857 107146835 107343414 107399750 107429626
952 107429626 107533356 107606270 107542969 107445618 107389900 107349800 107371353 107313774 106969139 106584694 106350945
963 106350945 106229805 106250977 106401566 106756065 107081863 107078674 107023834 107118416 107290932 107580307 107856270
974 107856270 107984352 108016083 107894943 107810471 108025528 108263542 108283257 108241272 108239868 108200691 108021164
985 108021164 107876297 107978149 108112694 108068275 108049515 108273003 108491112 108497925 108384659 108097839 107865234
996 107865234 107991982 108192299 108281471 108261345 107984756 107714035 107713867 107829857 108046646 108211563 108101990
1007 108101990 107912109 107761429 107651062 107651161 107674072 107618805 107595345 107732559 107872772 107853577 107818077
1018 107818077 107887505 107964874 107950874 107973480 108216187 108413002 108291580 108054420 107759499 107568024 107744576
1029 107744576 108036850 108279945 108476280 108570381 108570740 108410789 108259888 108320381 108426811 108488060 108483482
1040 108483482 108305046 108123489 108078094 108155060 108464478 108773895 108867027 108805252 108505035 108184814 108050987
1051 108050987 108055923 108307121 108545227 108481598 108311630 108100960 107950089 108052635 108194756 108177635 108149643
1062 108149643 108227844 108307144 108298203 108270645 108248589 108279182 108478828 108663818 108638855 108554741 108506630 108465881
1074 108465881 108463188 108415627 108183075 107967758 107980492 108055305 108096024 108103920 108009193 107928535 107979126 108089516
1086 108089516 108258011 108392288 108350632 108279343 108312965 108344742 108267113 108216949 108351494 108501884 108554169
1097 108554169 108500931 108201721 107941559 108043053 108252998 108441284 108561180 108468842 108325577 108261032
1107 108261032 108226204 108182571 108228180 108525803 108842590 108986969 108997871 108787300 108544083 108448502 108438232
1118 108438232 108568260 108666847 108478760 108309387 108471657 108687447 108771538 108758163 108565094 108356216
1128 108356216 108297943 108300232 108326576 108382721 108503700 108565117 108406372 108170937 107929848 107739426 107731033
1139 107731033 107750534 107654526 107542160 107471703 107422180 107417984 107381012 107183548 106998566 107015320 107057114
1150 107057114 106983612 106874634 106755043 106649277 106573509 106577179 106759430 106987190 107157822 107279037 107313683
1161 107313683 107293655 107242966 107147812 106956505 106806709 106862923 106992813 107119774 107240746 107310364 107379005
1172 107379005 107476929 107618782 107884666 108108208 108093620 108008934 107966782 107937599 107924934 107941864 108018898
1183 108018898 108106995 108166077 108199692 108201500 108160851 108018539 107913712 108027695 108174728 108186699 108191872
1194 108191872 108317947 108398247 108231781 108048912 108068916 108123901 108102318 108054329 107986473 107917976 107866310
1205 107866310 107843109 107886597 107934280 107904503 107892799 108009621 108128212 108129074 108100487 108094643 108100250 108153458
1217 108153458 108163879 107985519 107821274 107879494 107997704 108092545 108134628 108038139 107888916 107720329 107603813
1228 107603813 107644150 107774307 108031631 108207443 107987282 107725784 107752777 107828018 107806847 107732056 107547256
1239 107547256 107405304 107489372 107651970 107850388 107953186 107708069 107435013 107452393 107512688 107443520 107337761
1250 107337761 107213997 107122398 107153152 107204506 107220909 107153870 106866287 106568291 106473061 106434296 106351181
1261 106351181 106300400 106363464 106424736 106360390 106276276 106239151 106242416 106347176 106416847 106280563 106101868
1272 106101868 105987068 105936737 106013870 106137276 106248215 106342239 106408211 106407257 106240677 106076668 106100296
1283 106100296 106162216 106169533 106137611 106038857 105909203 105770584 105637405 105526733 105452301 105448746 105470230
1294 105470230 105507896 105485245 105238846 105020569 105104660 105260490 105334183 105369469 105346367 105301971 105272194
1305 105272194 105240509 105199387 105157448 105098534 105089470 105220291 105405113 105608292 105769058 105761337 105745079
1316 105745079 105888290 106040764 106091019 106090469 106045341 105979607 105929352 105864380 105757210 105635788 105500290
1327 105500290 105406311 105466484 105509468 105369492 105142136 104845383 104545952 104349731 104157234 103861687
1337 103861687 103590485 103465294 103396294 103336357 103278755 103193588 103103134 103031967 102942917 102778908 102624107
1348 102624107 102569099 102537277 102482056 102403763 102264473 102131958 102103546 102052307 101916840 101597687 100909019
1359 100909019 100048637 99158882 98220299 97184586 96280289 95757576 95503159 95643044 95709419 95268227
1369 95268227 94343994 92733025 90685867 88225937 85830757 83874939 82690552 82837982 84006645
1378 84006645 86302017 89035866 91531273 93859673 95773102 97552444 99479744 101303268 102912781
1387 102912781 104165573 104762314 105062462 105329750 105551834 105834435 106086922 106245827 106335403 106315041
1397 106315041 106315826 106522415 106733345 106771065 106748367 106701324 106682251 106784416 106920792 107055923 107128120
1408 107128120 107014229 106862900 106815956 106770660 106682396 106518265 106179687 105818893 105546402 105388565
1418 105388565 105484459 105606125 105535248 105381966 105201813 104940033 104540993 104062485 103562309 102984619
1428 102984619 102320000 101486923 100342300 99061295 97725060 96472450 95558998 94715881 93777298
1437 93777298 92689682 91254616 89740631 88412598 87082863 85594269 84120201 82785652 81578232
1446 81578232 80602524 79632355 78454185 77134369 75687218 74055313 71898102 70079208 69652893
1455 69652893 69706467 69649811 69569206 69321915 69004608 68559792 68306801 68635323 69276855 69970703 71083214
1466 71083214 72944328 75402237 78432106 81982758 86320900 90467834 93306541 95518517 97418900
1475 97418900 98989655 100319122 101403000 102233482 102909180 103548714 104084137 104469872 104757355 104967621
1485 104967621 105146172 105345963 105565521 105833099 106112289 106398102 106624458 106681152 106695389 106749390
1495 106749390 106867691 107161858 107452797 107557961 107599136 107699272 107672264 107280655 106801224 106372734
1505 106372734 106171608 106572983 107119202 107422043 107648041 107838654 107980652 108080956 108120247 108040283
1515 108040283 107964516 108072540 108137680 107899261 107638550 107592247 107633064 107690239 107830711 108158470 108491493
1526 108491493 108661125 108731171 108700104 108594894 108375359 108241394 108513023 108789680 108723236 108476425
1536 108476425 107991669 107581520 107644249 107864807 108033226 108232544 108494713 108762955 109004112 109179047
1546 109179047 109224915 109179398 109019302 108864357 108858849 108905647 109011055 109008835 108678223 108189102 107472824
1557 107472824 107024147 107578850 108344910 108670853 108870506 109051323 109180687 109271332 109294464 109178902
1567 109178902 109064316 109117340 109185623 109181190 109077545 108714462 108404991 108484955 108725716 109050819 109339233
1578 109339233 109377190 109366318 109469940 109588905 109674759 109738632 109777924 109785126 109743904 109678123 109595612 109527893
1590 109527893 109529640 109539200 109485863 109451317 109531662 109612679 109590698 109529922 109441826 109380623 109444237 109512779
1602 109512779 109474731 109402771 109320404 109263535 109295654 109357452 109425713 109455490 109367393 109241577 109119102
1613 109119102 109037636 109075356 109151527 109201355 109255028 109356209 109399292 109210945 109037872 109144897 109304283
1624 109304283 109339951 109361504 109432770 109514687 109602119 109656860 109645126 109548309 109275314 109009621 108934258
1635 108934258 108959175 109089203 109222458 109212326 109197662 109341904 109424637 109209702 108907486 108607269 108436157
1646 108436157 108680679 108951714 108912178 108692406 108147881 107765793 108191849 108805992 109170723 109383820
1656 109383820 109329414 109210655 109225128 109273651 109322906 109372757 109442093 109440208 109247780 108969521 108611893
1667 108611893 108350250 108425446 108647415 108964157 109202217 109048630 108869934 109038757 109223724 109147598
1677 109147598 109020493 109032036 108966400 108533813 108145668 108208824 108447098 108760788 109026978 109018753 108948227
1688 108948227 108989166 109029579 109031128 108946487 108627220 108338188 108404037 108496948 108307770 108104942 108065506
1699 108065506 108154320 108464005 108787941 108882713 108951355 109168198 109375832 109446640 109465309 109481880 109472366
1710 109472366 109448334 109353088 109075760 108790161 108617569 108604553 108925369 109317871 109555649 109705566
1720 109705566 109751007 109715744 109575958 109457657 109549072 109639503 109520554 109373497 109384369 109330460 108902191
1731 108902191 108545921 108741547 109078812 109303329 109427406 109304642 109156723 109202339 109304047 109414413
1741 109414413 109482071 109404373 109287498 109205650 109151886 109152580 109181900 109204819 109275223 109498878 109685135 109604767
1753 109604767 109479210 109485268 109527634 109597488 109612061 109408852 109217903 109271286 109400223 109519745 109610222
1764 109610222 109594368 109560226 109627724 109623787 109319710 109002258 108906433 108958694 109228516 109521820 109644386
1775 109644386 109665825 109550072 109419701 109406403 109446785 109545036 109629868 109592987 109549454 109616852 109679008
1786 109679008 109637047 109556625 109474327 109378525 109231445 109148193 109303879 109480377 109475945 109416222 109356712
1797 109356712 109305977 109293198 109311890 109365273 109453056 109600571 109733940 109777374 109761787 109664680 109570312
1808 109570312 109586075 109619949 109588264 109573265 109663795 109756393 109765221 109725998 109612915 109524773 109604645 109693863
1820 109693863 109656525 109567383 109434959 109321716 109323334 109348251 109295822 109288788 109478592 109678146 109716034
1831 109716034 109696365 109647034 109625198 109731888 109863258 109954193 109989380 109921814 109781311 109534096 109323929
1842 109323929 109320091 109412148 109581993 109721680 109666039 109568306 109543015 109541107 109541245 109574509 109700012 109812065
1854 109812065 109812569 109737587 109543350 109371208 109382225 109473465 109633041 109748886 109652733 109501030 109391975
1865 109391975 109331818 109389709 109475014 109505768 109525154 109540031 109577057 109703873 109804054 109748146 109642815
1876 109642815 109542938 109474274 109496994 109562469 109668037 109735870 109651901 109521866 109397003 109326576 109425331
1887 109425331 109547806 109562828 109541939 109508636 109475586 109465050 109471489 109492943 109540894 109657814 109748604 109706902
1899 109706902 109608818 109479118 109365173 109348175 109351250 109308243 109268021 109253906 109276268 109360649 109484573
1910 109484573 109672401 109809113 109744545 109608200 109448578 109358192 109528633 109711197 109665176 109557869
1920 109557869 109468201 109420158 109504463 109599564 109578445 109547974 109604454 109652374 109605263 109532066 109464737 109427788
1932 109427788 109475830 109550400 109614777 109658195 109643074 109612892 109611488 109599968 109534760 109473724 109470558 109493919
1944 109493919 109546684 109579895 109520699 109443451 109404846 109384964 109376694 109397980 109486343 109575890 109598083 109598419
1956 109598419 109610840 109601166 109515640 109446808 109501930 109583046 109609772 109636566 109698006 109773155 109872101 109936188
1968 109936188 109889885 109793755 109664894 109557816 109545494 109589455 109700897 109803749 109814308 109766434 109626312
1979 109626312 109512947 109591248 109689476 109650276 109595444 109616043 109646606 109656097 109632111 109525963 109415199
1990 109415199 109367058 109363678 109435295 109504745 109470345 109435677 109507462 109574486 109548950 109466934 109287666 109153702
2002 109153702 109257675 109408333 109467598 109468414 109351685 109255287 109357307 109477852 109470604 109412811 109309074
2013 109309074 109230896 109289169 109370277 109381790 109370758 109357521 109329506 109276176 109211632 109144737 109080574 109005592
2025 109005592 108984497 109125687 109284210 109346436 109326599 109139465 108969734 109026215 109151360 109260300 109343674
2036 109343674 109350563 109320786 109273933 109219551 109169098 109136124 109144302 109174469 109221573 109266830 109286568 109290024
2048 109290024 109264015 109251854 109321022 109385704 109370346 109311417 109191109 109096291 109140060 109225632 109295509 109344551
2060 109344551 109344505 109306953 109205933 109125732 109175255 109254433 109286522 109310364 109348938 109372711 109346962 109310173
2072 109310173 109305450 109283852 109180687 109086014 109095070 109127426 109116531 109115814 109167839 109238411 109317375 109374924
2084 109374924 109372711 109326241 109214401 109108521 109098938 109107399 109077240 109033966 108971809 108927628 108949348 108997917
2096 108997917 109056068 109106018 109122444 109110474 109048271 108991432 109000519 109038589 109097572 109151291 109165451 109156105
2108 109156105 109105751 109080742 109169533 109288216 109400345 109451958 109323456 109175011 109161804 109179115 109170341
2119 109170341 109146286 109087708 109027863 108998390 108984711 108969856 108992241 109131409 109246658 109174896 109062912
2130 109062912 109004639 108995224 109088875 109202003 109275414 109289810 109158493 109024330 109030273 109089447 109183289 109249641
2142 109249641 109187485 109094597 109033394 109008789 109069321 109146263 109178352 109191414 109189674 109176422 109153893 109129333
2154 109129333 109116409 109097763 109051796 109004715 108975342 108964180 108992691 109016655 108982063 108939507 108919907 108928223
2166 108928223 109006401 109074257 109043808 108980057 108913132 108859444 108862015 108870842 108827187 108800194 108868622 108944603
2178 108944603 108947495 108934303 108949806 108950111 108885811 108818336 108797905 108808517 108868118 108924889 108912582 108892059
2190 108892059 108910583 108942337 108988617 109015038 108963371 108906410 108923027 108936592 108874222 108803345 108776878 108765175
2202 108765175 108738037 108749893 108891106 109023308 108996078 108935928 108951996 108945679 108813980 108678963 108649063
2213 108649063 108662079 108685638 108738586 108860229 108956551 108920692 108830452 108709145 108613129 108622360 108689140 108819054
2225 108819054 108931946 108920761 108871460 108832214 108809303 108823418 108879112 109021301 109149384 109155014 109106255
2236 109106255 109027100 108941124 108881569 108843300 108844017 108848236 108826782 108778168 108665939 108565758 108544395 108591911
2248 108591911 108766006 108930511 108932518 108879707 108813499 108779808 108900238 108988998 108834694 108635757 108533096
2259 108533096 108487846 108539917 108593842 108532761 108460472 108455681 108476494 108517929 108547615 108519127 108469482 108409782
2271 108409782 108371399 108401939 108463692 108544922 108615067 108630898 108618614 108574532 108544754 108605476 108662506 108616425
2283 108616425 108558960 108570862 108585426 108548759 108503082 108488823 108457085 108350349 108234711 108149551 108117508
2294 108117508 108214142 108320091 108313011 108277466 108272858 108252312 108176758 108081795 108001877 107901360 107748009 107565811
2306 107565811 107341858 107154556 107082672 107112122 107326172 107511208 107410934 107236481 107147285 107042053
2316 107042053 106848236 106638618 106484314 106317711 106037994 105815697 105862831 105954002 105911064 105804207
2326 105804207 105594536 105431107 105501625 105650948 105797882 105908203 105900696 105834885 105695511 105625603 105836342
2337 105836342 106108070 106280663 106386467 106374809 106334641 106352951 106384705 106427338 106440277 106363724 106252625
2348 106252625 106174423 106031654 105761765 105327202 104527832 103788826 103546333 103567192 103879547 104135437
2358 104135437 103820755 103462074 103485367 103678085 104021713 104359840 104482719 104531693 104534935 104621910 104999611
2369 104999611 105463501 105857368 106243256 106667992 107020638 107140137 107223633 107449768 107712891 107967804
2379 107967804 108211731 108435532 108612778 108706047 108739014 108701797 108657600 108697197 108727600 108659698 108572479
2390 108572479 108512970 108487625 108529091 108605766 108721352 108802315 108735703 108643318 108632446 108633591 108604240 108570435
2402 108570435 108543251 108524796 108526611 108531311 108508133 108508728 108611961 108705185 108676384 108602188 108515190 108435486
2414 108435486 108406853 108390594 108356544 108322716 108292603 108279373 108310509 108346390 108341644 108341026 108389183 108440926
2426 108440926 108464333 108464050 108403679 108374260 108514046 108644722 108584305 108482002 108429596 108417221 108484650 108574699
2438 108574699 108635475 108690857 108756638 108805176 108810303 108783463 108706429 108641716 108672501 108718346 108711548 108696815
2450 108696815 108702873 108709717 108702065 108694313 108717873 108706306 108554054 108409622 108416222 108484100 108586716 108677292
2462 108677292 108676170 108655312 108676430 108690384 108659195 108610748 108556488 108507492 108474495 108469673 108527824 108591698
2474 108591698 108600403 108599640 108626007 108645676 108617546 108599754 108662506 108728600 108748604 108709259 108535309 108363083
2486 108363083 108335617 108357452 108368561 108405350 108515549 108605118 108562805 108487961 108451935 108427521 108409904 108403206
2498 108403206 108415222 108429932 108432457 108427002 108411194 108389832 108357811 108342285 108391525 108436966 108413765 108358910
2510 108358910 108278801 108200287 108149048 108134964 108200836 108273483 108286644 108262253 108172729 108100128 108151840 108224297
2522 108224297 108224251 108227821 108304092 108380722 108414650 108386971 108214874 108046814 108051201 108085152 108041527 107981415
2534 107981415 107916405 107887794 107960365 108075211 108237000 108319450 108117722 107871964 107785629 107763763 107790375
2545 107790375 107832001 107838058 107843849 107879517 107909988 107889839 107880020 107971718 108028580 107901550 107719948 107559654
2557 107559654 107431717 107382774 107381775 107424118 107476997 107512497 107511139 107419441 107311226 107238533 107212921 107291504
2569 107291504 107389542 107442375 107446838 107342697 107236168 107243202 107274246 107275917 107255600 107202408 107117485 106955864
2581 106955864 106844666 106962395 107109688 107122871 107073334 106959961 106836243 106762863 106716965 106711815 106699677
2592 106699677 106596634 106524345 106635620 106753014 106716774 106626579 106516602 106423378 106407257 106430984 106496574
2603 106496574 106546425 106499527 106428047 106377838 106346848 106357574 106381889 106411743 106409073 106305267 106183769 106095314
2615 106095314 106069160 106199669 106342194 106371185 106323715 106151939 105984833 105959007 106003616 106113289 106227798
2626 106227798 106277298 106285164 106246017 106176331 106083893 105989029 105908417 105860420 105882927 105933716 105982353 106031013
2638 106031013 106071976 106104179 106126740 106131340 106101013 106060623 106034729 106007050 105961823 105922005 105917213 105911728
2650 105911728 105881737 105820892 105686401 105563522 105560776 105565353 105462624 105366180 105380722 105418228 105417320 105402542
2662 105402542 105378006 105343437 105297012 105247139 105192307 105160233 105200073 105245850 105240822 105206367 105123039 105056526
2674 105056526 105088898 105151367 105208946 105241920 105185822 105139664 105209114 105309555 105400894 105455208 105409790 105328560
2686 105328560 105234978 105187675 105292938 105431221 105506279 105554245 105566620 105580948 105660912 105719299 105671783
2697 105671783 105573128 105412628 105302353 105411720 105558060 105596420 105583069 105515839 105425003 105329468 105260849
2708 105260849 105268333 105317879 105429359 105490181 105345276 105141663 104967140 104844048 104865456 104906937 104850410
2719 104850410 104769730 104696320 104639244 104641914 104632469 104507706 104405022 104463150 104574562 104687477 104773354
2730 104773354 104738853 104726288 104893417 105100250 105251053 105370781 105453918 105496170 105474091 105439590 105441284
2741 105441284 105465553 105536270 105589508 105538033 105475426 105494118 105510254 105440971 105375763 105400154 105443092 105457230
2753 105457230 105456924 105435394 105408669 105391838 105380844 105379845 105379005 105361511 105352211 105383827 105415749 105425003 105391312
2766 105391312 105263443 105111053 104985573 104890015 104855965 104849075 104864143 104845116 104707481 104531357 104365822
2777 104365822 104219269 104126236 104057312 104005455 103937721 103814438 103648499 103423119 103187347 103000092 102814934
2788 102814934 102591011 102370377 102183655 102024147 101900719 101797195 101720810 101610016 101374199 101107689
2798 101107689 100877380 100674965 100546692 100395462 100107025 99778793 99461746 99180962 99023628 98854233
2808 98854233 98553207 98159668 97615959 97092888 96823044 96563385 96075943 95577881 95285866 94963142
2818 94963142 94384407 93731667 93136360 92524887 91872688 91163872 90408066 89504097 88329102 86957596
2828 86957596 85413429 83725525 81927345 80028793 78068687 75993683 73749992 71377487 68849968
2837 68849968 66311569 63924408 61608337 59325218 57111168 54975128 52960182 51112434 49431442
2846 49431442 47926067 46614407 45480061 44635391 44202328 44135807 44463371 45089005 45970535 46973991
2856 46973991 47930717 48902462 49923943 50907494 51779984 52532387 53132153 53576611 53830170 53958843
2866 53958843 53966881 54004002 54210567 54618668 55349731 56275890 57367538 58451126 59337353 60043571
2876 60043571 60510063 60778687 60869694 60788082 60565853 60142113 59404732 58539413 57707260 56869888
2886 56869888 56052376 55225132 54347084 53477764 52676487 51902626 51143288 50374290 49546623 48721931
2896 48721931 47956848 47217155 46477985 45767784 45119476 44494534 43878124 43231941 42480419 41720390
2906 41720390 41048309 40389702 39686272 38985752 38322495 37678001 37060806 36424110 35687897 34960052
2916 34960052 34335232 33772850 33225536 32808136 32639645 32660030 32874466 33206272 33549641 33997082
2926 33997082 34614418 35375786 36312080 37318634 38277794 39259171 40287136 41379761 42614792
2935 42614792 43837284 44906902 45857307 46681141 47361038 47898029 48229263 48261356 48086761 47763443
2945 47763443 47301483 46691200 46049522 45478916 45012974 44726467 44598030 44636223 44825912 45140884
2955 45140884 45622894 46322392 47187065 48155258 49305462 50722122 52325558 54047943 55937813
2964 55937813 58063839 60297607 62512875 64771606 67107292 69478912 71889832 74240326 76414749
2973 76414749 78464249 80393791 82226059 84009644 85671661 87133308 88460632 89703773 90831657
2982 90831657 91804077 92698593 93585846 94446419 95318794 96099663 96654602 97115227 97557899 98013878
2992 98013878 98579765 99135872 99587700 99956032 100204636 100409790 100640579 100882263 101151199 101422974
3002 101422974 101687790 101918030 102042725 102182007 102494957 102793739 102909325 102944374 102903702 102911568 103151222
3013 103151222 103450539 103694839 103894852 103998138 104079224 104209259 104345940 104465271 104583450 104719734
3023 104719734 104840996 104906631 104958054 105031631 105101921 105158806 105192352 105155586 105149338 105319740 105483582
3034 105483582 105442024 105387947 105469055 105621864 105876823 106099411 106099556 106074066 106204628 106346367 106397842
3045 106397842 106410263 106392906 106369972 106378296 106388947 106380867 106367134 106334946 106340599 106475952 106621170 106663773
3057 106663773 106673454 106692764 106690430 106615257 106569481 106686470 106821465 106853058 106844452 106803658 106774734 106830742
3069 106830742 106892418 106872391 106867813 106981537 107109070 107169510 107194664 107166908 107153511 107279991 107353828
3080 107353828 107095505 106891228 107178497 107523849 107559349 107525703 107573441 107605026 107545807 107477661 107471512
3091 107471512 107485481 107502815 107518982 107514069 107517433 107562782 107616974 107663177 107685997 107643127 107598259 107608482
3103 107608482 107651230 107740570 107823563 107845711 107825775 107754684 107661339 107558105 107485245 107508492 107563492 107610535
3115 107610535 107641365 107631966 107589745 107479401 107404877 107503632 107639526 107720802 107751724 107672592 107583359 107573006
3127 107573006 107614639 107739761 107862068 107876587 107870743 107927223 107954956 107859970 107733536 107623123 107565834
3138 107565834 107662415 107769058 107719872 107681656 107836624 107972618 107885262 107733391 107589485 107507942 107610344
3149 107610344 107767632 107901169 107981064 107916000 107811234 107741234 107706879 107749344 107822105 107916382 107960175
3160 107960175 107827354 107671593 107609726 107625839 107772591 107960815 108138321 108246918 108178452 108030678
3170 108030678 107832619 107682037 107728767 107845306 107972977 108054970 107975555 107852676 107749130 107714630 107891846
3181 107891846 108064606 108000328 107890656 107868408 107877159 107919952 107950996 107885124 107843376 107973122 108110092
3192 108110092 108105347 108060242 108027550 108003830 107999275 108025620 108135437 108216141 108119965 108004883 108002373 108044006
3204 108044006 108122726 108185555 108138893 108097382 108176926 108280037 108340164 108380409 108403061 108403778 108368637 108328415
3216 108328415 108307930 108311005 108366539 108423920 108431931 108421089 108398338 108382843 108390236 108437943 108580421 108722092
3228 108722092 108774689 108770493 108696533 108599976 108522202 108467339 108451767 108480141 108595917 108698723 108665771 108607674
3240 108607674 108597488 108624794 108716866 108833527 108950874 109047295 109096649 109088493 108966873 108842155 108854004
3251 108854004 108858345 108699631 108551643 108582397 108653595 108675339 108670067 108620163 108555603 108479073 108454514 108591843
3263 108591843 108755829 108837746 108867859 108824631 108754707 108701683 108652832 108603477 108572937 108589981 108621262 108637215
3275 108637215 108655045 108682777 108718391 108769943 108815147 108823250 108827568 108861282 108893967 108906151 108897850 108829308
3287 108829308 108800270 108955765 109120201 109144333 109093948 108951996 108817551 108803703 108851051 108964081 109064194
3298 109064194 109039474 108994003 109026192 109041069 108951447 108832359 108716988 108643532 108695030 108770111 108787155
3309 108787155 108769913 108697983 108622124 108584831 108590172 108669449 108783241 108924408 109027267 108987091 108913544
3320 108913544 108889580 108890221 108927559 108973122 109007790 109015442 108956482 108881996 108830948 108799957 108804985 108826752 108853340
3333 108853340 108878395 108910347 108892822 108710121 108548401 108603378 108730461 108865402 108962631 108928535 108842659
3344 108842659 108731224 108660339 108742210 108864471 108953522 109005211 108990433 108910294 108704903 108528061 108568451
3355 108568451 108661392 108690002 108699539 108686157 108680008 108708237 108775856 108934113 109071228 109062263 108997650 108910942
3367 108910942 108847664 108884979 108961555 109065125 109125397 109033081 108892868 108765884 108673264 108675789 108715340
3378 108715340 108748985 108791946 108860229 108908295 108879395 108822937 108759430 108718468 108763245 108813240 108779404 108750298
3390 108750298 108807327 108882828 108933640 108967422 108971764 108963631 108965179 108948418 108876083 108798096 108761787 108737709
3402 108737709 108695526 108685089 108782478 108878281 108845947 108812836 108907578 108999489 108973236 108910988 108855606 108809616
3414 108809616 108799507 108795929 108759781 108746597 108815147 108916306 109019562 109127930 109253311 109338120 109306808
3425 109306808 109224770 109127998 109029030 108942917 108897995 108965111 109031631 108974648 108895729 108863045 108853912 108892227
3437 108892227 108906387 108799530 108671043 108598801 108550430 108513832 108505821 108534546 108613564 108795311 108971046
3448 108971046 109018852 109030624 109076973 109099937 109049561 108972290 108882309 108826111 108895615 108968521 108909225 108849426
3460 108849426 108887360 108987595 109213211 109366821 109170341 108928635 108890961 108945847 109084175 109247849
3470 109247849 109388229 109467743 109400482 109282753 109174271 109098579 109128616 109175583 109152794 109126541 109139801
3481 109139801 109175827 109250595 109308884 109298897 109226013 109046478 108855629 108735802 108682152 108734657 108841110
3492 108841110 108981491 109098984 109119965 109074783 108932640 108803345 108824753 108881805 108896782 108895233 108851196
3503 108851196 108841393 108968018 109128471 109271027 109345314 109236481 109086296 109010292 108972336 108999870 109017464
3514 109017464 108907822 108823944 108917877 109075020 109255905 109387039 109341644 109239861 109159393 109100624 109102654
3525 109102654 109126945 109132126 109165833 109330963 109420464 109157753 108854218 108769203 108781982 108874847 108997940
3536 108997940 109083176 109167191 109297058 109373375 109276222 109114075 108940079 108800171 108783676 108813522 108844849
3547 108844849 108870293 108849884 108836411 108885910 108948418 108990715 109018349 109020920 109013031 108992050 108998871 109115578
3559 109115578 109215691 109159851 109068466 109029312 109000755 108952042 108938026 109046341 109147522 109108589 109027550
3570 109027550 108947441 108900215 108972023 109042999 108957077 108908699 109130714 109351685 109318825 109208679 109116531
3581 109116531 109032967 108984947 108958389 108949402 108954308 108973862 108990669 109000229 108964462 108793182 108637901 108656288
3593 108656288 108739517 108864685 108931442 108763763 108565666 108499001 108514168 108663727 108802917 108763100 108668304
3604 108668304 108596466 108516907 108405968 108320190 108333801 108369919 108375809 108352997 108262321 108173035 108155441 108167122
3616 108167122 108158752 108221123 108528687 108781006 108636398 108393021 108275177 108162476 107962585 107815384
3626 107815384 107867958 108006264 108181236 108345009 108390572 108446213 108675194 108865402 108774422 108656433 108734772
3637 108734772 108859375 108980392 109020378 108836578 108574699 108315964 108110733 108062576 108093048 108159348 108258125
3648 108258125 108380051 108499908 108599327 108648300 108571098 108486435 108494545 108575150 108790398 108993073 109029457
3659 109029457 108981247 108864113 108722229 108600784 108512093 108518265 108514908 108404182 108228134 107943726 107708069
3670 107708069 107718277 107811043 107869217 107951233 108089752 108244705 108386322 108516335 108622482 108716606 108860970
3681 108860970 108891983 108556938 108185150 108081314 108066605 108031342 108072472 108331512 108564804 108492729 108364342
3692 108364342 108375694 108406067 108374931 108357811 108443596 108511475 108419342 108319855 108345291 108414360 108511993 108571693
3704 108571693 108490990 108362579 108233116 108138039 108139275 108203979 108355186 108487152 108478065 108398964 108244347
3715 108244347 108121796 108190582 108289787 108292557 108255722 108169838 108106804 108148911 108255173 108423920 108619286
3726 108619286 108882927 108980461 108552025 108015724 107689499 107514000 107565331 107754822 108078476 108358261
3736 108358261 108342216 108247993 108269760 108225914 107896828 107590508 107617310 107750343 107908844 107964851 107618950
3747 107618950 107304741 107469818 107772423 108004425 108212135 108375809 108485413 108492493 108492470 108618904 108708832
3758 108708832 108592964 108423683 108289146 108212494 108284615 108390282 108420441 108447433 108527802 108599854 108605858
3769 108605858 108590240 108572289 108569595 108627129 108682014 108681229 108640144 108517502 108429932 108515717 108668472 108850906
3781 108850906 108993813 108990692 108915947 108786270 108668060 108672523 108681770 108579727 108472153 108442711 108441284 108457848
3793 108457848 108455467 108376976 108272789 108177994 108081291 107952263 107882996 108022400 108169678 108116104 108033989
3804 108033989 108011009 108092072 108454964 108788658 108762978 108613014 108478500 108315231 108095596 107909561
3814 107909561 107855347 107880493 107970497 108109428 108294296 108471603 108599304 108639809 108498093 108304214 108140038
3825 108140038 108054970 108193016 108352234 108337547 108272194 108214828 108164070 108152695 108136581 108051369 107990311
3836 107990311 108062599 108155914 108175896 108177689 108161949 108197472 108420921 108629059 108604622 108526375 108565422 108527397
3848 108527397 108189751 107807899 107545258 107455040 107752106 108114716 108234711 108286049 108369469 108396217 108274269
3859 108274269 108113861 108007263 107916214 107828094 107758209 107712006 107706284 107766769 107871910 108029892 108177063
3870 108177063 108231903 108256149 108291580 108316422 108321716 108310532 108288048 108238747 108119560 108018158 108020828 108088371
3882 108088371 108240868 108386490 108409782 108401772 108435944 108449265 108374168 108297775 108314705 108334778 108270218 108208443
3894 108208443 108258652 108267570 108045578 107810684 107725906 107766510 108009529 108312485 108558128 108747818 108830330
3905 108830330 108845901 108825516 108745644 108556747 108367798 108284447 108266830 108328674 108414795 108478737 108507797
3916 108507797 108447624 108376480 108359833 108381416 108461830 108555527 108607193 108666466 108801102 108901337 108850548
3927 108850548 108736755 108582832 108467461 108524895 108611275 108597710 108573341 108609314 108630608 108554718 108475014
3938 108475014 108470535 108501602 108589195 108630348 108475449 108285309 108157654 108132027 108342339 108602829 108783081
3949 108783081 108851006 108646484 108423065 108445236 108519814 108536888 108510849 108378670 108262489 108307770 108381340
3960 108381340 108358833 108359123 108512802 108660126 108628586 108586739 108696365 108805084 108800461 108724281 108534691
3971 108534691 108369972 108391548 108487915 108624100 108731934 108691765 108622910 108617828 108637474 108687019 108726074
3982 108726074 108708786 108656403 108569740 108464119 108342552 108242752 108210419 108224319 108315063 108372620 108244370
3993 108244370 108088539 108019257 108015869 108102798 108258911 108535431 108739426
4000 108739426
##END=$$ End of the data block
