##TITLE=$$ Begin of the data block
##JCAMP-DX=5.00 $$ ACD/SpecManager v 10.08
##SPECTROMETER/DATA SYSTEM=16PC
##DATE=09 Jul 2013 10:29:46
##DATA TYPE=INFRARED SPECTRUM
##DATA CLASS=XYDATA
##ORIGIN=
##OWNER=
##NPOINTS=3601
##FIRSTX=400.00000000
##LASTX=4000.00000000
##MAXX=4000.00000000
##MINX=400.00000000
##MAXY=29.30167770
##MINY=1.97194839
##XFACTOR=1.0000000000
##YFACTOR=0.000000100000000
##FIRSTY=24.40487671
##DELTAX=1.00000000
##XUNITS=1/CM
##YUNITS=TRANSMITTANCE
##XYDATA=(X++(Y..Y))
400B44048767L4011822J2378864o304893p986279p986278M598198M989776N040951
408B82790928L666115L17688Tj215000k42329J273346K069664J444359l41778k320233
418B87760448l477287l348007k190189p16229L65257O89488L04756m75330j277485
427B77635422j807080j898746j523857p90634P8067Q21496J261920J405278J440143
436B76622009J615010K060108K673836L152027L152237K489814J251736k30675j523685
445B91262417k263203k280998j645012o20480M24328J140442J316948R55620K60868
454B88550930m64382r73339j198368j264344j380195j677704k105789k453957k490940
463B74541912k123413j465797p75834l03993j59569k79369n06725p12471q71659j048908
$$ plain form
400 244048767 278060589 290439453 284134560 276148281 268162003 272760201 277749977 282790928
408 282790928 286457043 286774731 287092419 285877419 285635090 286908436 288978100 290422459 290080681 287760448
418 287760448 284283161 280935154 278744965 278028736 278393993 279083481 279388237 278912907 277635422
427 277635422 275828342 273929596 272405739 271615105 271693172 272514668 273776588 275181866 276622009
436 276622009 278237019 280297127 282970963 286122990 289275227 291765041 293016777 292786102 291262417
445 291262417 288999214 286718216 285073204 284452724 284877052 286017494 287334442 288290062 288550930
454 288550930 288086548 287113209 285914841 284650497 283270302 281592598 279486809 277032852 274541912
463 274541912 272418499 270952702 270176868 269872875 269713306 269433937 268927212 268214741 267343082 266294174
473B66294174j317711j682796k062302k338524k435112k366275k226754k136593k177448
482B47550659k359409k627907k901173l113632l243713l318234l390464l502331l644371
491B19449425l734265l633957l204975k387161j261272n8766Q98266J309567J019821
500B08396683R8190j159782k313939k918357k669182j510620L40175K461872M369393
509B05094433N676365O216144O073647N517254M865665M352818M052887L891315L723354
518B49463882L430176K980175K430973J883202J421299J076698Q28285O31562M53453
527B64599705K89135J54896O2446o542j10626l34492p56779j413784k276535l255081
537B56952343m227524n081539n748062o209107o478462o568298o460419o102485n429516
$$ plain form
473 266294174 264976463 263293667 261231365 258892841 256457729 254091454 251864700 249728107 247550659
482 247550659 245191250 242563343 239662170 236548538 233304825 229986591 226596127 223093796 219449425
491 219449425 215715160 212081203 208876228 206489067 205227795 205169029 206067295 207376862 208396683
500 208396683 208494873 207335091 205021152 202102795 199433613 197922993 198263168 200725040 205094433
509 205094433 210770798 216986942 223060589 228577843 233443508 237796326 241849213 245740528 249463882
518 249463882 252894058 255874233 258305206 260188408 261609707 262686405 263514690 264146252 264599705
527 264599705 264888840 265043736 265106182 265099640 264989014 264654522 263897743 262483959 260207424 256952343
537 256952343 252724819 247643280 241895218 235686111 229207649 222639351 216178932 210076447 204646931
546B04646931m400273l030109j404038L32566K002010L429890M482097N094681N292549
555B16446304N185814M938202M710846M597912M585590M558411M360371L883094L138371
564B56404915K269535J490288R79328P87811Q13599Q60157P47108M09184p4158n34058
574B64153709q18004q78220p92293p04918p33509q99716j128502j313533j400872j436519
584B54047623j550103j886692k535057l494243m691582o027870p410412q744755r895382
593B07811527j0649433j0724125r837646p820778m723053q57449L246460O971627R783363
602A83200493J1374702J1734677J1115703R918404Q543377P272930O223278N375271
610B54758835M650993L987007L367348K807884K317562J872540J423893R33800M11071
$$ plain form
546 204646931 200246658 197216549 195812511 196145077 198147087 201576977 206059074 211153755 216446304
555 216446304 221632118 226570320 231281166 235879078 240464668 245023079 249383450 253266544 256404915
564 256404915 258674450 260164738 261144066 261931877 262745476 263605633 264352741 264761925 264687767 264153709
574 264153709 263335705 262457485 261665192 260960274 260226765 259327049 258198547 256885014 255484142 254047623
584 254047623 252497520 250610828 248075771 244581528 239889946 233862076 226451664 217706909 207811527
593 207811527 197162094 186437969 176600323 168779545 164056492 163199043 166445503 173417130 183200493
602 183200493 194575195 206309872 217425575 227343979 235887356 243160286 249383564 254758835
610 254758835 259409828 263396835 266764183 269572067 271889629 273762169 275186062 276119862 276530933
619B76530933q2569m63009o72626p17545o68888o30646o93187r01165j250286j709023
629B68741989k248840k861042l552742m321747n125351n858002o354961o426354n916481
638B26076469m766750l052826r75590J196003L202687M855423O051216O745491O916618
647B46248741O558342N712662M515667L205070K058449J279774R02424P79590O84815
656B71945534M66213J53408o7329n093L52306P58858Q11443J91975j094971k648773
666B70863571l835220m108658l313770j788578k05174P62901P58992j22948j442928
675B57568188k673455l452816l700485l563289l262959k958069k693882k442245k169895
684B30651093j876278j579495j282101r61265o01063k40059J5850M5471j90658n70431
$$ plain form
619 276530933 276448364 275985355 275312729 274595184 273926296 273295650 272602463 271701298 270451012 268741989
629 268741989 266493149 263632107 260079365 255757618 250632267 244774265 238419304 231992950 226076469
638 226076469 221309719 218256893 217281303 218477306 221679993 226535416 232586632 239332123 246248741
647 246248741 252807083 258519745 263035412 266240482 268298931 269578705 270481129 271260719 271945534
656 271945534 272411747 272565155 272497826 272492733 272845039 273603897 274415340 274607315 273512344 270863571
666 270863571 267028351 262919693 259605923 257817345 257612171 258375072 259134064 259011116 257568188
675 257568188 254894733 251441917 247741432 244178143 240915184 237957115 235263233 232820988 230651093
684 230651093 228774815 227195320 225913219 224951954 224350891 224110832 224126682 224172153 223981495 223411064
694B23411064q12569n80196L56846J986027M019336N986195P408257P971897P620430
703B57367287O536140N037117L449688K015896Q61359J6574n42774q62922r99394j017055
713B71861916r88121r79462j034813j161118j330852j499214j627808j702938j739006
722B59798584j766853j815129j892624j981487k042618k033138j928482j740284j521168
731B43076801j350383j304360j422481j685524k019082k322464k510299k546578k454967
740B25460663k301960k165470k105961k152062k302665k534676k810230l081093l296833
749B02709713l420372l448143l419399l402996l460579l606854l790893l919354l911152
758A70329971l753605l522625l348569l343325l531056l825378m068756m113970l899021
$$ plain form
694 223411064 222598495 222018299 222375145 224361172 228380508 234366703 241774960 249746857 257367287
703 257367287 263903427 268940544 272390232 274406128 275267487 275284061 274741287 273878365 272878971 271861916
713 271861916 270873795 269894333 268859520 267698402 266367550 264868336 263240528 261537590 259798584
722 259798584 258031731 256216602 254323978 252342491 250299873 248266735 246338253 244597969 243076801
731 243076801 241726418 240422058 238999577 237314053 235294971 232972507 230462208 227915630 225460663
740 225460663 223158703 220993233 218887272 216735210 214432545 211897869 209087639 206006546 202709713
749 202709713 199289341 195841198 192421799 189018803 185558224 181951370 178160477 174241123 170329971
758 170329971 166576366 163053741 159705172 156361847 152830791 149005413 144936657 140822687 136923666
767A36923666l473568k963572k498588k148466j906529j724004j568299j458616j450291
776A17731733j573848j766634j848555j569347p15857P72667K742500M855223O700830
785A25328712P942467Q425780Q205442P488317O531020N548439M671535L956757L421783
794A81520252L072567K905941K893639K972603L054943L059883K947369K734222K484360
803B07645779K278614K178917K196941K274055K276822K015171J295108J603j809655
812B20353355l859481n675221o718216o573009n119362k604885M24518L311634N509587
821A99048920O742096P040596O660156N931759N128288M397602L772164L225364K728386
830B44675331K278690J894436J592427J371326J211319J087322R83162Q95691Q26759
$$ plain form
767 136923666 133450098 130486526 127987938 125839472 123932943 122208939 120640640 119182024 117731733
776 117731733 116157885 114391251 112542696 110973349 110257492 111030159 113772659 118627882 125328712
785 125328712 133271179 141696959 149902401 157390718 163921738 169470177 174141712 178098469 181520252
794 181520252 184592819 187498760 190392399 193365002 196419945 199479828 202427197 205161419 207645779
803 207645779 209924393 212103310 214300251 216574306 218851128 220866299 222161407 222163010 220353355
812 220353355 216493874 210818653 204100437 197527428 192408066 189803181 190227699 193539333 199048920
821 199048920 205791016 212831612 219491768 225423527 230551815 234949417 238721581 241946945 244675331
830 244675331 246954021 248848457 250440884 251812210 253023529 254110851 255094013 255989704 256816463
839B56816463P71599P13768O32115N17463L84751K71950K21157K51674L42045M34723
849B61357708M63066L87707K19002J1940j65539k70901l08723l23449l67221m67110
859B60536480o11076p61147q82797r70516j052418j173630j370964j653786k001381
868B50058765k373542k725125l019581l237800l383599l484458l579197l692322l799381
877B20763760l804341l550911k875023j682891j6232J931763L865356N477848O543885
886B26653214O970005O788558O114884N098419L894653K653828J507645N36899k69165
895B59948940j027031j912117l048877m385758n632458o320343n985088m396324j717892
904B25523052J495381M478607O537685P299137O812554N471611L806629K262669J066226
$$ plain form
839 256816463 257588062 258301830 258933945 259451408 259836159 260108109 260329266 260580940 260922985 261357708
849 261357708 261820774 262208481 262427483 262439423 262273884 262002983 261694260 261370811 261003590 260536480
859 260536480 259925404 259164257 258281460 257310944 256258526 255084896 253713932 252060146 250058765
868 250058765 247685223 244960098 241940517 238702717 235319118 231834660 228255463 224563141 220763760
877 220763760 216959419 213408508 210533485 208850594 208834362 210766125 214631481 220109329 226653214
886 226653214 233623219 240411777 246526661 251625080 255519733 258173561 259681206 260218105 259948940
895 259948940 258921909 257009792 253960915 249575157 243942699 237622356 231637268 227240944 225523052
904 225523052 227018433 231497040 238034725 245333862 252146416 257618027 261424656 263687325 264753551
913B64753551K22722l87612q89644j339779j722699j997528k148132k205868k237415
922B52047596k320194k521820k892304l457851m204369n052223n843601o363659o405239
931B12986336n855751m764843l352680j945477q59985k88887k37637n38692r32999
940A94209385j176205j122780p55691j59092N41019J236058J865673K415466K890873
949A99944706L289623L589668L756485L764439L615170L343620L006630K660732K342091
958B29313164K055683J781864J491909J168594Q17605M69093J67045m7340j50948j45130
968B36921539n2871R3994K70138M66556O91319R58976J274758J622829J964493K249985
978B46461716K437782K512588K490540K410717K314892K228508K151031K061749J936569
$$ plain form
913 264753551 264976273 264588661 263699017 262359238 260636539 258639011 256490879 254285011 252047596
922 252047596 249727402 247205582 244313278 240855427 236651058 231598835 225755234 219391575 212986336
931 212986336 207130585 202365742 199013062 197067585 196207600 195918713 195681076 195142384 194209385
940 194209385 193033180 191910400 191154709 190995617 191536636 192772694 194638367 197053833 199944706
949 199944706 203234329 206823997 210580482 214344921 217960091 221303711 224310341 226971073 229313164
958 229313164 231368847 233150711 234642620 235811214 236628819 237097912 237264957 237217617 237066669 236921539
968 236921539 236868668 236962662 237232800 237699356 238390675 239349651 240624409 242247238 244211731 246461716
978 246461716 248899498 251412086 253902626 256313343 258628235 260856743 263007774 265069523 267006092
987B67006092J764717J557160J341590J147118R90181Q67939P63474O59141N48649
996B76646061M40826L52764K97452K72674K59838K31915J67846O4278o1779j79539
1006B78492336k59742k87896k71682k37713k19803k43607l16276m22669n32627o13403
1016B75086918o43120o18210n53245m73214m04129l66096l72410m31347n48572p23610
1026B69952965r42764j173230j366615j475143j475296j387883j279468j238919j337604
1035B58276043j591759j950626k318134k601300k759571k825298k885094l027496l287659
1044B35029106l620148l913688m040451l911228l508282k880669k113094j287499m60910
1053B09293137L35273J081772J758080K339763K803669L133393L319969L357067L238907
$$ plain form
987 267006092 268770809 270327969 271669559 272816677 273806858 274674797 275438271 276097412 276646061
996 276646061 277086887 277439651 277737103 278009777 278269615 278501530 278669376 278733654 278671875 278492336
1006 278492336 278232594 277944698 277673016 277435303 277215500 276971893 276655617 276232948 275700321 275086918
1016 275086918 274443798 273825588 273272343 272799129 272395000 272028904 271656494 271225147 270676575 269952965
1026 269952965 269010201 267836971 266470356 264995213 263519917 262132034 260852566 259613647 258276043
1035 258276043 256684284 254733658 252415524 249814224 247054653 244229355 241344261 238316765 235029106
1044 235029106 231408958 227495270 223454819 219543591 216035309 213154640 211041546 209754047 209293137
1053 209293137 209628410 210710182 212468262 214808025 217611694 220745087 224065056 227422123 230661030
1062B30661030K965698K551937K032833J457520Q73985L12233k23885p54089j314525
1071B38562737j952057k719136l656044m754581n907612o878071p323780o897030n395164
1080A93079262k893734K13795L309860N755462P112770P285119O511001N224533L860340
1089B29458408K700291J825657J172962O38085J58996k61440n88665q06370r44004
1098B33353920j064968j230164j463890j744442k020702k241535k379361k436695k438640
1107B16333523k418919k409649k436676k519302k669563k889138l164138l463459l742753
1116A90619926l956718m075832m101220m068813m038620m072265m208203m448309m762525
1125A52887421n110379n464201n822382o201152o612740p040749p429857p695379p746830
$$ plain form
1062 230661030 233626728 236178665 238211498 239669018 240543003 240855236 240631351 239877262 238562737
1071 238562737 236610680 233891544 230235500 225480919 219573307 212695236 205371456 198474426 193079262
1080 193079262 190185528 190399323 193709183 199464645 206577415 213862534 220373535 225598068 229458408
1089 229458408 232158699 233984356 235157318 235795403 235954399 235692959 235104294 234297924 233353920
1098 233353920 232288952 231058788 229594898 227850456 225829754 223588219 221208858 218772163 216333523
1107 216333523 213914604 211504955 209068279 206548977 203879414 200990276 197826138 194362679 190619926
1116 190619926 186663208 182587376 178486156 174417343 170378723 166306458 162098255 157649946 152887421
1125 152887421 147777042 142312841 136490459 130289307 123676567 116635818 109205961 101510582 93763752
1134I3763752p516260o977496o152802n106821l931713k726126j572094n13258M56052
1143E9723234J382327K325464L319249M340143N300093O071028O530590O607304O304750
1152A01904182N693169M876881L954086K988348K002316R90276n9633j147080k251205
1161A18951340l333435m346638n243445n980625o518755o821003o855239o603742o075530
1170F7172928n316343m405694l437868k491135j598907p38797J51477J136355K238508
1179E2710524L411874M543910N487786O108055O321144O113381N533696M669170L617306
1188I8516846K467394J296157J75896q14390j582604k031793k084732j718130r93233
1197I3231411o4039Q50887J530695J829481J733866J369238R43479O46601N52835N75552
$$ plain form
1134 93763752 86247492 79269996 73117194 68010373 64078660 61352534 59780440 59267182 59723234
1143 59723234 61105561 63431025 66750274 71090417 76390510 82461538 88992128 95599432 101904182
1152 101904182 107597351 112474232 116428318 119416666 121418982 122409258 122349625 121202545 118951340
1161 118951340 115617905 111271267 106027822 100047197 93528442 86707439 79852200 73248458 67172928
1170 67172928 61856585 57450891 54013023 51521888 49922981 49184184 49335661 50472016 52710524
1179 52710524 56122398 60666308 66154094 72262149 78583293 84696674 90230370 94899540 98516846
1188 98516846 100984240 102280397 102456293 101641903 100059299 98027506 95942774 94224644 93231411
1197 93231411 93167372 94018259 95548954 97378435 99112301 100481539 101425018 102071619 102624454 103200006
1207A03200006N03159J06258p32612j931086l206072m166793m460679l908262k568655
1216H2835264p12080J281023L045149M327011N024233N165663M858579M233990L411322
1225A13470154K486286J533194O09674k42376r97353j644869k184028k615891k938795
1234A07475996l148823l242540l218279l072414k792654k355624j732826r05676J18075
1243H7125235J297378K564135L841495N061941O174622P139282P912941Q443861Q680706
1252A38241596Q596211Q210411P598247O871548O143742N493660M948711M493313M094696
1261A94692135L729877L395996L102532K854080K638493K428589K196521J927529J625881
1270B18591633J306534R81140O47774K91538j05267n49297j026592j503010j933956
$$ plain form
1207 103200006 103703165 103809423 103076811 101145725 97939653 93772860 89312181 85403919 82835264
1216 82835264 82123184 83404207 86449356 90776367 95800600 100966263 105824842 110058832 113470154
1225 113470154 115956440 117489634 118099308 117856932 116859579 115214710 113030682 110414791 107475996
1234 107475996 104327173 101084633 97866354 94793940 92001286 89645662 87912836 87007160 87125235
1243 87125235 88422613 90986748 94828243 99890184 106064806 113204088 121117029 129560890 138241596
1252 138241596 146837807 155048218 162646465 169518013 175661755 181155415 186104126 190597439 194692135
1261 194692135 198422012 201818008 204920540 207774620 210413113 212841702 215038223 216965752 218591633
1270 218591633 219898167 220879307 221527081 221818619 221713352 221164055 220137463 218634453 216700497
1279B16700497k281227k532044k712402k886830l136654l518924m020348m529171m849567
1288A86233330m763851m123688k930088j359520K81219J657181K517414K767411K472629
1297A82752037J801605R45397N7106p64027j450424j934033k134571j980228j449299
1306A75843563o06766L90931J328258J991138K228833J995983J361141M84352m27055
1315A84590378j168328j582756j593322j215954n52254K37007R71470J492634J696320
1324A82875195J547622J076527L59859n00240j396770k230607k920112l406124l655892
1333A71749458l662262l438224l010769k416067j702261r36518k07529L83234P45506
1342A57504568Q29010O42014K46200k71454q35476j405572j973086k534790l062534
$$ plain form
1279 216700497 214419270 211887226 209174824 206287994 203151340 199632416 195612068 191082897 186233330
1288 186233330 181469479 177345791 174415703 173056183 173337402 174994583 177511997 180279408 182752037
1297 182752037 184553642 185499039 185556145 184792118 183341694 181407661 179273090 177292862 175843563
1306 175843563 175236797 175627728 176955986 178947124 181175957 183171940 184533081 185017433 184590378
1315 184590378 183422050 181839294 180245972 179030018 178477764 178714771 179686241 181178875 182875195
1324 182875195 184422817 185499344 185859203 185358963 183962193 181731586 178811474 175405350 171749458
1333 171749458 168087196 164648972 161638203 159222136 157519875 156583357 156375828 156759062 157504568
1342 157504568 158333578 158975592 159221792 158950338 158114862 156709290 154736204 152201414 149138880
1351A49138880l491049l734398l720703l424349k875910k144832j308308m25940M66834
1360A28480225J347379K189265K953929L595610M073610M361630M450302M342861M052677
1369A59847488L605156L041649K417374J788387J190834O21529L4141o46343j491222
1378A70408993k533112l739357n004167o161938p019320p399911p192393o389904n105553
1387A19863338l551979j983909o17533M42505J236496J921377K687874L656759M803534
1396A28458462N949726O828966P197638O935405O088696M837284L408985J989498O74019
1405A72368679n22156j613292k592259l412342m008369m337931m411287m289561m056234
1414A43125248l780012l493262l195066k871933k522278k169313j858750j641016j546001
$$ plain form
1351 149138880 145647831 141913433 138192730 134768381 131892471 129747639 128439331 128013391 128480225
1360 128480225 129827604 132016869 134970798 138566408 142640018 147001648 151451950 155794811 159847488
1369 159847488 163452644 166494293 168911667 170700054 171890888 172512417 172546558 171900215 170408993
1378 170408993 167875881 164136524 159132357 152970419 145951099 138551188 131358795 124968891 119863338
1387 119863338 116311359 114327450 113709917 114152422 115388918 117310295 119998169 123654928 128458462
1396 128458462 134408188 141237154 148434792 155370197 161458893 166296177 169705162 171694660 172368679
1405 172368679 171846523 170233231 167640972 164228630 160220261 155882330 151471043 147181482 143125248
1414 143125248 139345236 135851974 132656908 129784975 127262697 125093384 123234634 121593618 120047617
1423A20047617j556521j594839j531925j227817n91545L64618J509848K635011L536492
1432A21590939M100351M341993M378863M355812M369402M435291M508371M532576M477463
1441A61091061M343547M145260L901768L651943L476200L488694L776302M308567M884338
1450A97067680N178528M895859L957901K605190J326237O27060P59506J569977K570667
1459B20558605L204651L154087K509041J695137J203289J287708J813317K343998K411213
1468B40181046J798629O73065n10120j259727j308251p29446J36261Q88176J274166
1477B41143799J286201J109658R75170J011677J181030J317901J241703Q70686K83470
1486B50421295l05214o38447n46722m9400O22482J113415J117573N62191l03250r89475
$$ plain form
1423 120047617 118491096 116896257 115364332 114136515 113544970 113909588 115419436 118054447 121590939
1432 121590939 125691290 130033283 134412146 138767958 143137360 147572651 152081022 156613598 161091061
1441 161091061 165434608 169579868 173481636 177133579 180609779 184098473 187874775 192183342 197067680
1450 197067680 202246208 207142067 211099968 213705158 215031395 215658455 216417961 217987938 220558605
1459 220558605 223763256 226917343 229426384 231121521 232324810 233612518 235425835 237769833 240181046
1468 240181046 241979675 242652740 242142620 240882893 239574642 238845196 238981457 239869633 241143799
1477 241143799 242430000 243539658 244514828 245526505 246707535 248025436 249267139 250137825 250421295
1486 250421295 250116081 249477634 248930912 248881512 249503994 250617409 251734982 252297173 251993923 251004448
1496B51004448j010075j71947J255188K612266L162403K485714P35112j404248l044986
1505B55623875l537159k772332j190357M95110J672954K095795J898956J413937R28154
1514B56628933N44758K03914j93977o72340j150437j498737j619358j487694j145325
1523B49609737o70299j62525K59456M76132M20494J43127j68476k64454J9436O24390
1533B50287018J247673J477604J024704q7414j493626k649841l098850k688904j630573
1542B42387791l70274O32496J105976J051350O96335L61690L08018O20518J163291
1551B47957191J617966J603890Q51707o32419k495442m122620m873676m377537k739086
1560B32789974n36518J414471K423134K236061J134128k31819j181545j338673p87906
$$ plain form
1496 251004448 249994373 249822426 251077614 253689880 256852283 259337997 260073109 258668861 255623875
1505 255623875 252086716 249314384 248124027 248619137 250292091 252387886 254286842 255700779 256628933
1514 256628933 257173691 257377605 257183628 256511288 255360851 253862114 252242756 250755062 249609737
1523 249609737 248939438 248776913 249036369 249512501 249932995 250076122 249907646 249643192 249662628 250287018
1533 250287018 251534691 253012295 254036999 253949585 252455959 249806118 246707268 244018364 242387791
1542 242387791 242017517 242650013 243755989 244807339 245503674 245865364 246173382 246793900 247957191
1551 247957191 249575157 251179047 252030754 251398335 248902893 244780273 239906597 235529060 232789974
1560 232789974 232253456 233667927 236091061 238327122 239461250 239229431 238047886 236709213 235921307
1569B35921307J7356N30167M12254k98996j238155j929665k047424j572265p72400
1578B29022179l6202L37677K73342q5754m94919p56206q09231p24926o27899o07567
1588B25490494o74496p75471q42914q38814p69558o71177n85766n42602n52178o04896
1598B18632622o77071p40604p80316q06884q54092r51386j086921j191845j169815
1607B10373688r66568o35586l44887l01037o23932j247940j925182k341881k288742
1616A99697933j782226j061116m58107k23655m05445q46253j286831j502151j392918
1625A90739231r97791m47121R4490M65279N26638J91841n26276j470718k346401k807884
1635A83421288k611809j760426n48153N38311J037522P44686j70193j232357j902733
$$ plain form
1569 235921307 235938663 236468830 236881084 236582088 235343933 233414268 231366844 229794579 229022179
1578 229022179 228985977 229323654 229596996 229511242 229016323 228260117 227450886 226725960 226098061 225490494
1588 225490494 224815998 224040527 223197613 222358799 221589241 220918064 220332298 219789696 219237518 218632622
1598 218632622 217955551 217214947 216434631 215627747 214773655 213822269 212735348 211543503 210373688
1607 210373688 209407120 208771534 208426647 208125610 207501678 206253738 204328556 201986675 199697933
1616 199697933 197915707 196854591 196396484 196172829 195767384 194921131 193634300 192132149 190739231
1625 190739231 189741440 189294319 189388809 189854088 190380726 190572567 190046291 188575573 186229172 183421288
1635 183421288 180809479 179049053 178500900 179039211 180076733 180821419 180651226 179418869 177516136
1644A77516136j867409j220817m32587r9010o06900j891765l436737m524708m616375
1653A58819828l643808k051850n62706K06461N0793p58009j675615k220145k232866
1662A45932083j917724j659489j755762k240057k896042l430767l673678l667965l604145
1671A21086454l661108l873729m119110m221430m094496l818722l600759l645277m024058
1680H6027765m625368n209513n533371n467367n044446m423985l801990l321590l026991
1689D5573144k872624k770908k644985k460640k227425j978157j743557j538189j361377
1698B5975282j207118j072376r56509q54654p52134o27945m66308k67922n0832J61058
1708A9880542L55166N39775P38949R76665J262634J591203J951647K339566K754104
$$ plain form
1644 177516136 175648727 174427910 173995323 173896313 173289413 171397648 167960911 163436203 158819828
1653 158819828 155176020 153124170 152561464 152767925 152818718 152060709 150385094 148164949 145932083
1662 145932083 144014359 142354870 140599108 138359051 135463009 132032242 128358564 124690599 121086454
1671 121086454 117425346 113551617 109432507 105211077 101116581 97297859 93697100 90051823 86027765
1680 86027765 81402397 76192884 70659513 65192146 60147700 55723715 51921725 48600135 45573144
1689 45573144 42700520 39929612 37284627 34823987 32596562 30618405 28874848 27336659 25975282
1698 25975282 24768164 23695788 22739279 21884625 21132491 20504546 20038238 19770316 19719484 19880542
1708 19880542 20235708 20775483 21514432 22491097 23753731 25344934 27296581 29636147 32390251
1717C2390251L181217L575508L859849L952966L810578L454332K963858K431931J909943
1726F1530433J379356P72448K9893q40764j746388k543964l108993l395119l448271
1735D8628631l368812l247523l116136k940478k656124k222009j657996j047644n06220
1744B7865689j35472J3986m3996k41728m84283o78727p55506o77893m38952n2877M54555
1755B4824796J051254J700323K362187L000514L590603M125883M612422N053330N429711
1764E5751023N694766N789905N678687N378857M970112M566535M267092M111061M065113
1773A00273151M049750L985462L831482L595238L314361L029986K772464K563305K423516
1782A29838715K370100K397318K458753K470474K346831K052107J636142J223069R53455
$$ plain form
1717 32390251 35571468 39146976 43006825 46959791 50770369 54224701 57188559 59620490 61530433
1726 61530433 62909789 63682237 63712130 62871366 61124978 58581014 55472021 52076902 48628631
1735 48628631 45259819 42012296 38896160 35955682 33299558 31077549 29419553 28371909 27865689
1744 27865689 27730217 27744203 27700207 27458479 26974196 26295469 25539963 24862070 24423118 24370241 24824796
1755 24824796 25876050 27576373 29938560 32939074 36529677 40655560 45267982 50321312 55751023
1764 55751023 61445789 67235694 72914381 78293238 83263350 87829885 92096977 96208038 100273151
1773 100273151 104322901 108308363 112139845 115735083 119049444 122079430 124851894 127415199 129838715
1782 129838715 132208815 134606133 137064886 139535360 141882191 143934298 145570440 146793509 147746964
1791A47746964R09576J067924J310130J485920J492118J322441J061545Q31919P26957
1800A57955494P67012Q98733J031437J086368J032944Q96664P39212O24046N85728
1809A65617638O17275O79531P26910P33356P04556O68106O51760O63280O88324P04918
1819A72455654P03201O90976O81438O71368O34193N37472L76587J97449Q3236J06621
1829A77138195K76966N23319P31831Q16765P77683O97365O78100P58648Q73318Q86555
1839A84158745O87561K78873k01111n45120n91488l17554J48105N98679Q60386Q74996
1849A85952072P09362M96845L54195L24135L72219M27246M36325L96290L51143L57838
1859A90177670M45385N88092P10755P22942N69191K68021q2760l43762l99799k20356
$$ plain form
1791 147746964 148656540 149724464 151034594 152520514 154012632 155335073 156396618 157228537 157955494
1800 157955494 158722506 159621239 160652676 161739044 162771988 163668652 164407864 165031910 165617638
1809 165617638 166234913 166914444 167641354 168374710 169079266 169747372 170399132 171062412 171750736 172455654
1819 172455654 173158855 173849831 174531269 175202637 175836830 176374302 176750889 176948338 177031574 177138195
1829 177138195 177415161 177938480 178670311 179487076 180264759 180962124 181640224 182398872 183272190 184158745
1839 184158745 184846306 185125179 184924068 184378948 183787460 183469906 183618011 184216690 185077076 185952072
1849 185952072 186661434 187158279 187512474 187836609 188208828 188636074 189072399 189468689 189819832 190177670
1859 190177670 190623055 191211147 191921902 192644844 193214035 193482056 193399296 193055534 192655735 192435379
1869A92435379J20106M76627P06005P36275N95226L83492K14214J54572K04773L15818
1879A96342487M27952N00031N17273M81472M00562K88467J71414Q5869O4277J13678
1889A99393482K06261K92263L29723L10650K63577K30331K33727K62718K83279K69070
1899B02075081K23331J76754J62335J87778K29225K51446K38762K10590K08168K59953
1909B04223423L52631M30793M28315L11946J06698j13068k63023k92893k09064o5384
1919B04910374P0419J51711J71642J57013J46160J65081K13566K67944K95792K75631
1929B06825333K11010J32312Q3466R9277J83831L02677L95679M05960L11509J40247
1939B09091301l9978j53923j56899n6552R2067K15492K59095K11429J04847n474p0762
$$ plain form
1869 192435379 192555485 193032112 193738117 194474392 195069618 195453110 195667324 195821896 196026669 196342487
1879 196342487 196770439 197270470 197787743 198269215 198669777 198958244 199129658 199215527 199279804 199393482
1889 199393482 199599743 199892006 200221729 200532379 200795956 201026287 201260014 201522732 201806011 202075081
1899 202075081 202298412 202475166 202637501 202825279 203054504 203305950 203544712 203755302 203963470 204223423
1909 204223423 204576054 205006847 205435162 205747108 205853806 205740738 205477715 205184822 204975758 204910374
1919 204910374 204980793 205132504 205304146 205461159 205607319 205772400 205985966 206253910 206549702 206825333
1929 206825333 207036343 207168655 207252121 207351398 207535229 207837906 208233585 208639545 208951054 209091301
1939 209091301 209051323 208897400 208740501 208683949 208776016 208991508 209250603 209462032 209566879 209561405 209490643
1950B09490643p1259j9016N3959J15890J50700J61133J60884J61858J64909J59970
1960B10529671J33381P8525K041p7381j36643j58557j38722q6269j9455M1370P9842
1971B10247803Q7204O3095J4210m7303j07784j54991j81408j85242j68876j36929r4395
1982B09335384m7989o961J6098J0357k6627q2855j33133j49250j15471l9654M7360
1993B08807259J05362J05838M7417m3163j25294j66130j55964j09901n5485j5698L014
2004B08397255R937K0123M1809P0667R2812R3879O8169K1820k9602o7768p9060n8880
2016B08581161j3256M2534Q9226J10626J00766O8016L1318J1196J7834M4651P2117
2027B09156189P9689N9166K1019j2589k2392o294J8463K5482k708o2676j30500j75744
$$ plain form
1950 209490643 209419384 209400368 209454327 209570217 209720917 209882050 210042934 210204792 210369701 210529671
1960 210529671 210663052 210741577 210743618 210666237 210529594 210371037 210232315 210146046 210126591 210167961 210247803
1971 210247803 210335007 210398102 210412312 210365009 210257225 210102234 209920826 209735584 209566708 209429779 209335384
1982 209335384 209287395 209280434 209296532 209306889 209280262 209197407 209064274 208915024 208799553 208759899 208807259
1993 208807259 208912621 209018459 209065876 209022713 208897419 208731289 208575325 208465424 208409939 208394241 208397255
2004 208397255 208407192 208427315 208469124 208539791 208632603 208726482 208794651 208816471 208786869 208719101 208640041 208581161
2016 208581161 208567905 208610439 208699665 208810291 208911057 208979073 209010391 209021587 209039421 209084072 209156189
2027 209156189 209235878 209295044 209316063 209303474 209281082 209274788 209293251 209318733 209316025 209253349 209122849 208947105
2039B08947105j79519j43814q8158l5381J754K5750M7512P4253J03416J24684J29890
2050B09007492J22013J14346J21269J45664J73626J81389J50185Q0356n703p4749j00841
2061B09915047p9632k9450J9761M4250L7708J1292j6480l2501l4904l0537k5768k0657
2073B09758129r003J4229M5376P1182P5684N1250N513m0722o4488n3043j1139M2801
2085B09885769Q6613J05781R8229P2040L8433O542j9073l6049m2248l5934j7948O313
2097B10148468K8000L8566L4104J7185n512k6188l9768m4480m0855l1242j9665j2703
2109B10045910j7433l8700p4253j13678j42270j48372j30501r8248o7424n0831n1308
2120B09112892o2008p2307p4864o9961o2771n7755n3997m5662k6931K384L5782O3133
$$ plain form
2039 208947105 208767586 208623772 208535614 208500233 208501987 208527737 208575249 208649502 208752918 208877602 209007492
2050 209007492 209129505 209243851 209365120 209510784 209684410 209865799 210015984 210096340 210090637 210015888 209915047
2061 209915047 209835415 209805965 209825726 209869976 209907684 209918976 209902496 209869995 209835091 209804554 209778786 209758129
2073 209758129 209749126 209763355 209808731 209879913 209955597 210006847 210012360 209971638 209907150 209854107 209842968 209885769
2085 209885769 209972382 210078163 210176392 210248432 210286865 210293407 210274334 210238285 210196037 210160103 210142155 210148468
2097 210148468 210176468 210215034 210249138 210266323 210260811 210234623 210194855 210150375 210109520 210078278 210058613 210045910
2109 210045910 210028477 209989777 209915524 209801846 209659576 209511204 209380703 209282455 209215031 209164200 209112892
2120 209112892 209050884 208978577 208903713 208833752 208770981 208713226 208659229 208613567 208586636 208589020 208624802 208687935
2132B08687935P7228P7286O8855N8823N0144M0188K2507q297n2357j03817j52683j88141
2144B08577671k02084j91898j60980j19114p9708n5599n3482p0305r3422j06507r8018
2155B07346554o7959k9373j354P24k6054o9904j10665j29547j18198q1806l5725K937
2167B06679630K2164J9073l05k4395m0264l8071j3447K9240P7724J13888J20468Q8177
2179B07033882K1420o1226j33629j71890j64452j16692m8007J6422N5904O1150L5972
2190B06528854o809n1174q5087j02901j05744r8438q6308p3490o2313n5332n6152o7807
2202B05677299r0332j16748j33324j24931q3847j8101M8065Q1997N8918k4338j44329
2213B05130329k59876l30219l33214k73667j78489q2588j3371J7166J1578j9684o4545
$$ plain form
2132 208687935 208765163 208842449 208911304 208970127 209020271 209060459 209082966 209074669 209022312 208918495 208765812 208577671
2144 208577671 208375587 208183689 208022709 207903595 207823887 207768288 207714806 207644501 207551079 207444572 207346554
2155 207346554 207278595 207249222 207247868 207248592 207222538 207152634 207041969 206912422 206794224 206712418 206676693 206679630
2167 206679630 206701794 206720867 206720562 206696167 206655903 206617832 206604385 206633625 206711349 206825237 206945705 207033882
2179 207033882 207055302 206994076 206860447 206688557 206524105 206407413 206359406 206375828 206431732 206492882 206528854
2190 206528854 206522045 206470871 206385784 206282883 206177139 206078701 205992393 205918903 205856590 205801258 205745106 205677299
2202 205677299 205586967 205470219 205336895 205211964 205128117 205110016 205158081 205240078 205298996 205274658 205130329
2213 205130329 204870453 204540234 204207020 203933353 203754864 203672276 203658905 203676071 203687649 203667965 203603420
2224B03603420j12324j53312j78833j83392j68514j44520j26285j25885j44844j71681
2234B02093830j88045j78566j40458q5411l4198n722q374l6430p4291j03894j11980
2245B01126461r4089n4207j622N2166R5654J19324J16481Q5011K8934m2209j14365
2256B01317539j73664k10438k22644k15550j99184j83201j73073j68133j63650j53714
2266A99454288j35250j10473q6441p3128p9632j09787j58691k12536k51408k57320
2276A97979622k22187j53961p5226j3943Q927j0930n9757j14021j53332j69678j69544
2287A96845970j65691j68152j77021j84136j79538j59207j27144r2697o3953m2629
2297A95485802k3747Q97L6487Q1673J26915J57776J60408J27353O2695j7166q5869
$$ plain form
2224 203603420 203491096 203337784 203158951 202975559 202807045 202662525 202536240 202410355 202265511 202093830
2234 202093830 201905785 201727219 201586761 201501350 201467152 201461430 201453056 201416626 201342335 201238441 201126461
2245 201126461 201032372 200978165 200976543 201028709 201124363 201243687 201360168 201445179 201474113 201431904 201317539
2256 201317539 201143875 200933437 200710793 200495243 200296059 200112858 199939785 199771652 199608002 199454288
2266 199454288 199319038 199208565 199122124 199048996 198969364 198859577 198700886 198488350 198236942 197979622
2276 197979622 197757435 197603474 197528248 197514305 197523232 197512302 197452545 197338524 197185192 197015514 196845970
2287 196845970 196680279 196512127 196335106 196150970 195971432 195812225 195685081 195592384 195528431 195485802
2297 195485802 195462055 195462952 195499439 195581112 195708027 195865803 196026211 196153564 196216259 196199093 196113224
2308A96113224j14346p9555K6302J89076L69930N09720N42698M21161J42651k31781
2318A97889080n85842p89070p59335n16681j91651K7542q106l19672p74059j144676
2328A92827530j232090r74636m83074K3231L37906L69091J56803j94683o11153j091442
2338A89127483j657982k254142k672959k598400j762905j39179J956997L938389N176525
2347A89113827N275917M248066K490825N92060r32178j828709k143230k114143k005730
2356A92696705j980572k063084k185630k262802k244091k123452j921043j662903j375217
2365A74877911j088562q39348o58512n54753n05504m65603l89843k55184o9199J39446
2375A70190849L39585N11722O49777P53765Q19816Q38337P99885P04384N66006M10862
$$ plain form
2308 196113224 195998878 195919323 195945625 196134701 196504631 197014351 197557049 197978210 198120861 197889080
2318 197889080 197303238 196514168 195754833 195238152 195046501 195074043 195065937 194746265 193972206 192827530
2328 192827530 191595440 190620804 190137730 190160961 190498867 190867958 191024761 190830078 190218925 189127483
2338 189127483 187469501 185215359 182542400 179944000 178181095 178041916 179998913 183937302 189113827
2347 189113827 194389744 198637810 201128635 201720695 200788517 198959808 196816578 194702435 192696705
2356 192696705 190716133 188653049 186467419 184204617 181960526 179837074 177916031 176253128 174877911
2365 174877911 173789349 172950001 172291489 171736736 171231232 170765629 170375786 170120602 170051403 170190849
2375 170190849 170530434 171042156 171691933 172445698 173265514 174103851 174903736 175608120 176174126 176584988
2385A76584988K67772J58348R0695N8403M4575K8877m769o2904j38702k15359k72179
2396A76539745k94075k78339k36492j89190j57242j52988j76087k15435k55432k83928
2406A74300537k96612k97470k94189k92702k93140k90470k79484k60525k42348k38590
2416A71515007k59438l02810l52783l84350l77560l28102k51141j74770j25256j15604
2426A68843193j41201j85413k29950k62585k79217k80037k65789k37064j97830j58024
2436A66606083j31855j32046j61819k11487k62585k96821l05138k90890k66285k44083
2446A64303074k31342k27108k26517k25716k25887k32620k52133k86922l32489l77693
2456A61684647m08059m10919l80440l21197k47355j78680j33972j24292j49556j99394
$$ plain form
2385 176584988 176852760 177011108 177101803 177160206 177204781 177233658 177228889 177165985 177027283 176811924 176539745
2396 176539745 176245670 175967331 175730839 175541649 175384407 175231419 175055332 174839897 174584465 174300537
2406 174300537 174003925 173706455 173412266 173119564 172826424 172535954 172256470 171995945 171753597 171515007
2416 171515007 171255569 170952759 170599976 170215626 169838066 169509964 169258823 169084053 168958797 168843193
2426 168843193 168701992 168516579 168286629 168024044 167744827 167464790 167199001 166961937 166764107 166606083
2436 166606083 166474228 166342182 166180363 165968876 165706291 165409470 165104332 164813442 164547157 164303074
2446 164303074 164071732 163844624 163618107 163392391 163166504 162933884 162681751 162394829 162062340 161684647
2456 161684647 161276588 160865669 160485229 160164032 159916677 159737997 159604025 159479733 159330177 159130783
2466A59130783k57635l08180l38898l44534l26166k90632k49090k14205j96075j98365
2476A56407003k15988k37646k52418k57159k59599k74229l12758l74536m43240m94661
2486A53284769n09090m84333m38252m00801l98054m38328n07621n76506o14872o06031
2496A48310881n53151m75444l97816l39851l08581k99349l00884l02000k97241k87686
2506A44748878k78663k76060k82002k94018l05519l08799k99406k78340k52914k34213
2516A41938944k32535k53324k93989l44649l91321m21257m27618m12311l84531l56980
2526A38420429l40481l39498l50857l66154l77330l81203l80869l83711l95002m13323
2536A34692001m29296m31299m13056l80211l50322l43733l71876m28028m88024n21393
$$ plain form
2466 159130783 158873148 158564968 158226070 157881536 157555370 157264738 157015648 156801443 156605368 156407003
2476 156407003 156191015 155953369 155700951 155443792 155184193 154909964 154597206 154222670 153779430 153284769
2486 153284769 152775679 152291346 151853094 151452293 151054239 150615911 150108290 149531784 148916912 148310881
2496 148310881 147757730 147282286 146884470 146544619 146236038 145936689 145635805 145333805 145036564 144748878
2506 144748878 144470215 144194155 143912153 143618135 143312616 143003817 142704411 142426071 142173157 141938944
2516 141938944 141706409 141453085 141159096 140814447 140423126 140001869 139574251 139161940 138777409 138420429
2526 138420429 138079948 137740450 137389593 137023439 136646109 136264906 135884037 135500326 135105324 134692001
2536 134692001 134262705 133831406 133418350 133038139 132687817 132344084 131972208 131544180 131056156 130534763
2546A30534763n07745m48170l65420k91728k51294k48632k67830k84786k82412k59952
2556A27326794k30360k08445j98431j89438j63050j06916k6302N5780J09987J16177
2566A26485796P5817J1339m5032o7024m5567J0347Q1702J51195K10867K61269L06177
2577A27436886L44686L69749L72191L48816L08142K69336K53706K73361L23639L83578
2587A30684090M26006M30651L94087L30057K61230K06747J73130J53265J33047J01586
2597A33293896N6724N770m0894p5874r8724j14546j30606j52445j82561k20213k61441
2608A32079086k99749l26042l32985l19176k93493k73762k78912l17392l79782m40282
2618A28817511m69284m50135l89766l16334k64044k53925k82870l26471l55453l53203
$$ plain form
2546 130534763 130027018 129578848 129213428 128921700 128670406 128421774 128153944 127869158 127586746 127326794
2556 127326794 127096434 126887989 126689558 126500120 126337070 126230154 126203852 126259632 126369619 126485796
2566 126485796 126561613 126572952 126527920 126460896 126415329 126425676 126507378 126658573 126869440 127130709 127436886
2577 127436886 127781572 128151321 128523512 128872328 129180470 129449806 129703512 129976873 130300512 130684090
2587 130684090 131110096 131540747 131934834 132264891 132526121 132732868 132905998 133059263 133192310 133293896
2597 133293896 133350620 133356390 133315496 133239622 133140898 133026352 132895746 132743301 132560740 132340527 132079086
2608 132079086 131779337 131453295 131120310 130801134 130507641 130233879 129954967 129637575 129257793 128817511
2618 128817511 128348227 127898092 127508326 127191992 126927948 126674023 126391153 126064682 125709229 125356026
2628A25356026l24307k89688k70595k74840k92129l02430k89545k51960k03104j61782
2638A22695646j39847j35412j34248j19086p9613j7938N2767J14355J51214J55487
2648A22543325J29204Q3370L4562l82j0662M072L3150N9566O8989N7583L5076J9484
2660A23057337K6989O2017J13850J61981J86968J80321J49279J11723Q6908Q6374J09358
2671A24333105J44882J78109J97353J98326J84374J64451J48049J43223J53150J77431
2681A26022453K13147K57253L07465L62272M19178M72851N14984N36604N31940N02072
2691A30140219M55942M08153L73145L60317L69892L92857M14047M17452L91779L34644
2701A34058447K54326J68237R7380N9509O2218R9411J53113J99651K18649J99957J46523
$$ plain form
2628 125356026 125031719 124742031 124471436 124196596 123904467 123602037 123312492 123060532 122857428 122695646
2638 122695646 122555799 122420387 122286139 122167053 122087440 122069502 122122269 122236624 122387838 122543325
2648 122543325 122672529 122755899 122790461 122790079 122779417 122783489 122816639 122876205 122945194 123002777 123037853 123057337
2660 123057337 123084326 123146343 123260193 123422174 123609142 123789463 123938742 124050465 124137373 124223747 124333105
2671 124333105 124477987 124656096 124853449 125051775 125236149 125400600 125548649 125691872 125845022 126022453
2681 126022453 126235600 126492853 126800318 127162590 127581768 128054619 128569603 129106207 129638147 130140219
2691 130140219 130596161 131004314 131377459 131737776 132107668 132500525 132914572 133332024 133723803 134058447
2701 134058447 134312773 134481010 134578390 134637899 134700117 134799528 134952641 135152292 135370941 135570898 135717421
2712A35717421P2088m578o6900j05267j18570j13001r8028q2588p1974o7158o6662
2723A34994783o9389p6828r3908j26171j76831k43253l16735l84636m34360m57087
2733A32615585m50277m18358l71647l24411k91033k81334k96058l25089l50981l56321
2743A29150076l32689k85159k29673j84164j58691j51263j51147j48297j40562j34678
2753A27233753j39017j54533j70632j70040j40304q3962k0447K3032K6016j2970p4968
2764A26315928j29357j48821j21574n5514K6408R6769J34869J33114R8934M9991P534
2775A26408281j2111k604L1338P7915J24970J65872K01340K36034K72999L09057L35532
2786A28148623L42721L26100K89564K44198K02808J74952J63107J62744J64747J58349
$$ plain form
2712 135717421 135789509 135784931 135718031 135612764 135494194 135381193 135283165 135200577 135128603 135061445 134994783
2723 134994783 134925394 134848566 134754658 134628487 134451656 134208403 133891668 133507032 133072672 132615585
2733 132615585 132165308 131746950 131375303 131050892 130759859 130478525 130182467 129857378 129506397 129150076
2743 129150076 128817387 128532228 128302555 128118391 127959700 127808437 127657290 127508993 127368431 127233753
2753 127233753 127094736 126940203 126769571 126599531 126459227 126375265 126354818 126377850 126403866 126390896 126315928
2764 126315928 126186571 126037750 125916176 125860662 125887070 125983839 126118708 126251822 126350756 126400747 126408281
2775 126408281 126396170 126393566 126424904 126502819 126627789 126793661 126995001 127231035 127504034 127813091 128148623
2786 128148623 128491344 128817444 129107008 129351206 129554014 129728966 129892073 130054817 130219564 130377913
2796A30377913J34305Q9064K7723l4513p6819q1195m3831J9159P5293Q9559M2420n8985
2808A30560093j82562k86627l40004l36389k93827k42081k05021j89152j84641j75514
2818A28124275j52893j21441r6216r3832j22414j77869k46621l12481l63492l94469
2828A26042547m06799m05521l96443l84273l71819l59926l47986l35417l22676l12624
2838A22399063l09582l17239l35751l60460l83215l95975l95327l83978l69968l62082
2848A18785486l64895l76501l89623l96262l91912l79009l64886l57589l60985l71285
2858A15032539l78446l70560l39050k83499k11754j37462p6046l9854l6145o4983j18818
2869A12975922j83573k40765k72398k67954k28853j70145j14384q1987q0957j03321
$$ plain form
2796 130377913 130512218 130601282 130629005 130594492 130517673 130436478 130392647 130411806 130487099 130576658 130619078 130560093
2808 130560093 130377531 130090904 129750900 129414511 129120684 128878603 128673582 128484430 128299789 128124275
2818 128124275 127971382 127849941 127753725 127659893 127537479 127359610 127112989 126800508 126437016 126042547
2828 126042547 125635748 125230227 124833784 124449511 124077692 123717766 123369780 123034363 122711687 122399063
2838 122399063 122089481 121772242 121436491 121076031 120692816 120296841 119901514 119517536 119147568 118785486
2848 118785486 118420591 118044090 117654467 117258205 116866293 116487284 116122398 115764809 115403824 115032539
2858 115032539 114654093 114283533 113944483 113660984 113449230 113311768 113235722 113195868 113159723 113094740 112975922
2869 112975922 112792349 112551584 112279186 112011232 111782379 111612234 111497850 111415863 111334906 111231585
2879A11231585j29538j40162j26953r7208o9170o0043p5674j06754j35584j47839j41935
2890A10000725j30453j32513j61543k15740k77997l23829l33872l03345k43788j76830
2900A07700815j23024r3651q7156r3555j02148j07956j13545j25217j46361j72157
2910A06536045j90887j89219j61133j13029o2781l1166l1290o0548j00508j25714j16100
2921A05353670o7406O113P8240J23138J26820R2869L8604j4572n2099p1850q2473r5234
2933A05435820j15948j40381j58052j59417j43079j16845r3250q0871q0128q4381q7443
2944A04176025q9912r9773j26343j70813k21538k58932k66819k43788k05775j76305
2954A02316027j72291j91412k13566k12622j73301j01795k2746L4228N0773K8849j2093
$$ plain form
2879 111231585 111102047 110961885 110834932 110737724 110668554 110608511 110532837 110426083 110290499 110142660 110000725
2890 110000725 109870272 109737759 109576216 109360476 109082479 108758650 108424778 108121433 107877645 107700815
2900 107700815 107577791 107484140 107396984 107303429 107201281 107093325 106979780 106854563 106708202 106536045
2910 106536045 106345158 106155939 105994806 105881777 105818996 105787830 105756540 105695992 105595484 105469770 105353670
2921 105353670 105286264 105292377 105370617 105493755 105620575 105713444 105752048 105737476 105685377 105613527 105531054 105435820
2933 105435820 105319872 105179491 105021439 104862022 104718943 104602098 104508848 104427977 104347849 104263468 104176025
2944 104176025 104086113 103986340 103859997 103689184 103467646 103208714 102941895 102698107 102492332 102316027
2954 102316027 102143736 101952324 101738758 101526136 101352835 101251040 101228294 101262522 101313295 101342144 101330051
2965A01330051m7559o1875n6791n0325o7711j28613k36234l71676m98180n72224n60551
2976I8678312m55198k79980q4047P6275J59531J53350P5636l8986j57337k60096l42397
2987I7525063m04263m39291m31595l62921k27069m0789J56879L16544L97253L82633
2997I6872444K85216J40466q640j26686j96161k19374k12860j97754j90039j95112
3007I5951500k07071k14768k08368j85881j53961j23558j03741r6206r5053r1782q1653
3018I4389458o7730n9424o5555q7252j13754j25971j05896m7426L7651J22022J74342
3029I4050465J73511J19438L3732n0078j02300j10264q3027m4327j9054k1086m8161
3040I3898849q6078j18046j33457j30510j13183q7013n5933k3279N674K3594K3823
$$ plain form
2965 101330051 101282492 101220617 101163826 101113501 101045790 100917177 100680943 100309267 99811087 99238863 98678312
2976 98678312 98223114 97943134 97859087 97935362 98094893 98248243 98323879 98284893 98127556 97867460 97525063
2987 97525063 97120800 96681509 96249914 95886993 95659924 95619135 95776014 96092558 96489811 96872444
2997 96872444 97157660 97298126 97289486 97162800 96966639 96747265 96534405 96336651 96146612 95951500
3007 95951500 95744429 95529661 95321293 95135412 94981451 94857893 94754152 94657946 94562893 94471111 94389458
3018 94389458 94321728 94262304 94196749 94109497 93995743 93869772 93763876 93716450 93754101 93876123 94050465
3029 94050465 94223976 94343414 94377146 94327068 94224768 94114504 94031477 93987150 93968096 93947010 93898849
3040 93898849 93812771 93694725 93561268 93430758 93317575 93230562 93174629 93151350 93157024 93180618 93204441
3051I3204441M807k7438o1540q6823r8953j01356j01653j05810j14708j25313j35202
3062I2250452j45569j60417j81742k04477k17228k08884j76849j31712r3069p8592
3072I0651913r3146j25456j54905j64518j51520j28756j15251j23558j51158j82170
3082H9261475j97459j86376j52264j08957p0954m5881l2062k4014j9302k2621m2525
3093H8359060q4543j44615k07815k53887k65570k36101j72253r1333j5211L6773N3768
3104H6978273L6812j802m2658o6986o4612l8967n712J5058R203k4252p2679j18132
3116H6603546j46885j56879j55916j54915j58711j62763j57242j35298j00374o6681
3126H5207882n1489o4964j03321j49069j80245j81923j54447j14403q6946r4481j46293
$$ plain form
3051 93204441 93209248 93181810 93120270 93033447 92934494 92833138 92731485 92625675 92510967 92385654 92250452
3062 92250452 92104883 91944466 91762724 91558247 91341019 91132135 90955286 90823574 90730505 90651913
3072 90651913 90558767 90433311 90278406 90113888 89962368 89833612 89718361 89594803 89443645 89261475
3082 89261475 89064016 88877640 88725376 88616419 88545465 88499584 88467522 88443508 88424206 88401585 88359060
3093 88359060 88274517 88129902 87922087 87668200 87402630 87166529 86994276 86902943 86887732 86924505 86978273
3104 86978273 87015085 87013283 86970625 86903639 86839027 86800060 86794348 86809406 86818609 86794357 86721678 86603546
3116 86603546 86456661 86299782 86143866 85988951 85830240 85667477 85510235 85374937 85274563 85207882
3126 85207882 85156393 85091429 84988108 84839039 84658794 84476871 84322424 84208021 84121075 84026594 83880301
3137H3880301k33889l34206m18186m61788m55036m04825l31698k61726k16036k03867
3147H0559044k20556k52285k83943l07035l23486l42770l75166m23846m81410n31559
3157G7016988n57537n50156n13310m62509m17075l91121l87587l98493m11258m16684
3167G2511258m14057m09941m12956m26983m48533m68206m76680m70090m52294m32720
3177F8098798m21162m22811m35334m49919m54951m40836m04825l53145k99812k61826
3187F4154177k52304k74272l18981l68809m05464m17505m04644l75724l43012l16039
3197F0677423k98872k91500k92897l02563l18360l34282l38993l19733k69466j93005
3207E7717752j07831l7971l972j4739o3901j33977k03691k55141k78625k73757k48537
$$ plain form
3137 83880301 83646412 83312206 82894020 82432232 81977196 81572371 81240673 80978947 80762911 80559044
3147 80559044 80338488 80086203 79802260 79495225 79171739 78828969 78453803 78029957 77548547 77016988
3157 77016988 76459451 75909295 75395985 74933476 74516401 74125280 73737693 73339200 72927942 72511258
3167 72511258 72097201 71687260 71274304 70847321 70398788 69930582 69453902 68983812 68531518 68098798
3177 68098798 67677636 67254825 66819491 66369572 65914621 65473785 65068960 64715815 64416003 64154177
3187 64154177 63901873 63627601 63308620 62939811 62534347 62116842 61712198 61336474 60993462 60677423
3197 60677423 60378551 60087051 59794154 59491591 59173231 58838949 58499956 58180223 57910757 57717752
3207 57717752 57609921 57571950 57567978 57553239 57489338 57355361 57151670 56896529 56617904 56344147 56095610
3218E6095610k16837j94111j91283k09680k38142k57511k49939k09270j46565q5731
3228E4096541n1293n5432r1892j40743j79672j96753j93781j81900j71647j66497j62716
3239E2504215j55654j45836j40056j46852j69248k01826k33627k54688k62528k62904
3249E0530996k65789k79755l08285l50299m01845m57201n08332n44653n55525n36981
3259D6322331m97469m58656m47964m85530n72157o87061p96175q68292q88938q65164
3269C9754925q19268p75707p49669p42190p43826p41889p27782p00043o63290o24501
3279C2466760n89202n58581n28524m90973m37031l61802k67477j64061o5455J6396
3289B9020050P7004J20864J58374K00894K55685L24533M04525M89928N73407O46469
$$ plain form
3218 56095610 55878773 55684662 55493379 55283699 55045557 54788046 54538107 54328837 54182272 54096541
3228 54096541 54045248 53989816 53897924 53757181 53577509 53380756 53186975 53005075 52833428 52666931 52504215
3239 52504215 52348561 52202725 52062669 51915817 51746569 51544743 51311116 51056428 50793900 50530996
3249 50530996 50265207 49985452 49677167 49326868 48925023 48467822 47959490 47414837 46859312 46322331
3259 46322331 45824862 45366206 44918242 44432712 43860555 43173494 42377319 41509027 40620089 39754925
3269 39754925 38935657 38159950 37410281 36668091 35924265 35182376 34454594 33754551 33091261 32466760
3279 32466760 31877558 31318977 30790453 30299480 29862449 29500647 29233170 29069109 29003654 29020050
3289 29020050 29097054 29217918 29376292 29577186 29832871 30157404 30561929 31051857 31625264 32271733
3299C2271733P00712P30918P37922P29876P18894P15186P21481P32970P42011P46055
3309C9547758P51124P68475Q05483Q56213R00875R13958Q78616P97767O94871O03156
3319D7518296N49307N41496N67484O03957O29530O34737O23017O04424N86887N71327
3329E3430462N52812N25970M90637M53586M25082M13713M21186M41131M61569M70133
3339E8086281M59041M28195L84479L39365L03936K84476K80152K83436K84133K74597
3349F1408091K53863K28944K10991K08964K24462K49748K71659K78711K67835K45661
3359F3848929K24471K14916K19083K30112K36559K30512K12140J90268J76458J78199
3369F5961647J94821K18678K40450K55227K64587K75073K92316L16291L39751L50914
$$ plain form
3299 32271733 32972445 33703363 34441285 35171161 35890055 36605241 37326722 38059692 38801703 39547758
3309 39547758 40298882 41067357 41872840 42729053 43629928 44543886 45422502 46220269 46915140 47518296
3319 47518296 48067603 48609099 49176583 49780540 50410070 51044807 51667824 52272248 52859135 53430462
3329 53430462 53983274 54509244 54999881 55453467 55878549 56292262 56713448 57154579 57616148 58086281
3339 58086281 58545322 58973517 59357996 59697361 60001297 60285773 60565925 60849361 61133494 61408091
3349 61408091 61661954 61890898 62101889 62310853 62535315 62785063 63056722 63335433 63603268 63848929
3359 63848929 64073400 64288316 64507399 64737511 64974070 65204582 65416722 65606990 65783448 65961647
3369 65961647 66156468 66375146 66615596 66870823 67135410 67410483 67702799 68019090 68358841 68709755
3379F8709755L39708L03612K50592J97392J62849J59850J89147K37971K85334L11532
3389G1147742L07431K78779K43063K20160K22044K46744K80085L04184L06849K87853
3399G3844934K57830K31443K18558K19750K26641K28186K17485J96519J74732J63470
3409G5979548J68600J86419K04229K07134J85151J39532Q1916K8805o403j8902j2627
3420G7143402M344K5282M7483P0324R1601J04518R9444O8216Q970p2537j65705k58732
3432G7166610l40858m02212m32720m24399l76649l01876k25239j76025j73187k13270
3442G4100175k69408l03731k86885k13413j02386J4848J14541J92080K60468L36279
3452G3842568M25148N16129N89175O29859O38991O31909O25839O27375O27856O10590
$$ plain form
3379 68709755 69049463 69353075 69603667 69801059 69963908 70123758 70312905 70550876 70836210 71147742
3389 71147742 71455173 71733952 71977015 72197175 72419219 72665963 72946048 73250232 73557081 73844934
3399 73844934 74102764 74334207 74552765 74772515 74999156 75227342 75444827 75641346 75816078 75979548
3409 75979548 76148148 76334567 76538796 76745930 76931081 77070613 77152529 77181334 77174931 77156029 77143402
3420 77143402 77147746 77173028 77220511 77290835 77382436 77486954 77586398 77654614 77663584 77591047 77425342 77166610
3432 77166610 76825752 76423540 75990820 75566421 75189772 74887896 74662657 74486632 74313445 74100175
3442 74100175 73830767 73527036 73240151 73026738 72924352 72939200 73053741 73245821 73506289 73842568
3452 73842568 74267716 74783845 75373020 76002879 76641870 77273779 77899618 78526993 79154849 79765439
3462G9765439N64914M95395M19951L57456L14245K79265K31037J51749L7365j03655
3472H2513161k60706m33064o33573q80480j183767j535945j914049k290883k646556
3481G0734138k971067l256488l485627l627853l647695l522248l254619k874169k422028
3490D1672344j930613j412187q62274k76787L31761R29025J469187J913045K242493
3499D4075994K461777K588468K641225K633252K574272K476845K358641K238889K129989
3508F6179352K032213J934600J823540J691274J541171J385351J239852J118017J028089
3517G9973459R72300R45930R37424R29031R02157Q45919P64170O77728O15168N98850
3527H8162136O30989O89736P38391P44544O97860O16970N39856N02405N16682N61352
$$ plain form
3462 79765439 80330353 80825748 81245699 81603155 81917400 82196665 82427702 82579451 82616816 82513161
3472 82513161 82252455 81819391 81185818 80305338 79121571 77585626 75671577 73380694 70734138
3481 70734138 67763071 64506583 61020956 57393103 53745408 50223160 46968541 44094372 41672344
3490 41672344 39741731 38329544 37467270 37190483 37522244 38451269 39920456 41833501 44075994
3499 44075994 46537771 49126239 51767464 54400716 56974988 59451833 61810474 64049363 66179352
3508 66179352 68211565 70146165 71969705 73660979 75202150 76587501 77827353 78945370 79973459
3517 79973459 80945759 81891689 82829113 83758144 84660301 85506220 86270390 86948118 87563286 88162136
3527 88162136 88793125 89482861 90221252 90965796 91663656 92280626 92820482 93322887 93839569 94400921
3537I4400921N92012N67045M73872L41692K29416J94158K58198L94344N38960O27851
3547I8618469O31256N68543M92325M53872M73509N34773O03542O55480O88801P13100
3557A04433670P23648O86846N53398K96679n0078l86934n84803n49030k72741J52940
3567A05003595N79777Q70228R55057Q51975O42786M29592K95524K85206M00057O00977
3577A10914774Q12740R37958Q88186O27813K08540k32868n25465n45006k80934J51196
3587A12956934N64823P96442P82252N78651L15456J18943N2862J09205K41671M08773
3597A16926012N90830P74526R25122R80148Q77953O05182K26832j27707l20730k73771
3607A21184397n846L75414P21731R02386Q46652N62897J38808k74106m94804l74222
$$ plain form
3537 94400921 94992933 95559978 96033850 96375542 96604958 96799116 97057314 97451658 97990618 98618469
3547 98618469 99249725 99818268 100310593 100764465 101237974 101772747 102376289 103031769 103720570 104433670
3557 104433670 105157318 105844164 106397562 106694241 106644163 106257229 105672426 105123396 104850655 105003595
3567 105003595 105583372 106453600 107408657 108260632 108903418 109333010 109628534 109913740 110313797 110914774
3577 110914774 111727514 112665472 113553658 114181471 114390011 114157143 113631678 113086672 112805738 112956934
3587 112956934 113521757 114318199 115100451 115679102 115994558 116113501 116166363 116275568 116517239 116926012
3597 116926012 117516842 118291368 119216490 120196638 121074591 121679773 121906605 121778898 121458168 121184397
3607 121184397 121178551 121553965 122275696 123178082 124024734 124587631 124726439 124452333 123957529 123583307
3617A23583307J27659Q84276J611070J964522J699466Q10395m32139j584053k227144
3626A26437359k159071j472035m81939M42391J047315J271362J211958J029549Q62217
3635A28189106P92513Q55045J043949J298170J482792J410656R28250K9430j078711
3644A34951200k026472k445135k160368j297226k26059O26173R87149Q52089M42505
3653A29703856N2747j09443L185L08218O80494J020355J265650J367960J278687R73844
3663A36545553M96578k9897m50421o66017p00875o90660p89623j053772j382055j561385
3673A29717426j388807p95641J05228J071492J842727K239867K203436J771431J037378
3682A37804537J27630p98740j550923j943035j861925j329880n15289L28731R68266
$$ plain form
3617 123583307 123710966 124595242 126206312 128170834 129870300 130680695 130248556 128664503 126437359
3626 126437359 124278288 122806253 122324314 122766705 123814020 125085382 126297340 127326889 128189106
3635 128189106 128981619 129836664 130880613 132178783 133661575 135072231 136000481 136029911 134951200
3644 134951200 132924728 130479593 128319225 127021999 126795940 127422113 128409262 129261351 129703856
3653 129703856 129756603 129647160 129650345 129958563 130639057 131659412 132925062 134293022 135571709 136545553
3663 136545553 137042131 137012234 136561813 135895796 135194921 134504261 133714638 132660866 131278811 129717426
3673 129717426 128328619 127532978 127638206 128709698 130552425 132792292 134995728 136767159 137804537
3682 137804537 137932167 137133427 135582504 133639469 131777544 130447664 129932375 130261106 131229372
3691A31229372J275797J254377R96304O15454K05507j57433l89890l98531j24560L89261
3701A34895658R62925J325655J238003O30675l27959j284676j858797j819716j190281
3710A32571487k23922P24163J356010J538029J314831Q45852L15666j33219m21333
3719A37887564n21279m37851j97582J49527N26209Q30106R48344P85541L02296m43049
3729A39829826j271639j905851k054758j544609m39043R29308K061396K504787K077970
3738A40187387R76677l10831j251325j541424j252785p57980m83370o40497j101189
3747A33824663j492014j442680q29754J38578J042900J496697J361265Q04091J80378
3756A35084124j77098j29652K24762O40621Q73013P95145M32425p8679n63802q72364
$$ plain form
3691 131229372 132505169 133759546 134755850 135371304 135576811 135419378 135029488 134630957 134506397 134895658
3701 134895658 135858583 137184238 138422241 139052916 138724957 137440281 135581484 133761768 132571487
3710 132571487 132347565 133071728 134427738 135965767 137280598 138126450 138442116 138308897 137887564
3719 137887564 137366285 136928434 136730852 136880379 137406588 138236694 139185038 139970579 140272875 139829826
3729 139829826 138558187 136652336 134597578 133052969 132613926 133543234 135604630 138109417 140187387
3738 140187387 141164064 140853233 139601908 138060484 136807699 136049719 135566349 134925852 133824663
3747 133824663 132332649 130889969 130060215 130198793 131241693 132738390 134099655 134903746 135084124
3756 135084124 134907026 134777374 135002136 135642757 136515770 137310915 137743340 137664661 137100859 136228495
3766A36228495r12123o65341j96018L55683Q05273R88197Q33921M10338r8057m75159
3776A37275209n81979m24652j40820Q8387J47390M7035r5720j44062l1929J99938M42686
3787A36781483N99603O47068O33345O18801O07891N30205K91443j40305o78100j140557
3797A38750877j349802j240739r04255n28574k73514j64433q0566J48268O01196J180811
3807A36139269J646299J750174J389932O75421j32961p71647j110897j193390j159582
3816A37232618j121540j077308r25370n61809J3656O64483J182260J406965J320105
3825A38134060J047592P70483O04172N27229M05169R4585m42991j091385j627960j841727
3835A36579227j649360j135130m92945R4872N62572R78451J459045K031260K537117
$$ plain form
3766 136228495 135316372 134651031 134455013 134810696 135615969 136604166 137438087 137848425 137750368 137275209
3776 137275209 136693230 136268578 136127758 136216145 136363535 136410570 136314850 136170788 136138859 136338797 136781483
3787 136781483 137381086 138028154 138661499 139280300 139888191 140418396 140709839 140569534 139891434 138750877
3797 138750877 137401075 136160336 135256081 134727507 134453993 134289560 134208994 134357262 134958458 136139269
3807 136139269 137785568 139535742 140925674 141601095 141468134 140696487 139585590 138392200 137232618
3816 137232618 136111078 135033770 134108400 133546591 133560247 134224730 135406990 136813955 138134060
3825 138134060 139181652 139952135 140556307 141083536 141488705 141583290 141140299 140048914 138420954 136579227
3835 136579227 134929867 133794737 133301792 133396664 133959236 134937687 136396732 138427992 140965109
3844A40965109K660255K081919O93665j259337l205948m459591m522619l328447j292744
3853A28332262Q61073K417135K964926K536840J530590M76675k20222m34380l11794
3862A38153105j30186j20631l47585o97012r62239r67693o62670j41115M12035Q13045
3872A35349054R59530Q59928O05765L09458M8799j53637l08933m24271m81968m51278
3882A36312447l24784j44138J0881P0935L2091k6474J6088K42949O29368J033420J258354
3893A39111137J152525O91233q764p44353j315479j598863j573086j296397q63580
3902A33554373l70350J03569M95949P63025Q82559Q56638P09257M77352K03676o5355
3912A37610693k80190l94649l83196k60601q5678O1092J20039Q7233J7080j5383L0775
$$ plain form
3844 140965109 143625364 145707283 146400948 145141611 141935663 137476072 132953453 129625006 128332262
3853 128332262 129193335 131610470 134575396 137112236 138642826 139119501 138899279 138464899 138153105
3862 138153105 138022919 137902288 137554703 136857691 135895452 134927759 134265089 134123974 134536009 135349054
3872 135349054 136308584 137168512 137774277 138083735 138132534 137978897 137669964 137245693 136763725 136312447
3882 136312447 135987663 135843525 135854406 135925341 135957432 135930958 135947046 136189995 136819363 137852783 139111137
3893 139111137 140263662 140954895 140946131 140201778 138886299 137287436 135714350 134417953 133554373
3902 133554373 133184023 133287592 133783541 134546566 135429125 136285763 136995020 137472372 137676048 137610693
3912 137610693 137330503 136935854 136552658 136292057 136206379 136267471 136387510 136474743 136491823 136476440 136507215
3923A36507215J29233J99938J63698J936k20528l86982l94745k15225Q8873L97520
3933A36270933N93119O12564M66061K20499l5544k27451l16582l06911k37179j61534
3943A36877975j24025j37024j75991j95207j58463o4812M8399J28193J39132Q3837
3953A36422014k508p7219j14870j13983q6088m0655J7766Q0195J24273J21060N5694
3964A36385679n4455j64356k29149k35862k11296j97163k13299k39887k36435j83649
3974A34420128j07823o4039q8129j59998k16541k08187j52950j31522k18448m02422
3984A32670069n71413n93968m41084k41689k01226m22382K99234L17774L16725K96059
3994A31428099K55832J96009J16577J7567j01051k39239
$$ plain form
3923 136507215 136636448 136836386 137000084 137002020 136781492 136394510 135999765 135784540 135873413 136270933
3933 136270933 136864052 137476616 137942677 138163176 138127632 137900181 137583599 137276688 137039509 136877975
3943 136877975 136753950 136616926 136440935 136245728 136087265 136022453 136070852 136199045 136338177 136422014
3953 136422014 136419506 136342287 136227417 136113434 136027346 135986691 136004457 136084652 136208925 136329985 136385679
3964 136385679 136331224 136166868 135937719 135701857 135490561 135293398 135080099 134840212 134603777 134420128
3974 134420128 134312305 134248266 134160137 134000139 133783598 133575411 133422461 133290939 133072491 132670069
3984 132670069 132098656 131504688 131063604 130821915 130620689 130198307 130497541 130815315 131132040 131428099
3994 131428099 131683931 131879940 131996517 132014084 131913033 131673794
4000A31673794
$$ plain form
4000 131673794
##END=$$ End of the data block
