##TITLE=$$ Begin of the data block
##JCAMP-DX=5.00 $$ ACD/SpecManager v 10.08
##SPECTROMETER/DATA SYSTEM=16PC
##DATE=15 Jul 2013 14:29:28
##DATA TYPE=INFRARED SPECTRUM
##DATA CLASS=XYDATA
##ORIGIN=
##OWNER=
##NPOINTS=3601
##FIRSTX=400.00000000
##LASTX=4000.00000000
##MAXX=4000.00000000
##MINX=400.00000000
##MAXY=37.49436569
##MINY=7.32769775
##XFACTOR=1.0000000000
##YFACTOR=0.000000100000000
##FIRSTY=18.08743286
##DELTAX=1.00000000
##XUNITS=1/CM
##YUNITS=TRANSMITTANCE
##XYDATA=(X++(Y..Y))
400A80874329M2791938L2422085K0202599R995975M036198K211380K623119K958241
408B98115864J804542q05092l773937n836162o318932n341148l469219j207791J261292
417B74429417L937606O649647Q836594R695778Q634109N719204J804657j791057l885670
426C14030285l974362k413024j64681J721649K601567K450122J732712J055813Q18043
435C17858124J042709J446228J665116J485633R51271L03536j82686l60336k73171
444C23936424r6054o218p3814k36778l64876l55568j95961M7684K87590M68750N77659
455C23988838O10924N42908L35235j2703m17709p22771p77511n39627j23558K54440
465C23138466M10080L14903J21727O2065K82898P33376J185035J377335J191559P33032
$$ y = [180874329, 223666267, 256088352, 276290951, 286286926, 290323124, 292534504, 295157623, 298115864, 299920406, 299115314, 295341377, 289505215, 283186283, 277845135, 274375916, 273168125, 274429417, 278367023, 285016670, 293853264, 303549042, 312183151, 317902355, 319707012, 317915955, 314030285, 310055923, 307642899, 307478218, 309199867, 311801434, 314251556, 315984268, 317040081, 317858124, 318900833, 320347061, 322012177, 323497810, 324449081, 324752617, 324569931, 324209595, 323936424, 323840370, 323834152, 323760338, 323523560, 323158684, 322803116, 322607155, 322654839, 322942429, 323411179, 323988838, 324599762, 325142670, 325477905, 325465202, 325047493, 324324722, 323547211, 323007584, 322884026, 323138466, 323548546, 323863449, 323985176, 324047241, 324330139, 325063515, 326248550, 327625885, 328817444, 329550476]
475C29550476K63748K9145R8304L23220M47311K85454j42708o18439q61778p14531
485C28660202k47841K70233N29366L57094j82305q25233j257515j287079r41010m37469
495C24638443n3406L2463j69182m82749o89393o71081m85306l27911m01383p73315
505C20617180j313763j755924j848049j505566q72059k51808M7245j34258p41482j557579
515C10683937k325611k866955l129921l161487l043099k840557k595138k341023k113762
524B86266384j931400j762390j518135j095791m57535L04947R76543J309090J153984
533B83245697N53856k71263j047878j613827k019634k492066l270702m405346n643768
542B63035069o492157o435719n210056k973290k79693K144699L708000M184780L758392
$$ y = [329550476, 329814224, 329843369, 329941673, 330264893, 330712204, 330997658, 330854950, 330236511, 329374733, 328660202, 328412361, 328682594, 329211960, 329569054, 329386749, 328561516, 327304001, 326016922, 325075912, 324638443, 324585037, 324617500, 324448318, 323965569, 323276176, 322605095, 322119789, 321791878, 321390495, 320617180, 319303417, 317547493, 315699444, 314193878, 313321819, 313070011, 313117256, 312982998, 312241516, 310683937, 308358326, 305491371, 302361450, 299199963, 296156864, 293316307, 290721169, 288380146, 286266384, 284334984, 282572594, 281054459, 279958668, 279501133, 279806080, 280782623, 282091713, 283245697, 283799553, 283528290, 282480412, 280866585, 278846951, 276354885, 273084183, 268678837, 263035069, 256542912, 250107193, 244897137, 241923847, 241644154, 243788853, 247496853, 251681633, 255440025]
551B55440025K863827J934128J196079O21548M2400o66294j457767k122651k421360
560B55429935k246437j705551j073608o45752n88474q73986j330948j760559k040138
569B43164482k151623k135200k019539j789207j412983r04084l56846P9098K77405
578B32751503K14615q488k22893k94933k11697r4623j30234m59633j091366j886539
588B28565712k619743l079262l149052k835102k231197j454716n93319L09258J227932
597B14140511K114715K874355L375760L499507L194638K512684J597786O33144k29683
606B33713417r24492j479130j978969k507572l096981l710423m259052m633751m731426
615B06391621m469300l793296k697678j254330L65391J903496L079452L686409L676091
$$ y = [255440025, 258303852, 260237980, 261434059, 262055607, 262098007, 261431713, 259973946, 257851295, 255429935, 253183498, 251477947, 250404339, 249758587, 249170113, 248296127, 246965179, 245204620, 243164482, 241012859, 238877659, 236858120, 235068913, 233655930, 232751846, 232395000, 232474098, 232751503, 232966118, 232957630, 232734737, 232439804, 232228107, 232133484, 232003250, 231543617, 230452251, 228565712, 225945969, 222866707, 219717655, 216882553, 214651356, 213196640, 212603321, 212912579, 214140511, 216255226, 219129581, 222505341, 226004848, 229199486, 231712170, 233309956, 233943100, 233713417, 232788925, 231309795, 229330826, 226823254, 223726273, 220015850, 215756798, 211123047, 206391621, 201922321, 198129025, 195431347, 194177017, 194542408, 196445904, 199525356, 203211765, 206887856]
624B06887856L180751K455426J764030J271591R97181Q49896P13710N27440L10306
633B18958187J27468L1357K3518O4067J14193J73989K82516M79145P56054J039334
643B22049828J217842J202907R82647O36444L01743J15547J57700M24900Q35495J260719
653B29185772J567593J666278J550351J313304J124897J160718J507797K090969K670402
662B43838081K928830K616558J684761L32508j060429k085476k462864k131538j237145
671B42423286m2209J183967K243767L035565L540020L790855L850136L787060L654022
680B67466469L468227L208695K841224K362748J832618J362839J061115R60503R85222
689B85549660R87777Q41217N31521J80550k0447O5422M21295Q69770J167527J146965
$$ y = [206887856, 210068607, 212524033, 214288063, 215559654, 216556835, 217406731, 218120441, 218647881, 218958187, 219085655, 219117012, 219140530, 219204597, 219318790, 219492779, 219775295, 220254440, 221010494, 222049828, 223267670, 224470577, 225453224, 226089668, 226391411, 226506958, 226664658, 227089558, 227925053, 229185772, 230753365, 232419643, 233969994, 235283298, 236408195, 237568913, 239076710, 241167679, 243838081, 246766911, 249383469, 251068230, 251400738, 250340309, 248254833, 245791969, 243660431, 242423286, 242381077, 243565044, 245808811, 248844376, 252384396, 256175251, 260025387, 263812447, 267466469, 270934696, 274143391, 276984615, 279347363, 281179981, 282542820, 283603935, 284564438, 285549660, 286537437, 287378654, 287910175, 288090725, 288070278, 288135700, 288556995, 289426765, 290594292, 291741257]
699B91741257Q12721L35102n6934k12632j40380J2912O5594q1501l89328p13921r02061
710B90470829q84285p10297n10101m12369m72202o50349q51059r90390j050263j087971
720B82851543j194877j430454j769581k096081k248592k097817j614094q90674j04885
729B69404488N58414R85260J167870J181926J122914J042194R22432P03526L40519
738B77429543j51158o88438j162167j494484j676769j765747j840611j952514k098351
747B64599304k229709k287941k235489k066555j792450j422348r56097l98445K19192
756B51429462Q28457J341877J689530J855106J884670J859017J846161J861419J863423
765B66459122J789379J608848J359406J139431J056805J164665J421566J707058J883201
$$ y = [291741257, 292553978, 292889080, 292832146, 292619514, 292479134, 292492046, 292557640, 292476139, 292086811, 291372890, 290470829, 289586544, 288876247, 288366146, 287953777, 287481575, 286831226, 285980167, 284989777, 283939514, 282851543, 281656666, 280226212, 278456631, 276360550, 274111958, 272014141, 270400047, 269509373, 269404488, 269962902, 270948162, 272116032, 273297958, 274420872, 275463066, 276385498, 277089024, 277429543, 277278385, 276589947, 275427780, 273933296, 272256527, 270490780, 268650169, 266697655, 264599304, 262369595, 260081654, 257846165, 255779610, 253987160, 252564812, 251608715, 251210270, 251429462, 252257919, 253599796, 255289326, 257144432, 259029102, 260888119, 262734280, 264595699, 266459122, 268248501, 269857349, 271216755, 272356186, 273412991, 274577656, 275999222, 277706280, 279589481]
774B79589481J869450J682625J421127J199341J078396J035557R93290Q85753P15981
783B90471001N62648N26638O53954Q86459J079712J079274Q10966L25489k29816o95057
793B95471268r83429j112938j169644j229915j300431j316280j198025r25483n71652
802B85663471k71015j36566j81885k99415l13397p9212M32148J111793J768246K225514
812B89919682K408714K371235K251796K191430K257671K417984K570343K611637K497940
821C11498432K265377J996021J753312J525554J216774O97708j06239j139641k206764
830C17500534l047028l466854l462677l258037l218689l671589m714165o113853p362576
839B79185066p872410p223739n350838k576065N16758L304310N333099O432839O699810
$$ y = [279589481, 281458931, 283141556, 284562683, 285762024, 286840420, 287875977, 288869267, 289755020, 290471001, 291033649, 291560287, 292214241, 293100700, 294180412, 295259686, 296070652, 296396141, 296166325, 295471268, 294487839, 293374901, 292205257, 290975342, 289674911, 288358631, 287160606, 286235123, 285663471, 285392456, 285255890, 285074005, 284774590, 284461193, 284381981, 284814129, 285925922, 287694168, 289919682, 292328396, 294699631, 296951427, 299142857, 301400528, 303818512, 306388855, 309000492, 311498432, 313763809, 315759830, 317513142, 319038696, 320255470, 320953178, 320846939, 319707298, 317500534, 314453506, 310986652, 307523975, 304265938, 301047249, 297375660, 292661495, 286547642, 279185066, 271312656, 264088917, 258738079, 256162014, 256678772, 259983082, 265316181, 271749020, 278448830]
848B78448830O389351N785312N106411M475193L934059L479042L086281K727242K380275
857C15811996K042790J739807J516514J413383J433678J527176J607170J596794J476631
866C30165939J300965J168556J158485J274720J435966J519470J437187J190911Q73108
875C41525307O07910M72336M48265M38690L38440J09291j93176m65546o46019p88269
885C41847229j057167j637726k598495l793145m869461n396499n058461l816757j955986
894C11663532J0853J534786K228928J985092R70497m72050j957302l160667l860188
903C08943481l934021l343353k133102m45938J473274L311119M761295N617295N836696
912C20086746N542603M959335M314118L754806L319397K965355K630386K285614J951866
$$ y = [278448830, 284838181, 290623493, 295729904, 300205097, 304139156, 307618198, 310704479, 313431721, 315811996, 317854786, 319594593, 321111107, 322524490, 323958168, 325485344, 327092514, 328689308, 330165939, 331466904, 332635460, 333793945, 335068665, 336504631, 338024101, 339461288, 340652199, 341525307, 342133217, 342605553, 343053818, 343492508, 343830948, 343940239, 343747063, 343281517, 342635498, 341847229, 340790062, 339152336, 336553841, 332760696, 327891235, 322494736, 317436275, 313619518, 311663532, 311674385, 313209171, 315438099, 317423191, 318393688, 317921638, 315964336, 312803669, 308943481, 305009460, 301666107, 299533005, 299087067, 300560341, 303871460, 308632755, 314250050, 320086746, 325629349, 330588684, 334902802, 338657608, 341977005, 344942360, 347572746, 349858360, 351810226]
921C51810226J677170J497765J411438J379242J350784J291771J196747J079140R52796
930C63647079Q17566O62880M78402K61497J1444k86941o67458j164093j769142k394486
940C59596748k870597l002053k664795j895752r16404o0997L69148K56882k58332q30230
950C47723618j064682p08237K28004J472054K619018L314438L401642K963486K251663
959C62201004J551819J058769Q21495P68471P84264P82547P40890O85425O49834O41899
969C70686417O36291N97725N09644L90167K82287K26593K35329K83737L25089L18603
979C74491882K52838J49575M9362j4381l2158j8578J411J1597TJ0643J3046P897k4643
992C74910088r7084j95466k78625k94876k13623m7913J44882K88392L25470K46658
$$ y = [351810226, 353487396, 354985161, 356396599, 357775841, 359126625, 360418396, 361615143, 362694283, 363647079, 364464645, 365127525, 365605927, 365867424, 365878868, 365591927, 364924469, 363760376, 361991234, 359596748, 356726151, 353724098, 351059303, 349163551, 348247147, 348186150, 348555298, 348812180, 348553848, 347723618, 346658936, 345950699, 346178703, 347650757, 350269775, 353584213, 356985855, 359949341, 362201004, 363752823, 364811592, 365633087, 366401558, 367185822, 367968369, 368709259, 369394684, 370044518, 370686417, 371322708, 371920433, 372430077, 372820244, 373102531, 373329124, 373564453, 373848190, 374173279, 374491882, 374744720, 374894295, 374943657, 374929276, 374897118, 374878540, 374879951, 374891548, 374903145, 374913788, 374926834, 374934731, 374910088, 374813004, 374617538, 374338913, 374044037, 373830414, 373782501, 373927383, 374215775, 374541245, 374787903]
1002C74787903R2964o6910j72615j98212j57470q7853k6550O599J1673r53k1858m7265
1014C74119453p5645j01509j13182r8152n3482P858N8746O9771K4223p0572j84745
1025C73582764k79694l25928l17230k72102k20566j85165j69640j59721j40076j11961
1035C71400681j00289j38512k42309l87306n11437n44662m54254k72217q8196l624
1045C68657875p5340k82326n37910p41578q37669q42171q26301q67958j008797j243362
1055C61394463j541825j879463k242584k602692k880249k938423k629051j877480p55691
1064C42047005N05981J587677K195511K162552J482086K68593j311874l083191m845772
1073C41008568o332550p197762p085228n774078l328400j57795L071919N656833P105351
$$ y = [374787903, 374880867, 374813957, 374641342, 374443130, 374285660, 374197807, 374171257, 374177856, 374189529, 374188576, 374166718, 374119453, 374043808, 373942299, 373829117, 373730965, 373677483, 373685341, 373744087, 373813858, 373838081, 373767509, 373582764, 373303070, 372977142, 372659912, 372387810, 372167244, 371982079, 371812439, 371652718, 371512642, 371400681, 371300392, 371161880, 370919571, 370532265, 370020828, 369476166, 369021912, 368749695, 368661499, 368657875, 368582535, 368300209, 367762299, 367020721, 366183052, 365340881, 364514580, 363646622, 362637825, 361394463, 359852638, 357973175, 355730591, 353127899, 350247650, 347309227, 344680176, 342802696, 342047005, 342552986, 344140663, 346336174, 348498726, 349980812, 350249405, 348937531, 345854340, 341008568, 334676018, 327478256, 320393028, 314618950, 311290550, 311132755, 314204674, 319861507, 326966858]
1082C26966858P301102O502533N188865L840218K763328K034951J564331J213684Q98704
1091C58274574O20156M28047L60527M03290M90188N41573N06515L86429K26555Q7013
1101C62324867R003m387J2932Q507n8670j95656l66554n07889n60150n02587l71055
1112C59788361k44561k04811k90718m72221o65932p80525p71599o67343n50804n08652
1122C54631195n77888p23839q63457r19533q67500p49283o43501o15425o77834p89070
1132C47203865q86955r33762r42459r66568j061287j243973j479263j700516j854324
1141C36134758j937599k004280k136345k394905k784195l245011l685340m021645m208202
1150C09717236m233818m090767l743840l123378k158566q34198P61776K434502L933963
$$ y = [326966858, 334267960, 340770493, 345959358, 349799576, 352562904, 354597855, 356162186, 357375870, 358274574, 358894730, 359322777, 359683304, 360086594, 360576782, 361118355, 361624870, 362011299, 362237854, 362324867, 362333870, 362329483, 362342415, 362350922, 362292252, 362096596, 361730042, 361222153, 360662003, 360159416, 359788361, 359543800, 359338989, 359048271, 358576050, 357910118, 357129593, 356357994, 355690651, 355139847, 354631195, 354053307, 353329468, 352466011, 351546478, 350678978, 349929695, 349286194, 348670769, 347992935, 347203865, 346316910, 345383148, 344440689, 343474121, 342412834, 341168861, 339689598, 337989082, 336134758, 334197159, 332192879, 330056534, 327661629, 324877434, 321632423, 317947083, 313925438, 309717236, 305483418, 301392651, 297648811, 294525433, 292366867, 291532669, 292294445, 294728947, 298662910]
1159B98662910N040226N641766N765114N542717N137634M669838M181328L654327L062554
1168C41358414K418174J783486J242866Q55065O20804M84428L68843K17018J7319k04620
1178C49161797m13208n92843p57827r43642j187210j514854j939888k463570l066177
1187C36282578l684731m191360m396286m095021l153229j592121L69492K355022L945752
1196C21840096M827995M905395M322510L387833K436561J698227J232033R52110P16820
1205C46319580M25568P2365k69051n05829n91850n55611m78859m43611m83932n72815
1215C42915955o47889o57501n95817n05104m47693m64974n52635o64253p40891p47299
1225C36891899o92711o23092n94178o37970p45926q75206r73243j007729r81254r26819
$$ y = [298662910, 303703136, 309344902, 315110016, 320652733, 325790367, 330460205, 334641533, 338295860, 341358414, 343776588, 345560074, 346802940, 347658005, 348278809, 348763237, 349132080, 349349098, 349366417, 349161797, 348748589, 348155746, 347397919, 346454277, 345267067, 343752213, 341812325, 339348755, 336282578, 332597847, 328406487, 324010201, 319915180, 316761951, 315169830, 315539322, 317894344, 321840096, 326668091, 331573486, 335895996, 339283829, 341720390, 343418617, 344650650, 345602760, 346319580, 346745148, 346817513, 346548462, 346042633, 345450783, 344895172, 344416313, 343972702, 343488770, 342915955, 342268066, 341610565, 341014748, 340509644, 340061951, 339596977, 339044342, 338380089, 337639198, 336891899, 336199188, 335576096, 334981918, 334343948, 333598022, 332722816, 331749573, 330741844, 329760590, 328833771]
1235C28833771q85964q84933r22394r76829j025429j062088j103325j174698j290607
1244C19507504j438771j582508j680927j713810j697693j680469j719361j853332k086354
1253C04054279k388439k712059l013878l270054l483333l681221l909359m219265m648476
1262B72728195n194645n790920o300220o540280o338768n603676m377556k849826j319104
1271B28413200j15375M89521L55224m85172j821708l297158m469471m901619m269924
1280B09897518k465229L47061L741226P129517R917431J1662865J2179489J1547184
1288B63957062J0037937P996101N729332L445854J246701q46558k855263m810295o721096
1297B77179775q541584j0132961j1247025j1554317j0731449q587246n179920q66280
$$ y = [328833771, 327947807, 327062874, 326140480, 325163651, 324138222, 323076134, 321972809, 320798111, 319507504, 318068733, 316486225, 314805298, 313091488, 311393795, 309713326, 307993965, 306140633, 304054279, 301665840, 298953781, 295939903, 292669849, 289186516, 285505295, 281595936, 277376671, 272728195, 267533550, 261742630, 255442410, 248902130, 242563362, 236959686, 232582130, 229732304, 228413200, 228297825, 228787346, 229142570, 228657398, 226835690, 223538532, 219069061, 214167442, 209897518, 207432289, 207779350, 211520576, 218650093, 228567524, 240230389, 252409878, 263957062, 273994999, 281991100, 287720432, 291166286, 292412987, 291566429, 288711166, 283900871, 277179775, 268638191, 258505230, 247258205, 235703888, 224972439, 216385193, 211205273, 210338993]
1305B10338993L751316P972813J1188850J3038254J3478050J2746601J1249161R418602
1313B93182640P603874O014519M724216L709641K900829K224312J627960J090432O15730
1322C23694153K18696r1095l20358m91447o30684p53021q55027r21402r44271r39808
1332C17965736r49878j022148j180859j403770j627217j775513j803874j724988j604557
1341C04872932j525478j542759j655922j815147j956291k040101k071552k087860k125282
1350B88052540k189713k251968k271805k232704k163868k132149k207107k419777k740746
1359B67442703l089657l373127l525409l535309l444061l323155l244648l260326l393479
1368B37253532l641834l982162m375401m772339n122890n388985n556908n639991n670185
$$ y = [210338993, 214090309, 222063122, 233251972, 246290226, 259768276, 272514877, 283764038, 293182640, 300786514, 306801033, 311525249, 315234890, 318135719, 320360031, 321987991, 323078423, 323694153, 323912849, 323821754, 323501396, 323009949, 322379265, 321626244, 320771217, 319849815, 318905544, 317965736, 317015858, 315993710, 314812851, 313409081, 311781864, 310006351, 308202477, 306477489, 304872932, 303347454, 301804695, 300148773, 298333626, 296377335, 294337234, 292265682, 290177822, 288052540, 285862827, 283610859, 281339054, 279106350, 276942482, 274810333, 272603226, 270183449, 267442703, 264353046, 260979919, 257454510, 253919201, 250475140, 247151985, 243907337, 240647011, 237253532, 233611698, 229629536, 225254135, 220481796, 215358906, 209969921, 204413013, 198773022, 193102837]
1377A93102837n681572n694027n704460n688019n606251n417023n085678m597530l971644
1386A45656633l268070k578106j994104j565399j267023j005040o66904j95532L59011
1395A33475466Q51764J125946J127940R81359R62239J369915K348651L763504N205193
1404A51211977O140099O138334N065880L147258Q68435j224517k730256l505973l653851
1413A61457386l408670k998076k547569k061482j473999p26709J67475J106348J927623
1422A51442327K471476K648020K478180K088766J658592J337395J175995J105556R80416
1431A67386723O64691J18199n68848j207218j592026j586609j167068m10461N52291
1440A62189674J585312K573452L428021M091205M550515M853496N097027N372257N688420
$$ y = [193102837, 187421265, 181727238, 176022778, 170334759, 164728508, 159311485, 154225807, 149628277, 145656633, 142388563, 139810457, 137816353, 136250954, 134983931, 133978891, 133311987, 133116455, 133475466, 134327230, 135453176, 136581116, 137562475, 138524714, 139894629, 142243280, 146006784, 151211977, 157352076, 163490410, 168556290, 171703548, 172571983, 171347466, 168617210, 165111237, 161457386, 158048716, 155050640, 152503071, 150441589, 148967590, 148240881, 148408356, 149514704, 151442327, 153913803, 156561823, 159040003, 161128769, 162787361, 164124756, 165300751, 166406307, 167386723, 168051414, 168169613, 167600765, 166393547, 164801521, 163214912, 162047844, 161637383, 162189674, 163774986, 166348438, 169776459, 173867664, 178418179, 183271675, 188368702, 193740959, 199429379]
1449A99429379N923500N855903N284157M177456K761478J463909P25117P68471J465359
1458B27854729K387504L030606L084755K594623J912270J470737J517925J969681K470341
1467B48293171K615089K196083J323967L59021k94915m05063j0109O35624J224098
1476B55936966J554928J610527J516609J434631J454640J548080J595249J462250J085873
1485B69199753N24807m6139m03194l79601L3627O48155J142063J215668P73086K2412
1495B72730637n87025n88245K22969J613502K966518L564702K966537J266041r16538
1504B83239098k722283l466148k952690j529827J29833J381302J893062J725712J198311
1513B78896370O52924K68993J9512k38438o21719j125164j618462j921100j900768
$$ y = [199429379, 205352879, 211208782, 216492939, 220670395, 223431873, 224895782, 225620899, 226389370, 227854729, 230242233, 233272839, 236357594, 238952217, 240864487, 242335224, 243853149, 245822830, 248293171, 250908260, 253104343, 254428310, 254787331, 254492416, 254087353, 254077244, 254712868, 255936966, 257491894, 259102421, 260619030, 262053661, 263508301, 265056381, 266651630, 268113880, 269199753, 269724560, 269678421, 269275227, 268895626, 268929253, 269577408, 270719471, 271935139, 272708225, 272730637, 272143612, 271555367, 271778336, 273391838, 276358356, 279923058, 282889595, 284155636, 283239098, 280516815, 277050667, 274097977, 272568150, 272697983, 274079285, 275972347, 277698059, 278896370, 279549294, 279818287, 279837799, 279599361, 278977642, 277852478, 276234016, 274312916, 272412148]
1522B72412148j540471r50756l30028J08108K15130k7275m86526r23291j097183q96091
1532B66483765m21334K9507R3880m65946j613598l018647m188613m690152m349155
1541B47859707l325920k031918r39140l76415m11950q61301j405411j752128j772709
1550B34982815j558724j381130j566200k335777l673726n285186o681824p375011p098351
1559A98026886n952034m387074l019809k360096k587281l488235m588509n403461n673695
1568A60566692n461921n073700m859581n017176n499620o065636o426439o398402n978813
1577A09785404n320234m633246m080047l715248l489418l299713l050766k694354k238060
1586G7264318j726565j213412p37324l10039Q0423M56333Q33821J208763J555076J834035
$$ y = [272412148, 270871677, 269920921, 269590893, 269699001, 269914131, 269886856, 269400330, 268477039, 267379856, 266483765, 266062431, 266091938, 266185818, 265719872, 264106274, 261087627, 256899014, 252208862, 247859707, 244533787, 242501869, 241562729, 241186314, 240774364, 239913063, 238507652, 236755524, 234982815, 233424091, 232042961, 230476761, 228140984, 224467258, 219182072, 212500248, 205125237, 198026886, 192074852, 187687778, 184667969, 182307873, 179720592, 176232357, 171643848, 166240387, 160566692, 155104771, 150031071, 145171490, 140154314, 134654694, 128589058, 122162619, 115764217, 109785404, 104465170, 99831924, 95751877, 92036629, 88547211, 85247498, 82196732, 79502378, 77264318, 75537753, 74324341, 73587017, 73276978, 73357401, 73813734, 74647555, 75856318, 77411394, 79245429]
1596G9245429K010713K068185K011748J861696J642809J377630J091824Q23545O27013
1605I2760592N61380O65102R29737J291571J653165J926566K076873K142144K212829
1614A06219959K382355K692289L103581L508711L779058L823176L625574L253030K826415
1623A35214148K476902K305393K355699K604504K963190L293562L439503L277578K776632
1632A60707111K041436J305751Q59013R20277J513900K417965L232613L556347L193359
1641A79747772K277203J228523N47695N38750J121044J845856K130928J594105K99453
1650A91331329j237335k303009k369118j384563J89361J627388K331181K134647J355496
1659A91675377N71461K69470N79643J244927J823463J978531J668205J127224O75221
$$ y = [79245429, 81256142, 83324327, 85336075, 87197771, 88840580, 90218210, 91310034, 92133579, 92760592, 93321972, 93987074, 94916811, 96208382, 97861547, 99788113, 101864986, 104007130, 106219959, 108602314, 111294603, 114398184, 117906895, 121685953, 125509129, 129134703, 132387733, 135214148, 137691050, 139996443, 142352142, 144956646, 147919836, 151213398, 154652901, 157930479, 160707111, 162748547, 164054298, 164913311, 165833588, 167347488, 169765453, 172998066, 176554413, 179747772, 182024975, 183253498, 183801193, 184339943, 185460987, 187306843, 189437771, 191031876, 191331329, 190093994, 187790985, 185421867, 184037304, 184226665, 185854053, 188185234, 190319881, 191675377, 192246838, 192516308, 193095951, 194340878, 196164341, 198142872, 199811077, 200938301, 201613522]
1668B01613522M96196N41935O15044N58186M05998L81660P36084J534977K548103L325768
1678B12757473L433380K707710J380043j1940q80184q69255j4934J298313K546234
1687B22346840L315544L466568L133259K587643K061977J637306J249104P90367K32258
1696B40820866l19996o71578o54335k39391M25167J078873J481514J536007J336689
1705B44793816J109542J081868J349277J810799K210598K261085J792641Q53653k88315
1714B56974964j247768j683312j449146o62346L47538J189633J595363J540241J240273
1723B57845440J016045J097164J473598J886616J972847J486339M70009p29694j624241
1732B64894123j836109j299572k94590P06367J290245J309472R29565N00107L35083
$$ y = [201613522, 202109718, 202651653, 203266697, 203824883, 204230881, 204612541, 205348625, 206883602, 209431705, 212757473, 216190853, 218898563, 220278606, 220266666, 219386482, 218517227, 218502293, 219800606, 222346840, 225662384, 229128952, 232262211, 234849854, 236911831, 238549137, 239798241, 240588608, 240820866, 240500870, 239829292, 239174957, 238935566, 239360733, 240439606, 241921120, 243457127, 244793816, 245903358, 246985226, 248334503, 250145302, 252355900, 254616985, 256409626, 257263279, 256974964, 255727196, 254043884, 252594738, 251932392, 252279930, 253469563, 255064926, 256605167, 257845440, 258861485, 259958649, 261432247, 263318863, 265291710, 266778049, 267248058, 266518364, 264894123, 263058014, 261758442, 261463852, 262170219, 263460464, 264769936, 265699501, 266199608, 266534691]
1741B66534691N33428R41601J264286J250992Q42991K01129l88813o71157n43347q8882
1751B69876919M84314R54342J177959J128292Q72441N20706J82075n5942j28613M063
1761B75016556L41320Q17890J296425J594925J554336J116715L72963m52538j084327
1770B80574265j309109j065388m66251K55794Q48828J140251J086960P68756L38974
1779B82173080l5362k23541j59397J40915N77774R86290J184215J045361N68085r8591
1789B86158829p00341r86290q30936l04832L50608Q38070R49707O67534J64280k92301
1799B86014328m78306l19805Q5430N34210Q28114Q65784O74133L71437R3613p0572
1809B88598366j06068n4092K8572J04408J66550K26574K94685L67489M31366M73480
$$ y = [266534691, 267068119, 268009720, 269274006, 270524998, 271367989, 271569118, 271180305, 270509148, 269965801, 269876919, 270361233, 271315575, 272493534, 273621826, 274494267, 275014973, 275197048, 275141106, 275012493, 275016556, 275357876, 276175766, 277472191, 279067116, 280621452, 281738167, 282111130, 281658592, 280574265, 279265156, 278199768, 277733517, 277989311, 278838139, 279978390, 281065350, 281834106, 282173080, 282137718, 281914177, 281754780, 281895695, 282473469, 283459759, 284643974, 285689335, 286257420, 286158829, 285458488, 284472198, 283641262, 283336430, 283687038, 284525108, 285474815, 286142349, 286306629, 286014328, 285536022, 285216217, 285301647, 285835857, 286663971, 287529755, 288203888, 288575325, 288668938, 288598366, 288492298, 288438206, 288466778, 288571186, 288737736, 288964310, 289258995, 289626484, 290057850, 290531330]
1819B90531330M88606M75521M26922L26290J59206o4850k96821m58279m76875l31192
1829B90779858p1621K00901L90491M64859M72374N03483O16150P77588Q66680P44190
1839B95744953L52554k22435p73143j071148r89895n77068k7981M20036O12774N47676
1849B94016323L50742J83373J42155K12631K99892L07846K11468P4844O695Q4782K97584
1860B96188335N40696O69193N75352K49233k10819o40126q81385q51536n71537j49689
1870B94917717K71301N72701O98852O62518N21374L44657J87150Q1234L9176N8003
1880B98354683J18809J85642K12479J62429L2292j35002k65065k89783j88828p171
1890B98180485J66950K51751K19593J11580R117j8978M3220J54286K48756K83013K57568
$$ y = [290531330, 291019936, 291495457, 291922379, 292248669, 292407875, 292343025, 292046204, 291587925, 291111050, 290779858, 290708237, 290909138, 291299629, 291764488, 292236862, 292740345, 293356495, 294134083, 295000763, 295744953, 296097507, 295875072, 295101929, 294030781, 293040886, 292463818, 292435837, 292855873, 293468647, 294016323, 294367065, 294550438, 294692593, 294905224, 295205116, 295512962, 295724430, 295799274, 295805969, 295890751, 296188335, 296729031, 297398224, 297973576, 298222809, 298011990, 297371864, 296490479, 295638943, 295067406, 294917717, 295189018, 295761719, 296460571, 297123089, 297644463, 297989120, 298176270, 298257504, 298296680, 298354683, 298473492, 298659134, 298871613, 299034042, 299066334, 298931332, 298666267, 298376484, 298187656, 298180485, 298347435, 298599186, 298818779, 298930359, 298939476, 298920498, 298963718, 299118004, 299366760, 299649773, 299907341]
1901B99907341K07500J67084J42231J10340M7627l9902j09692j08470j4039J37616
1911C00447636K63786K81525J58863n9033k71148l74947l21312j40018Q0108K40364
1921C00305824K83318K16503R9907O828j7090K5273R0313J25179J02024L8014j4267
1932C01261826J945J08147K69489M03996M23240K81944J0300k92988n06401n45292
1942C01416206m04567j58501Q1062K23503K41738J74923R4204N5141O7139R5863R5215
1953C01981926M3087m1466j10187j17493n0488O2008J64261K05727J66550O6013n0182
1964C02319756j35556j63917j38016q2378k6303J0453K3517K0809J1864J392j2378
1975C01829243l1548n1575n8422l3741L3665J37177K48546L26405L33404K54212J05324
$$ y = [299907341, 300114841, 300281925, 300424156, 300534496, 300582123, 300542221, 300432529, 300324059, 300310020, 300447636, 300711422, 300992947, 301151810, 301092777, 300821629, 300446682, 300125370, 299985352, 300065460, 300305824, 300589142, 300805645, 300905552, 300912380, 300895290, 300920563, 301010876, 301136055, 301238079, 301276093, 301261826, 301263771, 301371918, 301641407, 302045403, 302468643, 302750587, 302760887, 302467899, 301961498, 301416206, 301011639, 300853138, 300934200, 301157703, 301399441, 301574364, 301668568, 301723709, 301790848, 301886711, 301981926, 302025013, 301983547, 301873360, 301755867, 301705379, 301767387, 301931648, 302137375, 302303925, 302369938, 302319756, 302184200, 302020283, 301882267, 301799889, 301773586, 301784039, 301807556, 301828365, 301840229, 301841621, 301829243, 301797695, 301746120, 301687698, 301653957, 301687622, 301824799, 302073345, 302399750, 302733154, 302987366, 303092690]
1986C03092690o9275k15035k88906k75288j89571o9218M3793J18008J41430J19915
1996C02408543P0285J1063m1218p4939q2608o1531j6975L8357Q5239J06583R5558O0558
2008C02598915K2106J278P420L0937M9839M3335P896l8032o4144m7398J0109P9041
2020C02701302J17893R8057K2811p2460j39732j45569r1000q258N9223Q4972P3033
2031C02700272N1918N1193P7534J07803J03588L8643p7686k00043k68860k44541j32198
2042C02207623J8253J37920J76335J27754L1891n0907p5074l4427L8757R7389J10111
2053C02785625Q0281M0359K6779N3521J00917J28518J02310K0275q3695j57909j64566
2064C02932415j02043o733O9504Q9340N1098j3314o0195o1074j8024M0417Q0223Q3160
$$ y = [303092690, 303023415, 302808380, 302519474, 302244186, 302054615, 301985397, 302029190, 302147198, 302288628, 302408543, 302478828, 302489891, 302448673, 302373734, 302291126, 302229595, 302212620, 302250977, 302336216, 302442799, 302538357, 302598915, 302621021, 302622299, 302629719, 302660656, 302710495, 302753830, 302761726, 302723694, 302659550, 302612152, 302622261, 302701302, 302819195, 302917252, 302940063, 302867603, 302727871, 302582302, 302491302, 302483044, 302542267, 302627239, 302700272, 302752190, 302803383, 302880917, 302988720, 303092308, 303130951, 303053265, 302853222, 302584362, 302339821, 302207623, 302225876, 302363796, 302540131, 302667885, 302699776, 302648869, 302573795, 302539368, 302578125, 302675514, 302785625, 302865906, 302906265, 302933044, 302986565, 303087482, 303216000, 303318310, 303338585, 303254890, 303096981, 302932415, 302830372, 302823639, 302893143, 302982483, 303033581, 303020267, 302960072, 302898998, 302880974, 302921391, 303001614, 303084774]
2076C03084774N7526K9773K6436N6000J03264J38721J35613Q5945N207p4902j21936
2087C03526421j17321o3668J8330R9258J53904J68476J43662R0198K3232m2667r5540
2098C03904285j26648j29776j03950n5161J183M5319N9929M0607r16m0035n2604k8172
2110C03514061K3365P6866J07575J05209Q1100N9739O1302Q8196J22013J35307J11618
2121C04486351N7163K67k6359n894N0545J09291J34392J08833M5128k2354n8060m6730
2133C04832573m96M8027O6776M2134j4153p4100j10360j12266r0160o6891o3687q6479
2145C04370918j23005j49650j44825r9659k3041O3801J35918J75838J78032J49174
2155C04533501J03511N5714J7452n340j1273k250J7070M0112N8250O3000M9744K0733
$$ y = [303084774, 303142300, 303172073, 303198509, 303254509, 303357773, 303496494, 303632107, 303718052, 303723259, 303648357, 303526421, 303409100, 303345432, 303363762, 303463020, 303616924, 303785400, 303929062, 304019260, 304042492, 303999825, 303904285, 303777637, 303647861, 303543911, 303488750, 303489933, 303535252, 303595181, 303635788, 303634872, 303594837, 303542233, 303514061, 303537426, 303614292, 303721867, 303827076, 303908176, 303967915, 304029217, 304117413, 304239426, 304374733, 304486351, 304543514, 304543781, 304517422, 304511528, 304562073, 304671364, 304805756, 304914589, 304959717, 304937363, 304879303, 304832573, 304832077, 304880104, 304946880, 304989014, 304974861, 304900761, 304790401, 304678135, 304587975, 304521084, 304457397, 304370918, 304247913, 304098263, 303953438, 303853779, 303830738, 303894539, 304030457, 304206295, 304384327, 304533501, 304637012, 304692726, 304710178, 304704838, 304693565, 304691315, 304708385, 304748497, 304806747, 304869747, 304919491, 304940224]
2167C04940224j4286m0875m8046l3989r193R098N798k1648o1875r4890j05324r1820
2179C04433174o8798n7411p0686j03322j34964j41468j12476n8975q640J1959o638
2190C03681755n0316r0980j05915r3060p2727p3700j12228j79024k42310k66800k35290
2201C02159405j60523p8602k8419k9030p1278j24835j58635j59988j40591j26629j40209
2212C00940666j83830k37656k71721k65045k18506j55868j11084j08528j51367k20051
2222B99017010k84634l21541l24783l07217k89344k86274k98253l12080l11050k87037
2232B95994797k46601k08149j90678k02789k36569k72083k88239k73990k33708j83715
2242B93658276j41907j17836j08071r9506p8812m1446M310M2019N6935M5700J9951
$$ y = [304940224, 304925938, 304885063, 304837017, 304803028, 304793835, 304802933, 304808731, 304787083, 304725208, 304630318, 304524994, 304433174, 304364376, 304306965, 304236279, 304132957, 303997993, 303856525, 303744049, 303685074, 303676434, 303688393, 303681755, 303631439, 303540459, 303434544, 303341484, 303268757, 303195057, 303082829, 302903805, 302661495, 302394695, 302159405, 301998882, 301920280, 301891861, 301862831, 301791553, 301666718, 301508083, 301348095, 301207504, 301080875, 300940666, 300756836, 300519180, 300247459, 299982414, 299763908, 299608040, 299496956, 299388428, 299237061, 299017010, 298732376, 298410835, 298086052, 297778835, 297489491, 297203217, 296904964, 296592884, 296281834, 295994797, 295748196, 295540047, 295349369, 295146580, 294910011, 294637928, 294349689, 294075699, 293841991, 293658276, 293516369, 293398533, 293290462, 293190956, 293112144, 293070698, 293075008, 293117027, 293173962, 293219662, 293239613]
2253B93239613j9L509L4790Q0261J17264J25942J02616O2065K8496K0923M1027P3052
2265B93929539R4185R0446O5861L9730L2387N0926Q3637J07861J06983Q2683N6286
2276B94740524N5161R4166J64699K36931K77061K66457K12174J43146R3288Q3409J10378
2287B96477394J51005J75590J64280J17264N4016K442j4420J0872O9160J42022K13775
2298B97563400K79446L44810M17405M93221N51243N57632M84238L28064J22566o7806
2308C01074219j70422j33438N1479L40596O48613Q71963R20544P48520L77597r8476
2318C04631195n37262p97233p99046n71003k46048n054J4610k05631n49984q29544
2328C00105000q86841o83823l17326M3431K55871K69889J18123j55449n61676j161557
$$ y = [293239613, 293239594, 293243103, 293277893, 293358154, 293475418, 293601360, 293703976, 293766041, 293794537, 293815460, 293856487, 293929539, 294023724, 294114170, 294180031, 294219761, 294252148, 294303074, 294386711, 294494572, 294601555, 294684238, 294740524, 294795685, 294889851, 295054550, 295291481, 295568542, 295834999, 296047173, 296190319, 296283607, 296367016, 296477394, 296628399, 296803989, 296968269, 297085533, 297139549, 297141991, 297127571, 297138443, 297207603, 297349625, 297563400, 297842846, 298187656, 298605061, 299098282, 299649525, 300207157, 300691395, 301019459, 301142025, 301074219, 300903797, 300770359, 300821838, 301162434, 301811047, 302683010, 303603554, 304352074, 304729671, 304631195, 304093933, 303296700, 302497654, 301926651, 301680603, 301675549, 301690159, 301484528, 300934544, 300105000, 299218159, 298534336, 298217010, 298260441, 298516312, 298786201, 298904324, 298748875, 298187199, 297025642]
2338B97025642j974907k860622l468838l337154k112999K05250L158245N934524P674389
2347C00243530P827015O382199L860645J072235j228638k620468l104629k997799k713356
2356C06720734k557850k633553k862491l084965l162251l031940k711239k265244j772403
2365B82638798j300698q97045n83687l56979j92261n3959R0600K60314M59328O82755
2375B80747166R23690J174317J420898J637688J789017J840286J773624J598664J351013
2384B94256363J078625Q25920O21032M73557L77922L19996K82040K46219J98879J35861
2394B98816414O5174N302k4166j3103L1700Q8901J32943J46904J29394R2583N3482
2405B99525528K3079L013j2912l0632n0240o4792o3878m1160P82M8714Q3427Q7337
$$ y = [297025642, 295050735, 292190113, 288721275, 285384121, 283271122, 283476372, 286634617, 292569141, 300243530, 308070545, 314452744, 318313389, 319385624, 318156986, 315536518, 312431889, 309434090, 306720734, 304162884, 301529331, 298666840, 295581875, 292419624, 289387684, 286676445, 284411201, 282638798, 281338100, 280441055, 279857368, 279500389, 279308128, 279254169, 279344769, 279605083, 280064411, 280747166, 281670856, 282845173, 284266071, 285903759, 287692776, 289533062, 291306686, 292905350, 294256363, 295334988, 296160908, 296781940, 297255497, 297633419, 297953415, 298235455, 298481674, 298680553, 298816414, 298881588, 298886890, 298862724, 298849621, 298881321, 298970222, 299103165, 299250069, 299379463, 299472046, 299525528, 299548607, 299551620, 299538708, 299508076, 299457836, 299393044, 299329166, 299288006, 299288788, 299337502, 299420929, 299508266]
2417B99508266N3616r842q1596j35899j54209j34983r3956n4512l4275l4542m0226
2428B98787842l1281K213N0144Q7261Q7662M2305l2997j04313j38054j18923n7411
2439B98574448J6517P1163Q7605O7444K6264j7166n1346p3719q6117q8196p4653l9253
2451B98412991J7452Q2798J33419J44596J02196J2474r9507j98440k55089k58808k21787
2462B97872295j71833j37920j34983j57909j85490j93482j68514j15490n3959p248
2472B96545467J0624J507j9436l3684l0307j0968J1826K4109J9226J564j6441k2354
2484B96481133j2742M597J3905J087l7975r3327j45416j74370j69926j35917q7243
2495B95643806m1523j0452M292P686O657L948j9m139k556J3981N0278J00231J44672
$$ y = [299508266, 299561882, 299552040, 299470444, 299334545, 299180336, 299045353, 298951397, 298896885, 298862610, 298828068, 298787842, 298756561, 298758774, 298808918, 298896179, 298983841, 299026146, 298993149, 298888836, 298750782, 298631859, 298574448, 298590965, 298662128, 298749733, 298817177, 298843441, 298826275, 298774929, 298701210, 298615093, 298526897, 298452244, 298412991, 298430443, 298513241, 298646660, 298791256, 298893452, 298905926, 298806419, 298607979, 298352890, 298094082, 297872295, 297700462, 297562542, 297427559, 297269650, 297084160, 296890678, 296722164, 296606674, 296552715, 296545467, 296556091, 296557598, 296538162, 296504478, 296474171, 296463203, 296475029, 296499138, 296518364, 296519928, 296503487, 296481133, 296468391, 296472988, 296486893, 296487980, 296450005, 296356678, 296211262, 296036892, 295866966, 295731049, 295643806, 295602283, 295591831, 295596123, 295603809, 295610466, 295614414, 295614395, 295610256, 295607700, 295621681, 295671959, 295772190, 295916862]
2508B95916862J59626J30425O3515j3485o5556p0228l2731J6900M0340J6270m5700
2519B96116238j08624j30615r0885l147R0599J44615J35326P3452m692o0615p6733
2530B96084919o5002n5333p3928j23997j82934k16694k01721j40839o2618m082R919
2541B94967690j8387o3725r3002q5983m5987M311L7880L9864J5411j6136l4046k9412
2553B94678478q240J4725K7428K8725K7847L5705N4799P5721Q2016O1035J4210m1904
2565B95050545q3962r4642p4292m0722j9760l0059p1621j24913j61228j59416j17722
2576B94072208n5503k881J6118l281m4537p9593q5831n7831r975L3931N6267N5428
2588B93894520M5833M6196O4240Q9893R9354P1030J163q9493j64318j89876j53885
$$ y = [295916862, 296076488, 296206913, 296270428, 296256943, 296191387, 296121159, 296088428, 296105328, 296145668, 296161938, 296116238, 296007614, 295876999, 295786114, 295782967, 295873566, 296018181, 296153507, 296226959, 296222267, 296161652, 296084919, 296019917, 295964584, 295890656, 295766659, 295583725, 295367031, 295165310, 295024471, 294961853, 294957771, 294967690, 294949303, 294885578, 294792576, 294706593, 294660606, 294664917, 294702797, 294742661, 294758072, 294741936, 294707890, 294678478, 294670238, 294684963, 294712391, 294741116, 294768963, 294804668, 294859467, 294935188, 295017204, 295078239, 295092449, 295050545, 294966583, 294871941, 294797649, 294756927, 294737167, 294707108, 294635487, 294510574, 294349346, 294189930, 294072208, 294016705, 294013824, 294029942, 294026661, 293982124, 293902531, 293816700, 293758869, 293748894, 293782825, 293839092, 293894520, 293940353, 293986549, 294050789, 294140682, 294240036, 294311066, 294312229, 294222736, 294058418, 293868542, 293714657]
2599B93714657p3071J5774P5588Q7452N8689J5107j5126j7967J106K3899L2521K0408
2611B93939037n035l1338n0163o4297q4286j18656j64108k03896k15473j84421j15662
2622B92701702l4065K5730L8071j545p1926j37349j65786j44234q4438j5698L1357
2633B92141819L9635J2817k9716o4507p6847o6319m4193k4376j5030j5182j8330j9645
2645B91820126k0848k9659n4417r6206j45645j86272k02961j90773j57509j19896r2869
2656B90523071q1176p7096o6623l9330L338M8008P7343P9784N6611J9950j5487m0379
2668B90488014n5027o4831p3661p9117p5226n9605l9997l3417n7048j15147j92776
2679B89642162k60391k88429k63767j97239j17054n2300j6174j145J3409M4537R2582
$$ y = [293714657, 293641586, 293657360, 293732948, 293820400, 293879089, 293894196, 293879070, 293861103, 293862209, 293886108, 293918629, 293939037, 293934002, 293902664, 293852501, 293788204, 293703918, 293585262, 293421154, 293217258, 293001785, 292817364, 292701702, 292667637, 292693367, 292731438, 292729893, 292657967, 292520618, 292354832, 292210598, 292126160, 292110462, 292141819, 292181454, 292194271, 292164555, 292100048, 292023201, 291956882, 291912689, 291888313, 291873283, 291858101, 291839771, 291820126, 291799278, 291769619, 291715202, 291618996, 291473351, 291287079, 291084118, 290893345, 290735836, 290615940, 290523071, 290441895, 290364799, 290298176, 290258846, 290262184, 290310192, 290387535, 290467319, 290523930, 290543880, 290528393, 290488014, 290432987, 290368156, 290294495, 290215378, 290140152, 290080547, 290040550, 290007133, 289950085, 289834938, 289642162, 289381771, 289093342, 288829575, 288632336, 288515282, 288462982, 288446808, 288445663, 288459072, 288503609, 288596191]
2690B88596191J39561J60065J36394O9790k0599j08452j72730k05707k10781j96610
2700B88187122j70383j36662j00631p0324n6095o5060r5577j35784j69011j81827j70441
2711B86835327j42002j08433p9994o0730m9877m4956m5681n3082o6528q1825r2068
2722B86010151r2697q4687p6427p8049r4928j23520j52321j68381j64947j43853j14727
2733B84715614q7700o9866o2217o2619o8187p7191q7795r7809j03989j05190j03855
2744B83789196j05858j16215j34735j54285j63689j54705j28422r6092p3166p1201
2754B82590828r0485j19896j43413j48659j33419j06068q0547o9389p8087j02539j31951
2765B81386375j53350j57528j43242j18866r9487j00098j27430j74980k24571k54365
$$ y = [288596191, 288735752, 288895817, 289032211, 289102001, 289081402, 288972950, 288800220, 288594513, 288383732, 288187122, 288016739, 287880077, 287779446, 287709122, 287653027, 287587967, 287492390, 287356606, 287187595, 287005768, 286835327, 286693325, 286584892, 286504898, 286444168, 286394291, 286349335, 286303654, 286250572, 286184044, 286102219, 286010151, 285917454, 285832767, 285756340, 285678291, 285583363, 285459843, 285307522, 285139141, 284974194, 284830341, 284715614, 284627914, 284558048, 284495831, 284433212, 284365025, 284287834, 284200039, 284102230, 283998241, 283893051, 283789196, 283683338, 283567123, 283432388, 283278103, 283114414, 282959709, 282831287, 282735195, 282662029, 282590828, 282500343, 282380447, 282237034, 282088375, 281954956, 281848888, 281768341, 281698952, 281620865, 281518326, 281386375, 281233025, 281075497, 280932255, 280813389, 280713902, 280613804, 280486374, 280311394, 280086823, 279832458]
2775B79832458k50434k14405j63269j20526j05018j22319j64432k16198k62947k94781
2785B77918129l06473k95696k62241k12632j60999j27773j29662j68628k26594k72388
2795B75755043k78339k38495j73207j19876j09196j46103k05898k48585k44560j94359
2805B73796425j28288q9512j07231j79234k73704l48015l72849l47328k96383k54745
2815B71399136k47250k76661l26137l70026l88928l77559l44677l05882k75783k61498
2825B68224735k62871k74906k91881l10478l29571l49426l68710l83816l89995l83435
2835B64879646l64265l37505l10574k89974k77825k70881k64397k56271k50626k55909
2845B62001419k80151l23563l76263m20913m40731m28105l88317l36380k88181k52190
$$ y = [279832458, 279582024, 279367619, 279204350, 279083824, 278978806, 278856487, 278692055, 278475857, 278212910, 277918129, 277611656, 277315960, 277053719, 276841087, 276680088, 276552315, 276422653, 276254025, 276027431, 275755043, 275476704, 275238209, 275065002, 274945126, 274835930, 274689827, 274483929, 274235344, 273990784, 273796425, 273668137, 273578625, 273471394, 273292160, 273018456, 272670441, 272297592, 271950264, 271653881, 271399136, 271151886, 270875225, 270549088, 270179062, 269790134, 269412575, 269067898, 268762016, 268486233, 268224735, 267961864, 267686958, 267395077, 267084599, 266755028, 266405602, 266036892, 265653076, 265263081, 264879646, 264515381, 264177876, 263867302, 263577328, 263299503, 263028622, 262764225, 262507954, 262257328, 262001419, 261721268, 261397705, 261021442, 260600529, 260159798, 259731693, 259343376, 259006996, 258718815, 258466625]
2855B58466625k25715j98803j62144j15299o7807l4637k6455m3011p2555r8343j10016
2866B57311840j09463j10092j27277j66321k16389k54192k56500k14672j41163o3553
2876B55652218r480R194K117q068j888K1247M1676L1013k8381j28803k38381l16543
2888B55025921l35274k94113k19097j48449j12915j23196j68114k24952k71740k96154
2898B52831917k97222k81868k60868k45057k44464k66972l16010l90625m85286n94406
2908B49449139p13807q41217r72309j095695j191940j239224j222668j142921j016312
2917B40013046q66298p09534n47524l67717j56021Q7738L42388N68676P26642P92294
2927B39883690P68127O80600N65681M53873L58848K78588K02846J23901M2916k9717
$$ y = [258466625, 258240910, 258042107, 257879963, 257764664, 257696857, 257662220, 257635765, 257592754, 257520199, 257421856, 257311840, 257202377, 257092285, 256965008, 256798687, 256582298, 256328106, 256071606, 255856934, 255715771, 255652218, 255642738, 255651932, 255654049, 255645981, 255644093, 255665340, 255707016, 255738029, 255709648, 255580845, 255342464, 255025921, 254690647, 254396534, 254177437, 254028988, 253916073, 253792877, 253624763, 253399811, 253128071, 252831917, 252534695, 252252827, 251991959, 251746902, 251502438, 251235466, 250919456, 250528831, 250043545, 249449139, 248735332, 247894115, 246921806, 245826111, 244634171, 243394947, 242172279, 241029358, 240013046, 239146748, 238437214, 237889690, 237521973, 237365952, 237453690, 237796078, 238364754, 239091396, 239883690, 240651817, 241332417, 241898098, 242351971, 242710819, 242989407, 243192253, 243316154, 243359070, 243329353]
2937B43329353q1005j02157r4509p0076m6368l9311n6495r4204j40076j79596k04258
2948B42221298k15912k26860k53944l13568m16641n67704p65361j000958j255131j493168
2958B35712051j665058j714363j594810j290379q28209k77424K67048P12815R96341
2967B30318012J100121J052418R12838P48825O13079N29709M92343M74644M46262L88375
2977B37076626L01895K03819J17474N8822K9412J8291R995l605j9703k7981j9684L491
2989B37748852K9049M0302K6894p458m6959p2613p1983m6768r976K0790L3322K4204
3001B37667656o68l1738o0444q2149r6760j06564j14803j23539j32542j38607j36509
3012B36643333j22432r6760o6681m3716l8166n2968p9612j01338j01165p0973j6231
$$ y = [243329353, 243248348, 243146191, 243051682, 242981606, 242935238, 242895927, 242839432, 242745228, 242605152, 242425556, 242221298, 242005386, 241778526, 241524582, 241211014, 240794373, 240226669, 239461308, 238460350, 237205219, 235712051, 234046993, 232332630, 230737820, 229447441, 228619232, 228341808, 228608856, 229321671, 230318012, 231418133, 232470551, 233383389, 234132214, 234745293, 235275002, 235767345, 236241989, 236688251, 237076626, 237378521, 237582340, 237699814, 237758636, 237788048, 237806339, 237816334, 237812729, 237793026, 237765045, 237745361, 237748852, 237777901, 237818203, 237845097, 237837639, 237790680, 237718067, 237646084, 237599316, 237589340, 237610130, 237643452, 237667656, 237666988, 237635250, 237574806, 237492657, 237395897, 237289333, 237174530, 237050991, 236918449, 236779842, 236643333, 236520901, 236424141, 236357460, 236313744, 236275578, 236222610, 236142998, 236041660, 235940495, 235869522, 235853291]
3023B35853291M5566R3479J11523R4833M9801j0586p1392j19953j48163j53255j38931
3034B35606213j15204r6321r5921j20888j67751k23656k72083l00140l03707k86770
3044B33623772k57721k23599j88980j57089j33286j24893j38664j74065k21176k61345
3054B31742954k76603k57912k11086j54591j11084r6397j13926j53523j98574k32811
3064B29936447k46715k37999k10534j71051j27544q8329o1074n1288n9662q1291j06392
3075B28494568j24550j30119j24111j14155j10016j17645j36528j59607j78185j87321
3085B27112331j88579j88828j95541k10495k28291k38800k34050k14634j91517j81561
3095B25040035j97448k39373k91919l29342l28064k78397j91154r3232j6555J5411
$$ y = [235853291, 235898857, 235992336, 236103859, 236198692, 236248493, 236237907, 236166515, 236046562, 235898399, 235745144, 235606213, 235491009, 235394688, 235298767, 235177879, 235010128, 234786472, 234514389, 234214249, 233910542, 233623772, 233366051, 233142452, 232953472, 232796383, 232663097, 232538204, 232399540, 232225475, 232004299, 231742954, 231466351, 231208439, 230997353, 230842762, 230731678, 230635281, 230521355, 230367832, 230169258, 229936447, 229689732, 229451733, 229241199, 229070148, 228942604, 228854275, 228793201, 228741913, 228682251, 228600960, 228494568, 228370018, 228239899, 228115788, 228001633, 227891617, 227773972, 227637444, 227477837, 227299652, 227112331, 226923752, 226734924, 226539383, 226328888, 226100597, 225861797, 225627747, 225413113, 225221596, 225040035, 224842587, 224603214, 224311295, 223981953, 223653889, 223375492, 223184338, 223091106, 223074551, 223089962]
3105B23089962l376o1474j37596k10342k65751k98405l08666k98367k69203k24743
3115B21012039j73855j31530j15071j36852j96972k80380l61862m16298m29173m03213
3125B18366833l55931l11126k87438k90832l13378l39412l53203l46794l21865k86904
3135B15159950k53029k29358k21539k30522k54116k86903l20683l46489l58543l56789
3145B12301979l49102l47347l61748l95126m40674m86546n23815n52463n81704o22787
3155B07640667o79321p41539p88174p97691p60498o85807n97915n24998m85077m80385
3165B01099262m98695n23567n44281n59197n73730n93090o17905o43864o66313o84147
3175A95194473p01122p21951p47337p71751p85294p79858p53993p15485o77624o53324
$$ y = [223089962, 223086586, 223025112, 222887516, 222677174, 222411423, 222113018, 221804352, 221505985, 221236782, 221012039, 220838184, 220706654, 220591583, 220454731, 220257759, 219977379, 219615517, 219199219, 218770046, 218366833, 218010902, 217699776, 217412338, 217121506, 216808128, 216468716, 216115513, 215768719, 215446854, 215159950, 214906921, 214677563, 214456024, 214225502, 213971386, 213684483, 213363800, 213017311, 212658768, 212301979, 211952877, 211605530, 211243782, 210848656, 210407982, 209921436, 209397621, 208845158, 208263454, 207640667, 206961346, 206219807, 205431633, 204633942, 203873444, 203187637, 202589722, 202064724, 201579647, 201099262, 200600567, 200077000, 199532719, 198973522, 198399792, 197806702, 197188797, 196544933, 195878620, 195194473, 194493351, 193771400, 193024063, 192252312, 191467018, 190687160, 189933167, 189217682, 188540058, 187886734]
3185A87886734o49700o66123o95648p29351p59411p80677p90082p84873p63646p26661
3195A80540562o78978o30722n95360n84850o03619o44798o90804p20005p16572o79092
3205A73995762o22158n70069n45578n57174n95246o36215o55041o37207n85708n17864
3215A68073502m55933m17080m07028m20017m43764m64478m70905m56181m20398l71170
3225A63746548l24097k97985l07446l54309m24480m91486n29289n24158m81759m23507
3235A59588032l74975l53365l60794l86572m16832m41647m59442m73452m85916m95748
3245A55339289m98953m93155m79669m62942m46177m28572m05397l73268l35283l02353
3255A51113520k88773l03507l42741l88355m15030m01659l42969k52762j59617r4261
$$ y = [187886734, 187237034, 186570911, 185875263, 185145912, 184386501, 183605824, 182815742, 182030869, 181267223, 180540562, 179861584, 179230862, 178635502, 178050652, 177447033, 176802235, 176111431, 175391426, 174674854, 173995762, 173373604, 172803535, 172257957, 171700783, 171105537, 170469322, 169814281, 169177074, 168591366, 168073502, 167617569, 167200489, 166793461, 166373444, 165929680, 165465202, 164994297, 164538116, 164117718, 163746548, 163422451, 163124466, 162817020, 162462711, 162038231, 161546745, 161017456, 160493298, 160011539, 159588032, 159213057, 158859692, 158498898, 158112326, 157695494, 157253847, 156794405, 156320953, 155835037, 155339289, 154840336, 154347181, 153867512, 153404570, 152958393, 152529821, 152124424, 151751156, 151415873, 151113520, 150824747, 150521240, 150178499, 149790144, 149375114, 148973455, 148630486, 148377724, 148218107, 148123846]
3265A48123846p5998j04256j58214k06328k19526j84002j06049q650P9489J36309J54447
3276A47431068J41373J12572Q3055O1102M7989M2915M7017O5736J04494J64004K36387
3287A48537712L05939L55196L71313L50962L00617K32773J62592J04026O8398O3114
3297A50852642Q9979J42164K05050K58055K82325K68660K21520J58872J03350P1974
3307A52654591O8884Q3103R6359R2697O8197L3398P267O495L4694P7620J09119J02301
3319A53434725M4069n6562j70851k61707l00398k78492k11611j30892o8960m5786o3133
3330A51890402j07441j59731k05832k41251k68964k93951l16563l32375l34529l19424
3340A49310341k90299k56319k29034k17295k24209k48012k83575l24850l65343l97730
$$ y = [148123846, 148047848, 147943592, 147785378, 147579050, 147359524, 147175522, 147069473, 147060823, 147140312, 147276621, 147431068, 147572441, 147685013, 147768068, 147829170, 147877159, 147920074, 147967091, 148032827, 148137321, 148301325, 148537712, 148843651, 149198847, 149570160, 149921122, 150221739, 150454512, 150617104, 150721130, 150789528, 150852642, 150942621, 151084785, 151289835, 151547890, 151830215, 152098875, 152320395, 152479267, 152582617, 152654591, 152723475, 152806578, 152902937, 152995634, 153063831, 153097229, 153104496, 153110991, 153145685, 153223305, 153332424, 153434725, 153478794, 153422232, 153251381, 152989674, 152689276, 152410784, 152199173, 152068281, 151999321, 151953535, 151890402, 151782961, 151623230, 151417398, 151176147, 150907183, 150613232, 150296669, 149964294, 149629765, 149310341, 149020042, 148763723, 148534689, 148317394, 148093185, 147845173, 147561598, 147236748, 146871405, 146473675]
3350A46473675m14114m08068l78408l32833k87208k61364k70338l17297l89643m63142
3360A42951260n10693n12848m65631l81270k83651j99375j48135j38759j66874k19355
3370A39924669k79417l31850l66726l80735l76072l57962l32622l05090k78502k53668
3380A36662025k29587k04058j75056j42021j08433q1396p1183q7099j31645j97573
3390A35233974k67000l17831l32155l05014k48270j86090j45741j45120j85681k52189
3400A32848883l20778l69568l87974l78961l54739l28741l07388k88124k62928k25601
3410A29624081j79053j37157j20487j46523k19812l27435m42695n35717n86596n94110
3420A26334496n75505n57775n65396o10008o87799p84426q84419r78269j064577j147509
$$ y = [146473675, 146059561, 145651493, 145273085, 144940252, 144653044, 144391680, 144121342, 143804045, 143414402, 142951260, 142440567, 141927719, 141462088, 141080818, 140797167, 140597792, 140449657, 140310898, 140144024, 139924669, 139645252, 139313402, 138946676, 138565941, 138189869, 137831907, 137499285, 137194195, 136915693, 136662025, 136432438, 136228380, 136053324, 135911303, 135802870, 135721474, 135650291, 135563192, 135431547, 135233974, 134966974, 134649143, 134316988, 134011974, 133763704, 133577614, 133431873, 133286753, 133101072, 132848883, 132528105, 132158537, 131770563, 131391602, 131036863, 130708122, 130400734, 130112610, 129849682, 129624081, 129445028, 129307871, 129187384, 129040861, 128821049, 128493614, 128050919, 127515202, 126928606, 126334496, 125758991, 125201216, 124635820, 124025812, 123338013, 122553587, 121669168, 120690899, 119626322, 118478813]
3430A18478813j230249j311922j385737j441879j470928j466475j428118j361751j280413
3439A06101341j201668j142025j109247j095943j078739j026602r14335p36409n11846
3448I7284527k76480o7816R2583K05851K90460L67632M47121N22346N77860O03390
3458A00047474O04105O01234O20280O75201P59173Q45241R01661R07450Q65020P98398
3468A07625237P41100P18708P36570P77579Q12072Q12989P69996O94475O13528N56555
3478A14858809N40943N63802O05507O40431O51464O37741O13308N96276N97515O14423
3488A20920219O35014O47697O50330O51016O59838O78015O93664O87456O47240N79920
3498A27450409N11370M73480M83847N33571N90582O19135O03103N57232N19238N27105
$$ y = [118478813, 117248564, 115936642, 114550905, 113109026, 111638098, 110171623, 108743505, 107381754, 106101341, 104899673, 103757648, 102648401, 101552458, 100473719, 99447117, 98532782, 97796373, 97284527, 97008047, 96940231, 97032814, 97238665, 97529125, 97896757, 98343878, 98866224, 99444084, 100047474, 100651579, 101252813, 101873093, 102548294, 103307467, 104152708, 105054369, 105961819, 106826839, 107625237, 108366337, 109085045, 109821615, 110599194, 111411266, 112224255, 112994251, 113688726, 114302254, 114858809, 115399752, 115963554, 116569061, 117209492, 117860956, 118498697, 119112005, 119708281, 120305796, 120920219, 121555233, 122202930, 122853260, 123504276, 124164114, 124842129, 125535793, 126223249, 126870489, 127450409, 127961779, 128435259, 128919106, 129452677, 130043259, 130662394, 131265497, 131822729, 132341967, 132869072]
3508A32869072N93843O98281P95164Q40015Q12607P25756O16207N23710M72384M62598
3518A39409637M78249M98800N11685N16214N19819N32399N58824N97487O38771O68811
3528A44930696O74258O49061O01978N57747N48935O00185P10135Q44316R44663R55581
3538A52017555Q53663O63995M52052K92968K35815K80619L83434M83618N37176N36728
3548A56737623N06096M78611M74215M92477N24168N69401O43396P63951R24205J075039
3558A63189182J133938J023464P21226K88544j41812m18872m41781k05898J97258O23989
3568A65969238R42231J080493J043225Q92887P15980N92595N76267O83975Q88119J114921
3578A74499931J258412J215553R36470M63409o7787m76150o15387m43688m5547M11301
$$ y = [132869072, 133462915, 134161196, 134956360, 135796375, 136608982, 137334738, 137950945, 138474655, 138947039, 139409637, 139887886, 140386686, 140898371, 141414585, 141934404, 142466803, 143025627, 143623114, 144261885, 144930696, 145604954, 146254015, 146855993, 147413740, 147962675, 148562860, 149272995, 150117311, 151061974, 152017555, 152871218, 153535213, 153987265, 154280233, 154516048, 154796667, 155180101, 155663719, 156200895, 156737623, 157243719, 157722330, 158196545, 158689022, 159213190, 159782591, 160425987, 161189938, 162114143, 163189182, 164323120, 165346584, 166067810, 166356354, 166214542, 165795670, 165353889, 165147991, 165345249, 165969238, 166911469, 167991962, 169035187, 169928074, 170644054, 171236649, 171812916, 172496891, 173385010, 174499931, 175758343, 176973896, 177910366, 178373775, 178305988, 177829838, 177214451, 176770763, 176725216, 177136517]
3588A77136517P57160Q96702Q39386O72416N03311M06685M06704M91162O37855Q26149
3598A83574047J029224J200047J272411J185036R19590N24712J11198j87054k65560
3607A89363651r1934K76718P08122J035099J111413Q73775L87573j49383m64936l28846
3617A92721252L17288J284408K175293K543278K106552R09024o67668k058735k765865
3626A96564827k574863j629048l33443Q48484J592370J810264J626320J272450R76638
3635B00153999Q91285J064949J439743J857891K090798J908150J183548p840j365757
3644B09216766k456646k895698k530041j521206k72369P62214J283131J256466Q81901
3653B03724518M56352K21634K77309N85347J029129J475639J806545J926308J773186
$$ y = [177136517, 177893677, 178790379, 179629765, 180302181, 180805492, 181212177, 181618881, 182110043, 182747898, 183574047, 184603271, 185803318, 187075729, 188260765, 189180355, 189705067, 189816265, 189629211, 189363651, 189271717, 189548435, 190256557, 191291656, 192403069, 193276844, 193664417, 193515034, 193050098, 192721252, 193038540, 194322948, 196498241, 199041519, 201148071, 202057095, 201389427, 199330692, 196564827, 193989964, 192360916, 192027473, 192875957, 194468327, 196278591, 197904911, 199177361, 200153999, 201045284, 202110233, 203549976, 205407867, 207498665, 209406815, 210590363, 210582523, 209216766, 206760120, 203864422, 201334381, 199813175, 199540806, 200303020, 201586151, 202842617, 203724518, 204180870, 204402504, 204679813, 205265160, 206294289, 207769928, 209576473, 211502781, 213275967]
3662B13275967J346435P29160P5646m52232p68948r14345j025753j238327j576881
3671B09450722j911888k015210j687221q77781K72045J486397K468872L004894L004875
3680B13195705K488976J551857L44849r22089j988392k593327k564258j903591q11901
3689B06797829L75824J317997J792850J758518J330853P06978Q9168l57399n15270
3698B13297348l25642J84822Q71697J479492J715031J376190M72107p39765j837445
3707B16493835k410297k238693j386910j64718J016082J811543K060852J805744J228619
3716B18216057N54485k9163m11301n55305m75312k12688J76582O17523J006127J206570
3726B20093575J076488N26848m01249j485081k346935k580776j943169n17902J252632
$$ y = [213275967, 214622402, 215351562, 215427208, 214974976, 214206028, 213291683, 212265930, 211027603, 209450722, 207538834, 205523624, 203836403, 202958622, 203230667, 204717064, 207185936, 210190830, 213195705, 215684681, 217236538, 217581387, 216659298, 214670906, 212077579, 209513321, 207609730, 206797829, 207173653, 208491650, 210284500, 212043018, 213373871, 214080849, 214170017, 213812618, 213297348, 212971706, 213156528, 214028225, 215507717, 217222748, 218598938, 219071045, 218331280, 216493835, 214083538, 211844845, 210457935, 210293217, 211309299, 213120842, 215181694, 216987438, 218216057, 218770542, 218741379, 218330078, 217774773, 217299461, 217086773, 217263355, 217880878, 218887005, 220093575, 221170063, 221696911, 221295662, 219810581, 217463646, 214882870, 212939701, 212421799, 213674431]
3735B13674431K717113L299218K776088J396961k37655j479035j955051j730423j216412
3744B17245235q90502r97906j415634j753884j623172q93555K13070J247768J793728
3753B12925148J695442J126347M66766P7629J10264M53072Q27522R59663P23152J84613
3763B19549618m49391r40055j112156r07612l89595K83603R04198J272678J261998
3772B19473286Q71792K42118l92551p99904q53901n90629j79654J74027L40309L22857
3782B18607750K32315J99394K87075M60816O29577P20368P27443O99349O79054O47831
3792B23890972N24464K26402k51255q00514j246014j445846j378365j151123r19037
3801B17449684p66086o37017l73592J60160R47857J777534K327614K335873J748581
$$ y = [213674431, 216391544, 219690762, 222466850, 223863811, 223626156, 222147121, 220192070, 218461647, 217245235, 216354733, 215356827, 213941193, 212187309, 210564137, 209670582, 209883652, 211131420, 212925148, 214620590, 215746937, 216213703, 216291332, 216401596, 216854668, 217682190, 218641853, 219365005, 219549618, 219100227, 218160172, 217048016, 216140404, 215750809, 216034412, 216938610, 218211288, 219473286, 220345078, 220587196, 220194645, 219394741, 218540840, 217950211, 217770557, 217944584, 218284893, 218607750, 218840065, 219039459, 219326534, 219787350, 220416927, 221137295, 221864738, 222564087, 223243141, 223890972, 224415436, 224641838, 224390583, 223590069, 222344055, 220898209, 219519844, 218368721, 217449684, 216683598, 216046581, 215672989, 215833149, 216781006, 218558540, 220886154, 223222027, 224970608]
3810B24970608P56378l04489j127186j571636j691227j640492j540374j393910j108131
3819B15349541n94902J23291Q88557J480579J742554J672154J414470J159020J010132
3828B24245396R15794P08046K27070n46818j445045k179909k490883k280884j653919
3837B15498848q34446k2469P18518J459980K290230L157863L791237L772869K755871
3846B32588501P10640j945553m434509n908451n814476m154892j506443J217956L150177
3855B13902950L811951L261681J994571O61946k34547n32150m01993j85738j75647
3864B22103024m59366q98342j230107j227798q22621j33342O02226J145763J359349
3873B20438786J243209R01738M74224P2040k44560m52919n44434n15651l81813j94702
$$ y = [224970608, 225726986, 225422497, 224295311, 222723675, 221032448, 219391956, 217851582, 216457672, 215349541, 214754639, 214877930, 215766487, 217247066, 218989620, 220661774, 222076244, 223235264, 224245396, 225161190, 225869236, 226096306, 225549488, 224104443, 221924534, 219433651, 217152767, 215498848, 214664402, 214641933, 215360451, 216820431, 219110661, 222268524, 226059761, 229832630, 232588501, 233299141, 231353588, 226919079, 221010628, 215196152, 211041260, 209534817, 210752773, 213902950, 217714901, 220976582, 222971153, 223633099, 223398552, 222866402, 222464409, 222278671, 222103024, 221643658, 220745316, 219515209, 218287411, 217464790, 217331448, 217933674, 219079437, 220438786, 221681995, 222583733, 223057957, 223129997, 222885437, 222432518, 221888084, 221372433, 220990620, 220795918]
3883B20795918l8167R308p1659k10399k67334j07441L10783Q85353J396465J600037
3893B24302864J343842O43615l17859j267472j948967k211189k039127j529064q32234
3902B16144409r9430N51243J043281J334744J410904J281490R80911N68734J23386
3911B23339672k70576n41420o49834o00643m40979k40936o5041N4283J23692J74732
3921B20882950K33879K97565L28598K77882J20277j19171l65047n21221n15290l34758
3931B20285664l7747K69108M74243N06001L62434J09749j48029l15819l49140k70119
3941B20886345j50051o5880n6782j04580j50547j36928m4709R3880K19135K80972K66991
3952B21037846K02121J24932O2027J8501j1559l0574l3837k0313m158j1807o0825j39713
$$ y = [220795918, 220757751, 220767059, 220695400, 220485001, 220217667, 220110226, 220421009, 221306362, 222702827, 224302864, 225646706, 226290321, 225972462, 224704990, 222756023, 220544834, 218505707, 216976643, 216144409, 216044979, 216596222, 217639503, 218974247, 220385151, 221666641, 222647552, 223216286, 223339672, 223069096, 222527676, 221877842, 221277199, 220836220, 220595284, 220530243, 220584526, 220708218, 220882950, 221116829, 221414394, 221742992, 222020874, 222141151, 222021980, 221656933, 221135712, 220620422, 220285664, 220247917, 220517025, 220991268, 221497269, 221859703, 221969452, 221821423, 221505604, 221156464, 220886345, 220736294, 220670414, 220613632, 220509052, 220358505, 220221577, 220176868, 220270748, 220489883, 220770855, 221037846, 221239967, 221364899, 221426926, 221445427, 221433868, 221403294, 221369457, 221349144, 221344986, 221333179, 221272354, 221132641]
3964B21132641k08492k25468j81618j11236o5327o8112r2544q2836r270R1095J31226
3975B20310059M3659j47629l23029l46527j78127P4272K18811J26648j54552m21677
3985B19201908m79603l24154j82361l42121q73757j476612j635456j062336j47533
3994B12677975n2872k251320p666263j5888119k4987145l2151518
4000A29680738
$$ y = [221132641, 220924149, 220698681, 220517063, 220405827, 220340500, 220272388, 220179844, 220097008, 220087738, 220178833, 220310059, 220353718, 220206089, 219883060, 219536533, 219358406, 219432678, 219651489, 219778137, 219623585, 219201908, 218722305, 218398151, 218215790, 217873669, 216999912, 215523300, 213887844, 212825508, 212677975, 212625103, 210373783, 202707520, 186819401, 161832256, 129680738]
##END=$$ End of the data block
