##TITLE=$$ Begin of the data block
##JCAMP-DX=5.00 $$ ACD/SpecManager v 10.08
##SPECTROMETER/DATA SYSTEM=16PC
##DATE=09 Jul 2013 10:18:52
##DATA TYPE=INFRARED SPECTRUM
##DATA CLASS=XYDATA
##ORIGIN=
##OWNER=
##NPOINTS=3601
##FIRSTX=400.00000000
##LASTX=4000.00000000
##MAXX=4000.00000000
##MINX=400.00000000
##MAXY=33.70292282
##MINY=3.47058654
##XFACTOR=1.0000000000
##YFACTOR=0.000000100000000
##FIRSTY=16.75933838
##DELTAX=1.00000000
##XUNITS=1/CM
##YUNITS=TRANSMITTANCE
##XYDATA=(X++(Y..Y))
400 167593384 216973457 258658962 287953529 303976784 309247417 308046474 304519711 301400204
408 301400204 299710884 299230766 299217110 298954029 297979259 296094017 293326035 289936924 286443996
417 286443996 283577595 282125263 282682514 285390511 289766235 294726505 298862534 300921822 300329437
426 300329437 297496376 293710041 290590897 289356728 290279942 292643623 295220795 296982861 297612896
435 297612896 297539749 297526474 298128929 299383106 300888424 302167854 303017445 303611050 304329033 305473557
445 305473557 307078819 308916798 310648212 311986198 312776184 312987213 312673473 311954308 311009064
454 311009064 310051575 309268646 308754082 308487949 308381119 308347721 308343887 308341446 308266830 307972984 307287426
465 307287426 306113396 304510632 302691479 300929852 299442959 298321037 297532444 296975746 296523628
474 296523628 296035519 295359402 294364719 293013687 291425133 289864006 288626118 287864780 287461243
483 287461243 287030563 286076927 284222336 281385174 277817135 273985710 270370312 267276859 264753628
492 264753628 262634125 260674706 258714085 256775684 255060463 253826885 253213863 253103962 253115692
501 253115692 252756138 251672440 249873657 247795563 246157856 245678768 246791172 249501400 253448467
510 253448467 258106518 263006477 267859306 272542000 276991482 281100063 284685802 287553921 289605293
519 289605293 290919380 291758232 292476978 293377113 294568443 295906906 297049198 297610893 297364578
528 297364578 296379509 295024166 293812046 293156166 293150635 293496132 293612080 292881927 290906734 287643757
538 287643757 283373032 278531189 273515663 268564739 263757687 259108791 254678478 250631695 247218380
547 247218380 244699497 243271008 243024540 243951836 245969410 248934402 252638474 256796207 261057396
556 261057396 265063210 268537407 271369896 273646622 275598469 277487202 279485359 281612282 283755455
565 283755455 285757160 287505207 288970108 290174427 291127434 291788197 292090187 292013035 291640053 291145248
575 291145248 290705357 290391350 290121498 289716473 289027443 288047295 286922779 285853004 284942322 284109745
585 284109745 283115711 281679993 279595566 276748676 273035431 268255901 262104321 254317589 244933109
594 244933109 234511986 224177856 215407791 209643192 207878265 210391426 216708069 225778255
602 225778255 236280670 246939735 256772118 265217457 272143478 277744427 282372913 286368599
610 286368599 289945393 293172569 296035976 298521347 300658150 302496986 304051514 305263882 306036682
619 306036682 306319141 306185303 305840645 305537090 305444489 305557213 305693779 305584621 304989300 303772297
629 303772297 301904278 299409904 296312885 292620544 288353252 283594398 278530254 273464355 268806953
638 268806953 265040073 262654629 262054310 263442879 266735821 271545849 277264729 283216820 288820362
647 288820362 293691006 297662659 300743694 303053932 304771481 306088638 307165432 308082848 308827457
656 308827457 309337292 309600563 309742050 310013657 310656395 311697731 312824783 313455296 313013268 311269226
666 311269226 308534889 305568523 303220425 302016048 301918030 302399979 302767735 302519684 301531448 299986897
676 299986897 298149319 296156750 293977318 291526203 288824902 286065006 283528061 281429462 279810867
685 279810867 278562164 277549400 276741924 276235313 276146317 276460209 276951542 277258511 277086468 276428356
695 276428356 275666332 275480995 276598682 279493122 284180222 290197449 296768608 303069839 308478737
704 308478737 312704773 315769520 317875652 319250679 320047684 320339317 320181618 319685116 319034443
713 319034443 318436928 318032513 317823372 317670269 317362518 316723137 315694332 314360886 312906818 311533318
723 311533318 310379276 309477062 308753586 308069248 307274704 306266880 305026798 303626709 302200089
732 302200089 300882778 299746895 298758450 297783585 296645699 295208263 293440380 291428604 289325943
741 289325943 287266769 285293999 283341312 281278267 278988419 276431541 273652172 270731316 267717190
750 267717190 264583397 261244965 257624187 253723087 249652863 245596428 241721058 238090992 234629002
759 234629002 231149311 227444248 223378315 218943577 214255638 209499340 204858818 200465355 196383266
768 196383266 192629242 189205437 186120262 183381844 180966396 178780518 176650276 174360008 171747246
777 171747246 168824368 165876846 163478775 162393436 163372478 166917057 173091621 181466999 191222553
786 191222553 201369343 211009369 219533501 226695213 232556114 237351761 241351318 244768829 247744102
795 247744102 250371723 252739162 254943752 257082691 259231014 261427288 263675957 265961914 268264771
804 268264771 270564194 272832565 275016613 277007866 278609447 279513760 279323978 277645187 274246445
813 274246445 269245834 263228722 257212467 252426662 249965820 250450592 253841801 259488277 266381264
822 266381264 273494263 280061722 285700283 290363464 294200516 297409840 300151062 302525711 304597816
831 304597816 306418476 308034134 309482288 310784626 311948128 312971859 313856754 314613361 315266552
840 315266552 315855865 316428852 317026653 317666798 318332863 318979702 319554062 320018196 320363007 320603600
850 320603600 320761337 320848808 320867462 320818062 320713882 320582733 320456619 320354538 320272522 320185852 320058823
861 320058823 319853725 319531231 319045124 318337708 317342682 315996685 314253025 312094135 309540215
870 309540215 306651154 303519726 300250244 296924725 293570347 290155373 286632023 283024654 279523163
879 279523163 276523743 274572906 274214840 275800343 279342327 284487190 290614052 297010841 303046741
888 303046741 308276634 312462292 315540085 317576637 318730774 319208698 319190178 318733253 317705326
897 317705326 315809746 312740726 308425560 303235512 298030338 293967743 292126160 293103390 296777859
906 296777859 302352734 308658733 314568825 319332161 322695274 324800720 325963974 326467590 326467476
915 326467476 326017075 325146446 323919029 322431488 320771904 318983364 317059841 314967403 312659054
924 312659054 310059738 307036915 303395233 298933563 293558903 287403431 280871277 274565754 269113102
933 269113102 264955177 262206573 260638428 259790859 259155445 258346024 257198372 255777874 254318600
942 254318600 253132439 252521152 252709904 253805714 255783157 258498745 261731720 265243816 268835583
951 268835583 272380581 275825710 279162693 282388611 285475903 288362923 290966091 293202610 295014915
960 295014915 296388187 297356968 297999420 298418140 298713608 298958893 299189262 299412632 299636574 299895306
970 299895306 300258884 300815372 301636257 302745552 304111881 305667553 307342281 309089565 310892601
979 310892601 312750053 314657040 316594238 318531113 320433922 322268715 323996735 325569305 326934624
988 326934624 328059120 328953552 329683456 330350342 331049080 331823273 332646980 333445473 334143448 334711494
998 334711494 335180130 335611916 336051216 336484337 336839447 337029228 337008629 336811256 336537514 336298180
1008 336298180 336148720 336056099 335919418 335633774 335156822 334536324 333882446 333303528 332847672 332486877
1018 332486877 332148628 331769714 331332092 330858612 330375137 329872971 329302025 328602104 327749214 326783295
1028 326783295 325795631 324881592 324089966 323397751 322723045 321961632 321024208 319854736 318427525 316735630
1038 316735630 314780235 312565842 310097675 307378426 304408035 301193218 297766304 294205170 290638981
1047 290638981 287230625 284142857 281507721 279416161 277931175 277109737 277011566 277684231 279131584
1056 279131584 281286221 284004116 287086716 290317650 293499413 296478539 299156742 301489296 303471088
1065 303471088 305109653 306393814 307273788 307667656 307494812 306710205 305306110 303265610 300495358
1074 300495358 296802044 291973400 285962486 279097099 272180920 266383095 262913532 262605019 265593777
1083 265593777 271252766 278413944 285771103 292277832 297377720 301005707 303418694 304974174 305966625
1092 305966625 306566505 306841850 306811371 306488380 305901413 305097198 304134865 303073769 301955166 300785275
1102 300785275 299531040 298138599 296566868 294818268 292943039 291012135 289073772 287120647 285089302
1111 285089302 282889633 280447941 277735825 274773960 271612377 268302784 264877739 261342773 257678204
1120 257678204 253845081 249791431 245457783 240781536 235698471 230140076 224027214 217265568 209750175
1129 209750175 201384678 192113533 181963081 171078091 159742613 148373508 137478790 127584772
1137 127584772 119146271 112467842 107664909 104682865 103368464 103563900 105180092 108216867 112719736
1146 112719736 118695049 126024246 134415665 143416843 152481251 161064167 168712330 175119038 180130405
1155 180130405 183710632 185884762 186686268 186127815 184201088 180898399 176238937 170286865 163157768
1164 163157768 155018349 146087103 136637506 126995831 117523623 108579950 100473070 93421631 87545443
1173 87545443 82893467 79498572 77431602 76827950 77869382 80725288 85474339 92034988 100131741
1182 100131741 109306927 118975258 128504229 137298031 144865637 150860176 155088921 157502041 158173733
1191 158173733 157289515 155146952 152161674 148859940 145834923 143652601 142720728 143165188 144772120
1200 144772120 147045078 149374676 151263113 152501945 153210287 153701944 154240274 154804811 155003557
1209 155003557 154195061 151780443 147531796 141800280 135499582 129865017 126089621 124985180 126791401
1218 126791401 131181993 137431412 144652777 152012377 158861771 164775124 169521027 173006363 175226040
1227 175226040 176230221 176106663 174969006 172944889 170163517 166748543 162817802 158490953 153900070
1236 153900070 149199266 144572191 140238409 136457300 133527088 131770601 131504669 132994404 136404085
1245 136404085 141760483 148940001 157683001 167627907 178354702 189428673 200441017 211043663
1253 211043663 220975704 230075436 238272495 245564671 251987305 257589817 262428856 266573982 270116100
1262 270116100 273166313 275840912 278239079 280424900 282422161 284222088 285796490 287109947 288127842
1271 288127842 288821640 289174175 289183216 288859081 288215885 287260437 285989208 284397030 282492771 280306416
1281 280306416 277873211 275196705 272212830 268789406 264780846 260131073 254978676 249706211 244890480
1290 244890480 241156654 238988209 238569527 239726696 241986656 244722729 247321720 249310188 250408058
1299 250408058 250519123 249692478 248087902 245960007 243646889 241543617 240043564 239455605 239922085
1308 239922085 241370468 243519669 245943127 248168221 249784946 250532341 250346947 249364014 247878284
1317 247878284 246273899 244939804 244186859 244183998 244925709 246237659 247819214 249310055 250364094
1326 250364094 250711002 250192165 248767948 246501484 243532181 240051594 236286201 232486706 228916454
1335 228916454 225831547 223451920 221926727 221304951 221519947 222395229 223672714 225055904 226257706
1344 226257706 227038498 227225304 226709633 225433311 223374672 220548248 217019424 212923260 208472977
1353 208472977 203945560 199646912 195869923 192862549 190813904 189854507 190058270 191437969 193934765
1362 193934765 197412987 201668339 206451874 211498775 216553726 221385822 225799370 229646130 232838135
1371 232838135 235352306 237214928 238465366 239111500 239098721 238305740 236567039 233709202 229588795
1380 229588795 224131947 217382793 209559345 201095219 192629261 184913025 178644161 174284325 171943436
1389 171943436 171394558 172220516 174025269 176606007 180002747 184405251 189972305 196658745 204135571
1398 204135571 211837368 219107323 225368786 230249348 233612385 235502281 236045685 235367565 233561382
1407 233561382 230717125 226974220 222553692 217738972 212814102 207996178 203405762 199092979 195097122
1416 195097122 191496162 188405361 185924797 184067135 182715511 181641617 180582943 179347363 177903347
1425 177903347 176422615 175258560 174860973 175646114 177859974 181487026 186249790 191710663 197433968
1434 197433968 203129368 208704414 214206944 219707699 225205460 230612679 235813465 240732994 245362110
1443 245362110 249730930 253881073 257883797 261894341 266166306 270952816 276302376 281874390 286945438
1452 286945438 290685177 292601013 292894096 292471790 292549858 294037209 297059822 300918312 304513912
1461 304513912 306988831 308191547 308695202 309379597 310854473 313084793 315429192 317040863 317367878
1470 317367878 316455288 314899006 313513088 312925205 313322849 314459057 315871124 317162437 318188629
1479 318188629 319064636 320016365 321178627 322461395 323561745 324117699 323922768 323083649 322026138
1488 322026138 321327477 321442642 322455826 323991890 325357437 325872154 325245972 323804741 322416687
1497 322416687 322105522 323509674 326458473 329922371 332417068 332698441 330397987 326249008 321763420
1506 321763420 318521805 317462444 318545380 320938644 323561516 325632324 326914062 327584038 327901611
1515 327901611 327945061 327583008 326647720 325135269 323271713 321416702 319902744 318931904 318571453
1524 318571453 318792915 319483261 320422363 321296005 321809807 321872635 321715546 321809120 322568359 324009209
1534 324009209 325597458 326437340 325727348 323223610 319429855 315398655 312263622 310768433 311029510
1543 311029510 312606106 314781303 316880665 318495884 319565601 320325012 321152000 322341805 323875160
1552 323875160 325291061 325778084 324510956 321111603 315990391 310343304 305740643 303476009 303995609
1561 303995609 306705341 310256577 313164959 314451561 314001541 312492409 310962410 310251846 310594387
1570 310594387 311545486 312263241 311984787 310446911 308030663 305559406 303867245 303381138 303944569
1579 303944569 304964085 305765686 305937252 305464191 304618263 303717842 302933731 302250824 301563950 300798073
1589 300798073 299956455 299082184 298194237 297268906 296275902 295225182 294169636 293159962 292199173
1598 292199173 291243668 290251427 289224033 288194351 287165585 286069584 284805737 283352718 281859608
1607 281859608 280611591 279851227 279561291 279376125 278723907 277141972 274572945 271442623 268454475
1616 268454475 266223774 264972134 264461021 264178047 263639565 262625217 261234207 259780006 258623905
1625 258623905 258040943 258151836 258896465 260022163 261098671 261597347 261056709 259291420 256547623
1634 256547623 253499126 251042881 249952202 250532646 252446423 254813538 256576309 256979008 255935497
1643 255935497 254079533 252433758 251834755 252411823 253427734 253617306 251879330 247948437 242649403
1652 242649403 237554607 234208679 233349190 234563217 236566868 237925167 237782173 236189632 233887863
1661 233887863 231731682 230143948 228919830 227450752 225168724 221898689 217907600 213659992 209482288
1670 209482288 205373783 201076145 196328812 191109352 185685482 180437584 175571918 170919285 165959110
1679 165959110 160067196 152848072 144362211 135123987 125880280 117297974 109725628 103136587 97248163
1688 97248163 91723852 86338358 81035233 75880456 70971665 66369991 62084479 58099008 54407082
1697 54407082 51026807 47991018 45325270 43030629 41080532 39429739 38030281 36849108 35881968
1706 35881968 35159774 34743192 34705865 35113642 36011252 37423878 39374504 41902466 45071535 48955412
1716 48955412 53602643 58992996 65003076 71399117 77867928 84080830 89769545 94777632 99057484
1725 99057484 102606812 105377483 107215319 107880306 107151928 104964314 101486549 97087650 92195606
1734 92195606 87131510 82020435 76836672 71550627 66279645 61339383 57155972 54088244 52260342
1743 52260342 51496782 51385245 51426268 51192799 50436211 49117980 47380643 45489826 43770828 42554984
1753 42554984 42141037 42773523 44633927 47836204 52418795 58335171 65454893 73587680 82526474
1762 82526474 92085371 102103090 112404881 122753878 132842064 142352648 151074905 158999062
1770 158999062 166320133 173329983 180252666 187121830 193774090 199955959 205469341 210265064 214439030
1779 214439030 218160801 221599941 224896736 228167858 231501369 234912968 238289127 241379967 243890820
1788 243890820 245643234 246713600 247444515 248298569 249626579 251487141 253626804 255632744 257164440
1797 257164440 258126678 258695164 259195366 259922066 261000710 262354069 263770275 265018101 265950146
1806 265950146 266551323 266924534 267229691 267607765 268124809 268761692 269451408 270138874 270823460 271553555
1816 271553555 272378674 273297119 274242191 275120754 275873680 276507416 277067089 277574024 277984886 278217468
1826 278217468 278233929 278114815 278054066 278261032 278830471 279678383 280599651 281412220 282081833 282729168
1836 282729168 283504772 284423656 285287514 285768566 285613003 284829159 283731804 282804012 282459183 282847061
1846 282847061 283813725 285022087 286144733 287010155 287631855 288130798 288621807 289139462 289637070 290042667
1856 290042667 290325680 290532398 290771141 291155663 291734848 292444458 293111172 293517551 293507576 293081245
1866 293081245 292423820 291841793 291628876 291931648 292687225 293666801 294596825 295285206 295684357 295869808
1876 295869808 295966434 296079216 296265926 296548481 296932087 297403622 297915287 298378544 298692970 298802948
1886 298802948 298743668 298637180 298631725 298818817 299183331 299619980 300004177 300268459 300432796 300574036
1896 300574036 300762882 301016750 301298237 301553726 301753826 301904621 302024403 302112503 302143383 302094879
1906 302094879 301987820 301900463 301935730 302157516 302537518 302953663 303246975 303304901 303119202 302785130
1916 302785130 302443733 302207546 302113571 302127972 302188797 302254601 302325382 302429886 302594566 302818623 303071671
1927 303071671 303310070 303499336 303626709 303702202 303751564 303806934 303896694 304033833 304204407 304363384 304447308
1938 304447308 304404125 304228153 303977947 303761826 303692493 303832169 304159431 304576855 304955750 305194321
1948 305194321 305256729 305176620 305026627 304876251 304761715 304682255 304618797 304559803 304517326 304523335 304609680
1959 304609680 304782848 305009003 305219402 305335121 305302372 305119629 304841881 304558315 304351559 304259892
1969 304259892 304261665 304290619 304273548 304168377 303983803 303769054 303583298 303463421 303408012 303384933 303355465
1980 303355465 303297997 303218822 303143597 303097115 303084316 303083401 303055725 302966328 302804070 302590694 302373199 302203197
1992 302203197 302113991 302106133 302149181 302197475 302211266 302171440 302082024 301959343 301818886 301667404 301506062
2003 301506062 301341801 301196842 301107483 301110687 301222820 301423588 301655731 301842575 301917152 301848240 301651363
2014 301651363 301379089 301096592 300855618 300680084 300568180 300506592 300485020 300502319 300560894 300655861 300770397
2025 300770397 300880051 300965519 301024055 301069851 301123219 301195164 301277084 301343708 301366806 301330700 301240730 301119347
2037 301119347 300994587 300888710 300812740 300768490 300753899 300766773 300805550 300867786 300950356 301050377 301166821
2048 301166821 301299915 301447411 301601315 301748180 301873074 301965294 302021637 302044277 302036781 302000294 301935234
2059 301935234 301846943 301749477 301664848 301614761 301610661 301648846 301713943 301789360 301866760 301947956 302037964 302135544
2071 302135544 302228222 302296715 302326717 302318382 302287025 302253551 302230663 302214737 302188835 302135296 302049198 301944885
2083 301944885 301850128 301792526 301786232 301825638 301889610 301953526 302001476 302033253 302062912 302109928 302187042 302291374
2095 302291374 302402477 302489777 302525387 302495880 302407780 302282677 302146568 302019196 301909199 301817513 301743164
2106 301743164 301687050 301649761 301626720 301605492 301569386 301506062 301414433 301305504 301195545 301097584 301017208
2117 301017208 300955105 300912819 300895252 300906696 300943508 300989971 301023140 301024399 300989933 300932693 300873604 300827827
2129 300827827 300797253 300772457 300743370 300709438 300681877 300677605 300709171 300779076 300880051 300999756 301124802
2140 301124802 301239834 301325607 301358585 301316204 301185665 300971413 300697136 300400505 300123272 299899902
2150 299899902 299748821 299667130 299630985 299603138 299546356 299440231 299293118 299140797 299032173 299005013 299066792
2161 299066792 299189739 299323883 299420605 299452782 299422245 299351654 299268818 299194050 299136658 299099445 299085312
2172 299085312 299099178 299145145 299220715 299315453 299414043 299502659 299573727 299625874 299659138 299669704 299649010 299587688
2184 299587688 299484138 299349728 299208450 299089127 299013939 298989620 299006004 299042530 299079056 299104118 299116058 299117641
2196 299117641 299108276 299079742 299019566 298919048 298780708 298620663 298462715 298328972 298231869 298172474 298143845
2207 298143845 298136768 298142662 298152313 298152695 298125267 298049049 297907658 297696266 297425270 297118149 296805267 296516132
2219 296516132 296274643 296097565 295994244 295966511 296005421 296088734 296180191 296236057 296217670 296106663 295913982
2230 295913982 295678558 295452156 295278301 295175037 295130329 295111961 295085163 295027790 294934216 294809875 294661865
2241 294661865 294495754 294320469 294156456 294037132 293997860 294055939 294193497 294357185 294476871 294497242
2251 294497242 294404163 294231529 294043903 293904800 293846607 293857994 293892632 293893299 293818474 293658752 293437710
2262 293437710 293199158 292987347 292828732 292722931 292645187 292559032 292433300 292254887 292031288 291782341
2272 291782341 291527214 291275558 291028900 290791016 290577869 290417900 290339165 290350437 290429230 290526199 290584793
2283 290584793 290565376 290457897 290277500 290047359 289782867 289487877 289165077 288829556 288514385 288260994
2293 288260994 288101673 288045464 288076897 288167381 288290768 288431683 288583870 288741474 288892879 289020176
2303 289020176 289104538 289131203 289092388 288988056 288830376 288652096 288512669 288493595 288674736 289096851 289723606
2314 289723606 290426159 291005554 291253777 291033134 290340862 289323978 288228493 287297573 286663723 286289616
2324 286289616 285994854 285560036 284855309 283917446 282929459 282109776 281580391 281296043 281077862 280723763
2334 280723763 280111694 279219990 278055859 276561909 274606514 272108040 269240665 266577396 265027504
2343 265027504 265530643 268625126 274109039 280993996 287807751 293116188 296019802 296396656 294804420
2352 294804420 292130260 289185352 286437092 283965836 281605244 279146805 276491299 273692207 270908127
2361 270908127 268320141 266066017 264211903 262755013 261641560 260786972 260099125 259502354 258959827
2370 258959827 258483887 258129311 257969456 258067989 258457870 259135246 260067577 261205101 262488880 263851795
2380 263851795 265216846 266500225 267623119 268528996 269197979 269649391 269928856 270086937 270159149 270159245
2390 270159245 270087757 269947529 269755821 269543362 269341831 269169140 269022369 268883877 268734684 268565826
2400 268565826 268379841 268183212 267977123 267754574 267505531 267225418 266918602 266594086 266256714 265902081
2410 265902081 265519657 265103645 264662514 264220886 263810272 263454723 263160114 262912426 262685375 262452126
2420 262452126 262194424 261906834 261596451 261279812 260979195 260717583 260511436 260363941 260259857 260167294
2430 260167294 260045738 259858570 259584942 259226513 258806133 258360100 257925911 257530327 257181835 256868553
2440 256868553 256565533 256245136 255889301 255497189 255085258 254680157 254307613 253982754 253704910 253458652
2450 253458652 253219261 252960320 252660961 252312298 251919765 251501713 251083145 250686474 250322418 249987144
2460 249987144 249665165 249339809 249003201 248662052 248335476 248045902 247809238 247627029 247485027 247357388
2470 247357388 247213326 247025013 246774101 246456470 246082611 245674477 245256634 244846916 244449863 244056015
2480 244056015 243649635 243218937 242764435 242300320 241847572 241423855 241034584 240669327 240305386 239915161
2490 239915161 239475670 238976269 238422928 237837849 237252541 236697063 236188049 235722122 235278397 234830303
2500 234830303 234359646 233866100 233365517 232878628 232418518 231984310 231565914 231154919 230753517 230374107
2510 230374107 230029182 229719067 229426155 229120522 228773136 228369312 227913456 227423630 226921825 226425514
2520 226425514 225945454 225488949 225062866 224672337 224314842 223974667 223622780 223224506 222753143 222202778
2530 222202778 221592865 220962105 220352688 219792519 219282398 218795681 218290997 217731667 217102985 216418476
2540 216418476 215710888 215014191 214345989 213701229 213061314 212412510 211761913 211140919 210591278 210143757
2550 210143757 209800320 209530697 209285908 209020329 208709812 208358402 207990055 207634792 207315826 207045593
2560 207045593 206828480 206667347 206565552 206525192 206541309 206598797 206675053 206747742 206805286 206851788 206905003
2571 206905003 206986866 207112179 207282505 207488594 207721138 207981720 208287659 208664017 209127922 209672585
2581 209672585 210262699 210846348 211378937 211846352 212273808 212712307 213209820 213780804 214393101 214978905
2591 214978905 215465488 215807915 216006317 216099243 216137772 216157951 216167240 216150265 216087723 215974178 215822525
2602 215822525 215653763 215482063 215305233 215109329 214880867 214617558 214329472 214028244 213715057 213376808
2612 213376808 212994347 212558098 212079754 211589413 211120586 210689907 210286674 209877930 209426575 208912144
2622 208912144 208342037 207747612 207168884 206637306 206164532 205743313 205356255 204987354 204630013 204286957
2632 204286957 203965874 203671951 203403778 203154812 202919502 202700081 202509308 202365532 202282772 202260342
2642 202260342 202280102 202313099 202333584 202332115 202319756 202320690 202357979 202440395 202558842 202692776 202821541 202932968
2654 202932968 203025112 203101768 203166904 203223858 203278198 203341732 203431015 203560162 203730793 203926296 204116688
2665 204116688 204271736 204377270 204445496 204512043 204622059 204810810 205088730 205438213 205822525 206201725
2675 206201725 206547756 206851978 207123222 207379971 207641315 207922974 208237400 208596172 209010658 209488010
2685 209488010 210025272 210604591 211195564 211763992 212285576 212756004 213194046 213633728 214109783 214642620
2695 214642620 215228615 215841045 216438866 216980572 217437134 217798901 218075905 218291550 218473835 218646679
2705 218646679 218823891 219006100 219182205 219333477 219440060 219488659 219477825 219418659 219329166 219224930 219110813
2716 219110813 218978405 218813877 218609867 218375568 218136196 217920513 217742481 217589359 217424068 217203693
2726 217203693 216902428 216525917 216107750 215689049 215294571 214920158 214537907 214116001 213639431 213118649
2736 213118649 212583523 212066574 211588631 211154633 210759563 210397816 210067825 209768925 209493637 209223461
2746 209223461 208932362 208597965 208213387 207794151 207374096 206994743 206691895 206486244 206380348 206361961
2756 206361961 206409225 206496105 206595612 206681309 206729259 206720390 206644650 206504440 206315689 206105556 205904579
2767 205904579 205738201 205619392 205546799 205510254 205499897 205515423 205568275 205677338 205857010 206107483 206409931
2778 206409931 206732769 207044125 207325115 207576370 207815094 208064041 208339520 208644505 208969612 209300709
2788 209300709 209626141 209939861 210237789 210511913 210747509 210925293 211029167 211054058 211008301 210909729
2798 210909729 210777588 210625534 210459538 210281029 210090981 209892178 209687862 209478989 209264011 209041653
2808 209041653 208815651 208596401 208396873 208225517 208078785 207940369 207786827 207597256 207360954 207079449
2818 207079449 206762085 206419754 206060390 205687370 205301056 204899273 204478283 204032879 203559017 203058262
2828 203058262 202540493 202022285 201519718 201039639 200574341 200104580 199609699 199079189 198517990 197941952
2838 197941952 197367554 196801643 196239262 195669861 195087147 194495010 193904877 193327007 192761555 192197475
2848 192197475 191620312 191023998 190419502 189833450 189297848 188836803 188456783 188145866 187880688 187634602
2858 187634602 187383976 187110653 186802940 186457825 186084538 185705624 185352745 185054569 184822750 184643497
2868 184643497 184481010 184293060 184051437 183755684 183433113 183123245 182857399 182642365 182458611 182271709
2878 182271709 182050419 181781464 181473656 181151466 180842800 180568161 180334892 180137787 179963188 179793034
2888 179793034 179608612 179392948 179133282 178823586 178466148 178071556 177656212 177237587 176830139 176441612
2898 176441612 176071873 175714550 175360374 175001507 174636059 174269180 173911858 173575726 173268089 172988319
2908 172988319 172728863 172480068 172236576 172001629 171786900 171606789 171471481 171381168 171324558 171283627
2918 171283627 171241360 171190453 171139336 171111927 171139946 171250019 171448879 171713390 171991272 172213726 172318058
2929 172318058 172269611 172075233 171780052 171450272 171149006 170916862 170763645 170674305 170621853 170580292 170532188
2940 170532188 170468979 170388527 170291805 170182285 170065384 169947643 169833374 169722290 169609032 169485722
2950 169485722 169347172 169193554 169030552 168864594 168697929 168527222 168346119 168152351 167953243 167766724
2960 167766724 167615681 167519054 167483978 167504044 167562923 167640114 167713928 167758274 167737312 167604866 167313862
2971 167313862 166837978 166194401 165456371 164742393 164183140 163877468 163856678 164074631 164426537 164786663
2981 164786663 165046787 165139275 165039330 164755325 164317169 163770390 163177471 162615700 162166328 161894989
2991 161894989 161830406 161954021 162205448 162503128 162769413 162949600 163018970 162978363 162844429 162641926
3001 162641926 162398643 162142773 161900368 161689320 161514778 161367168 161227436 161076756 160907440 160728760
3011 160728760 160563507 160436916 160362644 160333366 160321617 160290852 160211372 160073299 159890232 159691515 159508648
3022 159508648 159362421 159256983 159183807 159130135 159087572 159055548 159038391 159039011 159054375 159074659 159087601 159085045
3034 159085045 159068222 159048195 159040813 159057665 159097223 159140797 159157476 159116449 159002666 158827200 158626270
3045 158626270 158447247 158327932 158279181 158280697 158291721 158271866 158200932 158086424 157956524 157841768 157756319
3056 157756319 157688541 157605639 157470112 157260342 156984472 156680937 156404276 156200867 156086559 156036501
3066 156036501 155995140 155902138 155722990 155467386 155184364 154936161 154764318 154667921 154606276 154525156 154389000
3077 154389000 154199610 153990498 153800974 153649464 153522015 153384209 153207169 152988567 152756357 152553005
3087 152553005 152412872 152346859 152342920 152378149 152431393 152487249 152530909 152542744 152500019 152387714 152211657
3098 152211657 152002439 151804886 151657534 151573792 151536350 151508818 151456938 151367102 151252899 151145716 151077414
3109 151077414 151064129 151098671 151154346 151196804 151197386 151142683 151037579 150900888 150756454 150622778 150506592
3120 150506592 150401630 150293856 150168829 150018339 149842396 149646692 149438534 149223013 149002409 148775892
3130 148775892 148540134 148288240 148009481 147691841 147327566 146919441 146483421 146044769 145627451 145243301
3140 145243301 144885845 144534035 144163399 143758535 143320074 142861652 142399483 141940966 141479530 140999174
3150 140999174 140485554 139936399 139364977 138793325 138239727 137707605 137183542 136645403 136076174 135473938
3160 135473938 134851847 134226742 133605146 132975388 132312822 131596203 130824528 130023193 129234018 128493433
3170 128493433 127812004 127167730 126517363 125820122 125059586 124252090 123437605 122659435 121944590 121296005
3180 121296005 120697842 120129099 119576654 119039297 118523064 118030844 117554550 117074356 116566191 116013861
3190 116013861 115419893 114807882 114215422 113678122 113212376 112805967 112421570 112013607 111550446 111030540
3200 111030540 110482998 109952402 109475250 109062548 108697062 108347073 107987490 107614174 107244911 106905460
3210 106905460 106611128 106355991 106114531 105855474 105557823 105220575 104862118 104510155 104188738 103908272
3220 103908272 103662710 103432827 103195295 102932529 102640104 102328405 102016993 101724720 101459694 101216698
3230 101216698 100982475 100747166 100513592 100297699 100119057 99986162 99886894 99790163 99657812 99460630
3240 99460630 99188213 98848906 98461218 98044586 97614174 97181044 96754265 96340036 95938931 95541945
3250 95541945 95132017 94690218 94203501 93668404 93087740 92462626 91786041 91044340 90225697 89331083
3260 89331083 88378668 87397833 86413422 85430622 84427614 83362637 82192392 80892925 79472613
3269 79472613 77970943 76443462 74940410 73490181 72094178 70736094 69399023 68080821 66799688
3278 66799688 65586824 64471645 63468866 62575164 61777549 61067677 60452671 59955063 59602175 59410486
3288 59410486 59376283 59477057 59684520 59979863 60362434 60846152 61446199 62165465 62989616 63895965
3298 63895965 64870348 65921369 67080851 68387671 69862251 71486511 73202500 74931254 76604004
3307 76604004 78187885 79692097 81152458 82603970 84058886 85501432 86900797 88231354 89486275
3316 89486275 90676327 91817551 92917881 93973417 94976673 95929928 96853094 97779379 98739109
3325 98739109 99742384 100769444 101774483 102701836 103505993 104167109 104696445 105130844 105519114 105906782
3335 105906782 106324081 106781902 107275019 107790279 108313770 108833370 109336491 109807253 110227880 110585995
3345 110585995 110883932 111142216 111391993 111658669 111946058 112232962 112485533 112679958 112820721 112941904
3355 112941904 113090258 113299484 113572416 113881168 114183693 114445953 114655256 114820175 114959383 115090284
3365 115090284 115223570 115363970 115513039 115670033 115829763 115983076 116121683 116245403 116365891 116501713
3375 116501713 116667032 116861372 117068825 117269011 117453270 117633266 117835941 118085756 118385468 118708458
3385 118708458 119007826 119238482 119379644 119445610 119480858 119540710 119668083 119876223 120144205 120427742
3395 120427742 120680866 120878105 121027908 121167984 121343603 121580229 121864634 122148819 122375116 122509003
3405 122509003 122560453 122579889 122630329 122753849 122951326 123187294 123414278 123599310 123736515 123840189
3415 123840189 123926277 123996906 124037189 124024773 123943014 123788710 123571701 123309832 123024349 122738667 122476892
3426 122476892 122259178 122092571 121963100 121835890 121666174 121418142 121081104 120674067 120236092 119808226
3436 119808226 119417000 119069300 118759165 118480988 118239918 118052845 117940445 117915564 117976723 118110371
3446 118110371 118300524 118539600 118833294 119197350 119647236 120187864 120807600 121480856 122175779 122864218
3456 122864218 123529100 124167414 124787426 125402946 126025381 126656427 127285099 127888565 128439970 128916197
3466 128916197 129303894 129598484 129796724 129887676 129847298 129639950 129225683 128567047 127631464 126387348
3476 126387348 124798880 122824373 120421190 117556114 114216242 110416737 106204119 101657839 96889772
3485 96889772 92042580 87282963 82789955 78739486 75291162 72581019 70718837 69787073 69834666
3494 69834666 70866365 72832632 75628457 79105706 83095398 87432384 91970768 96588459 101182518
3503 101182518 105663376 109954624 113997688 117758226 121228628 124423456 127370291 130097589 132625055
3512 132625055 134958038 137087994 138999586 140682611 142144117 143415003 144545870 145593195 146602335
3521 146602335 147596798 148580208 149548512 150503712 151459055 152431774 153428593 154436522 155426064 156368637
3531 156368637 157256556 158113079 158983421 159909983 160903950 161929836 162913437 163772373 164455643 164972458
3541 164972458 165394268 165824947 166353245 167010155 167756691 168510704 169198914 169803257 170372677 170991650
3551 170991650 171726074 172584000 173518562 174470978 175418968 176389236 177418041 178484020 179468822 180187283
3561 180187283 180483837 180342655 179936752 179574871 179567547 180085716 181092033 182379436 183687210 184822369
3571 184822369 185724373 186454048 187137356 187907562 188868961 190076180 191509819 193049545 194471951
3580 194471951 195505619 195944233 195768280 195199223 194635201 194484100 194976692 196064396 197457829
3589 197457829 198782215 199759045 200315132 200575161 200763416 201088600 201675129 202557926 203713989 205085964
3599 205085964 206580658 208055649 209327393 210217762 210626469 210590096 210292492 210013371 210033150 210530472
3609 210530472 211509342 212781372 214015312 214850006 215046082 214625187 213928242 213535385 214042130 215766907
3619 215766907 218525600 221610260 224025764 224903107 223899994 221382465 218283367 215701923 214447632
3628 214447632 214754696 216291065 218415947 220516319 222239609 223538380 224569626 225559311 226713734
3637 226713734 228180904 230007248 232059326 233957062 235113983 234944782 233178310 230101986 226555462
3646 226555462 223620663 222147236 222372494 223856182 225759201 227294540 228084278 228244591 228204956
3655 228204956 228423901 229184914 230552616 232437458 234662933 236979256 239059830 240553589 241213379
3664 241213379 241028099 240242901 239216881 238192577 237139320 235798588 233918667 231523685 229025230
3673 229025230 227087994 226332092 227058067 229151382 232188511 235630531 238963337 241724567 243479137
3682 243479137 243851013 242658176 240081367 236726475 233484230 231221294 230456009 231192513 232990017
3691 232990017 235203838 237245922 238737087 239521427 239609070 239135094 238362255 237679024 237520332 238192711
3701 238192711 239676952 241538486 243038845 243434696 242328663 239891224 236829605 234109917 232569180
3710 232569180 232602215 234060612 236381130 238853207 240882130 242141228 242583313 242358150 241710682
3719 241710682 240910358 240220795 239880676 240069313 240850525 242115097 243556805 244710064 245062408
3728 245062408 244228001 242137375 239166470 236119633 234013996 233700771 235467167 238821087 242615242
3737 242615242 245505199 246543350 245598793 243362198 240919895 239136028 238207703 237653923 236732979
3746 236732979 235009956 232706699 230612354 229619217 230187225 232073421 234481087 236512737 237635994
3755 237635994 237891273 237754841 237786598 238295860 239208336 240165730 240753593 240709934 240018921 238884754
3765 238884754 237639236 236638203 236172600 236394596 237263699 238536034 239823647 240723877 240975037
3774 240975037 240564613 239731770 238853397 238270836 238143768 238407459 238847961 239245930 239502068 239673634
3784 239673634 239910660 240341721 240991192 241779900 242598152 243384991 244141808 244864597 245451431 245676079
3794 245676079 245279179 244136276 242387199 240417709 238680687 237461815 236752777 236328125 235979156
3803 235979156 235734272 235893364 236829395 238683624 241169872 243638783 245377331 245954971 245395584
3812 245395584 244078159 242456512 240803642 239150925 237436676 235721626 234289322 233543739 233774376
3821 233774376 234958687 236744022 238624306 240193062 241311855 242096233 242748356 243356571 243793907
3830 243793907 243773384 243019390 241449451 239261971 236882477 234801540 233393497 232815208 233036003
3839 233036003 233970623 235614033 238063698 241376495 245325127 249219666 251965981 252421150 249920464
3848 249920464 244711227 238027573 231708508 227504215 226395416 228254757 232000751 236140327 239410553
3857 239410553 241213131 241676521 241387177 240979996 240809727 240839901 240756359 240208092 239039078 237402210
3867 237402210 235712109 234471130 234054966 234559517 235777245 237305202 238720150 239729176 240227795
3876 240227795 240261250 239942436 239390659 238721504 238063755 237555485 237296886 237287865 237409630 237489433 237424297
3887 237424297 237284412 237314434 237809486 238928585 240555439 242293167 243604603 244024410 243337135
3896 243337135 241643677 239304504 236807098 234623299 233104324 232429562 232601261 233474102 234808502
3905 234808502 236337337 237826633 239111481 240096321 240731487 240990238 240869064 240411034 239729080
3914 239729080 238999271 238411961 238100243 238086872 238285122 238555088 238782330 238928070 239020653 239098396
3924 239098396 239150143 239101562 238865376 238422699 237877426 237436638 237318497 237636738 238331680 239189701
3934 239189701 239940128 240374146 240421200 240149956 239708157 239243221 238846645 238540649 238298187 238077374
3944 238077374 237853069 237636108 237473621 237429810 237549496 237822571 238173676 238490047 238677998 238712521
3954 238712521 238644676 238560467 238519630 238521404 238520317 238476276 238393211 238313046 238272839 238265858 238245659 238170166
3966 238170166 238043442 237914581 237830143 237786121 237727184 237599449 237407112 237213459 237077236 236979733 236821556
3977 236821556 236505585 236040592 235561867 235228958 235076313 234956799 234654484 234090080 233430157 232963562
3987 232963562 232809296 232709084 232148952 230800304 228940907 227405434 226875648 226841507 224966221
3996 224966221 217520065 200951881 173884487 138393745
4000 138393745
##END=$$ End of the data block
