##TITLE=$$ Begin of the data block
##JCAMP-DX=5.00 $$ ACD/SpecManager v 10.08
##SPECTROMETER/DATA SYSTEM=Alpha
##DATE=26 Dec 2014 10:25:20
##DATA TYPE=INFRARED SPECTRUM
##DATA CLASS=XYDATA
##ORIGIN=
##OWNER=
##NPOINTS=1765
##FIRSTX=399.76428223
##LASTX=3997.64306641
##MAXX=3997.64306641
##MINX=399.76428223
##MAXY=0.83775282
##MINY=0.28925526
##XFACTOR=1.0000000000
##YFACTOR=1.000000000000000e-9
##FIRSTY=0.57931155
##DELTAX=2.03961372
##XUNITS=1/CM
##YUNITS=ARBITRARY UNITS
##XYDATA=(X++(Y..Y))
$$ plain form
399.8 579311550 577198386 575075567 572033226 569180191 568559289 570819974 574336231 576735854 576463163
418.1 576463163 573411763 570358872 568476379 567536592 566476703 563786209 559302211 554919064 553067863
436.5 553067863 554648221 558543921 562852144 566237509 568845630 571261108 573921025 576727927
452.8 576727927 578375816 577584803 574821055 572199762 570698142 569748223 567984343 564702988 560088098
471.2 560088098 555316567 552671134 552232385 552130580 551184237 549486876 548021793 547826707 548839569
489.5 548839569 549976110 549717307 547412157 544073701 541272998 539688945 538728297 537029922 533729434
507.9 533729434 529323101 524890423 521197200 518287122 515280366 511458218 507340968 503985167
524.2 503985167 502240837 502354383 503597260 505189896 506955802 509496331 513656437 519325674 525295198
$$ packed form
399.8E79311550k113164k122819l042341k853035o20902K260685L516257K399623k72691
418.1E76463163l051400l052891j882493r39787j059889k690494m483998m383147j851201
436.5E53067863J580358L895700M308223L385365K608121K415478K659917K806902
452.8E76727927J647889p91013k763748k621293j501620r49919j763880l281355m614890
471.2E60088098m771531k645433m38749j01805r46343j697361j465083j95086J012862
489.5E48839569J136541k58803k305150l338456k800703j584053r60648j698375l300488
507.9E33729434m406333m432678l693223k910078l006756l822148m117250l355801
524.2E03985167j744330J13546J242877J592636J765906K540529M160106N669237N969524
$$ plain form
542.5 525295198 529934645 531942785 531248927 529165924 527190506 525766969 524207354 521410465 516707420
560.9 516707420 510470390 503778279 497375548 491650343 486947477 483538419 481769443 482299089 485897571
579.3 485897571 492522478 500687063 508269131 513950288 517617762 520140767 522449911 524613738
595.6 524613738 525875390 525539517 523998439 522530198 522219658 523291707 525084317 526519656 527202606
613.9 527202606 527972817 530097425 534050643 539047658 543725550 547107697 549242854 551050544 553590775
632.3 553590775 556905866 559904456 561548412 561729431 561440229 562040806 563996911 566504836 568298221
650.6 568298221 568756342 568412006 568511486 569894493 572161138 574094176 575042844 575126529 574853539 575782001
671 575782001 578175128 581107616 583112001 583643138 583595753 584257782 586080134 588391721 589833677
$$ packed form
542.5E25295198M639447K008140o93858k083003j975418j423537j559615k796889m703045
560.9E16707420o237030o692111o402731n725205m702866l409058j768976N29646L598482
579.3D85897571O624907Q164585P582068N681157L667474K523005K309144K163827
595.6E24613738J261652l35873j541078j468241l10540J072049J792610J435339O82950
613.9E27202606P70211K124608L953218M997015M677892L382147K135157J807690K540231
632.3E53590775L315091K998590J643956J81019k89202O00577J956105K507925J793385
650.6E68298221M58121l44336R9480J383007K266645J933038R48668Q3685k72990R28462
671E75782001K393127K932488K004385N31137m7385O62029J822352K311587J441956
$$ plain form
689.4 589833677 589434683 587434471 584924996 582898557 581453681 579789221 577197433 573912859 571194410
707.7 571194410 570548177 572526991 576344252 580640852 584596097 588377237 592819154 598632574 605470240
726.1 605470240 611984789 616937935 620099902 622317195 624737263 627772987 630661845 632009149
742.4 632009149 631007671 628042340 624351382 620985687 618016064 614643097 610125363 604785979
758.7 604785979 599923134 596948862 596563041 598519266 602060497 606524527 611882985 618718207 627307296
777.1 627307296 636837721 645704269 652512074 657021523 660312474 663850546 668272078 673173964
793.4 673173964 677598357 680878997 683388114 686218202 690119505 694697559 698661149 700852752
809.7 700852752 701233983 700969696 701477468 703164756 704973042 705268204 703275383 699683666 695903599
$$ packed form
689.4E89833677l98994k000212k509475k026439j444876j664460k591788l284574k718449
707.7E71194410o46233J978814L817261M296600L955245L781140M441917N813420O837666
726.1F05470240O514549M953146L161967K217293K420068L035724K888858J347304
742.4F32009149j001478k965331l690958l365695k969623l372967m517734n339384
758.7F04785979m862845k974272l85821J956225L541231M464030N358458O835222Q589089
777.1F27307296R530425Q866548O807805M509449L290951L538072M421532M901886
793.4F73173964M424393L280640K509117K830088L901303M578054L963590K191603
809.7G00852752L81231k64287N07772J687288J808286K95162j992821l591717l780067
$$ plain form
828.1 695903599 692747355 689819753 686055660 680777192 674441576 668387353 663867354 661104918
844.4 661104918 659097731 656362712 652118683 646888793 641854823 637789905 634959698 634002745 635900497
862.8 635900497 640936911 648780286 659261882 671762049 684078038 693356395 698266804 699500024
879.1 699500024 698652983 696905851 694187939 689613402 682870626 675035775 667904258 662640810 658965647
897.4 658965647 655445576 650619507 644047141 636508703 629091918 622032940 614493489 605430365
913.7 605430365 594791710 583937466 574879229 569016576 566236019 565136433 564345539 563643336
930.1 563643336 563889027 566030800 570183277 575461030 580620408 584682465 586865425 586455166 582976937
948.4 582976937 576182187 565919638 552473903 536882281 520445526 503950775 487351209 470051676
$$ packed form
828.1F95903599l156244k927602l764093n278468o335616o054223m519999k762436
844.4F61104918k007187k735019m244029n229890n033970m064918k830207r56953J897752
862.8F35900497N036414P843375J0481596J2500167J2315989R278357M910409J233220
879.1F99500024q47041j747132k717912m574537o742776p834851p131517n263448l675163
897.4F58965647l520071m826069o572366p538438p416785p058978p539451r063124
913.7F05430365j0638655j0854244r058237n862653k780557j099586p90894p02203
930.1E63643336K45691K141773M152477N277753N159378M062057K182960m10259l478229
948.4E82976937o794750j0262549j3445735j5591622j6436755j6494751j6599566j7299533
$$ plain form
964.7 470051676 451531351 431851149 411657631 391758114 372711420 354758412 338121593
979 338121593 323275834 310875058 301442325 295076996 291395485 289700806 289255261 289555460 290398806
997.4 290398806 291766405 293526858 295264453 296428800 296680242 296160221 295394242 295002788 295386612
1015.7 295386612 296596497 298420757 300679058 303387374 306669742 310577899 314864963 319006145
1032 319006145 322425485 324790448 326190114 327056736 327887446 328953803 330201268 331642359 333746016
1050.4 333746016 337221950 342494339 349401087 357506037 366557449 376475453 386668950 395144552
1066.7 395144552 398568630 394625455 384751648 373453587 364795059 360206634 359230906 360902607
1083 360902607 364299506 368659377 373586804 379072338 385062426 391111761 396394551 400102943 401952356
$$ packed form
964.7D70051676j8520325j9680202k0193518j9899517j9046694j7953008j6636819
979C38121593j4845759j2400776r432733o365329l681511j694679m45545L00199Q43346
997.4B90398806J367599J760453J737595J164347K51442n20021p65979l91454L83824
1015.7B95386612J209885J824260K258301K708316L282368L908157M287064M141182
1032C19006145L419340K364963J399666Q66622Q30710J066357J247465J441091K103657
1050.4C33746016L475934N272389O906748Q104950R051412R918004J0193497Q475602
1066.7C95144552L424078l943175r873807j1298061q658528m588425r75728J671701
1083C60902607L396899M359871M927427N485534N990088O049335N282790L708392J849413
$$ plain form
1101.4 401952356 402484626 402903676 404438138 407557935 411786824 416249931 420250148 423511595 426123172
1119.8 426123172 428359628 430524886 432988882 436149418 440142572 444560826 448436469 450497061
1136.1 450497061 449646503 445486188 438550413 430109352 421539754 413833261 407462209 402505428
1152.4 402505428 398870707 396494210 395508170 396171272 398719907 403281301 409802943 418093264 427985489
1170.7 427985489 439334542 451968849 465551883 479489684 493120015 505940318 517787397
1185 517787397 528700590 538574159 546986043 553397357 557619512 560112238 561791956 563545406
1201.3 563545406 565783978 568401456 571200073 574260354 577940822 582528889 587863088 593266070
1217.7 593266070 597787678 600678623 601852417 601874292 601413429 600738764 599699497 598100245 596032977
$$ packed form
1101.4D01952356N32270M19050J534462L119797M228889M463107M000217L261447K611577
1119.8D26123172K236456K165258K463996L160536L993154M418254L875643K060592
1136.1D50497061q50558m160315o935775q441061q569598p706493o371052m956781
1152.4D02505428l634721k376497r86040O63102K548635M561394O521642Q290321R892225
1170.7D27985489J1349053J2634307J3583034J3937801J3630331J2820303J1847079
1185E17787397J0913193R873569Q411884O411314M222155K492726J679718J753450
1201.3E63545406K238572K617478K798617L060281L680468M588067N334199N402982
1217.7E93266070M521608K890945J173794K1875m60863o74665j039267j599252k067268
$$ plain form
1236 596032977 593911827 592323422 591718435 592115521 593157351 594449937 595864773 597545147 599598944
1254.4 599598944 601837397 603800654 605081618 605767667 606461048 607806623 610041201 612734497 615001917
1272.7 615001917 616189957 616278112 615736365 615137994 614755750 614450455 613871217 612800598 611364126
1291.1 611364126 609834850 608373642 606913626 605209112 603127897 600799322 598477602 596456409
1307.4 596456409 594975352 593933403 592901289 591572046 589974105 588316619 586618543 584386170
1323.7 584386170 580968976 576193690 570562422 564967692 560236990 556755543 554447353 553103030
1340 553103030 552512884 552399039 552603185 553019822 553402483 553443432 552890658 551761866 550389409 549108565
1360.4 549108565 548113823 547555029 547179639 546678543 546314240 546451867 547272325 548602223 549909413
$$ packed form
1236E96032977k121150j588405o04987L97086J041830J292586J414836J680374K053797
1254.4E99598944K238453J963257J280964O86049O93381J345575K234578K693296K267420
1272.7F15001917J188040Q8155n41747n98371l82244l05295n79238j070619j436472
1291.1F11364126j529276j461208j460016j704514k081215k328575k321720k021193
1307.4E96456409j481057j041949j032114j329243j597941j657486j698076k232373
1323.7E84386170l417194m775286n631268n594730m730702l481447k308190j344323
1340E53103030n90146j13845K04146M16637L82661M0949n52774j128792j372457j280844
1360.4E49108565r94742n58794l75390n01096l64303J37627Q20458J329898J307190
$$ plain form
1378.8 549909413 550884008 551887929 553789139 557238579 561560035 565263808 567731082 568687320 568336248
1397.1 568336248 567310989 566272140 565331936 564042568 562316775 560218751 557892799 555918217
1413.5 555918217 554653585 553743124 552940488 552571118 552536607 552819610 553695083 555175781 556995869
1431.8 556995869 558726132 560205698 561664701 563353121 565311372 567215502 568513393 568739414
1448.1 568739414 568016887 566898346 565692127 563948870 562098682 561856329 562638700 564251482 567225695
1466.5 567225695 571567535 577656269 586553216 596138537 604249716 611509323 618589997 625669777
1482.8 625669777 632194877 638159156 643780828 648852110 653023064 657034636 661599696 665941536
1499.1 665941536 669354022 671987236 674344003 677139461 680101573 682822168 685278177 687227130
$$ packed form
1378.8E49909413R74595J003921J901210L449440M321456L703773K467274R56238l51072
1397.1E68336248j025259j038849r40204j289368j725793k098024k325952j974582
1413.5E55918217j264632r10461q02636l69370l4511K83003Q75473J480698J820088
1431.8E56995869J730263J479566J459003J688420J958251J904130J297891K26021
1448.1E68739414p22527j118541j206219j743257j850188k42353P82371J612782K974213
1466.5E67225695M341840O088734Q896947R585321Q111179P259607P080674P079780
1482.8F25669777O525100N964279N621672N071282M170954M011572M565060M341840
1499.1F65941536L412486K633214K356767K795458K962112K720595K456009J948953
$$ plain form
1515.4 687227130 688803911 690336168 692252338 694448590 696459770 698138356 699294269 700063467
1531.8 700063467 700837433 702005327 703291893 704230726 704421759 704372227 704464793 704799652 705349624 705896914
1552.2 705896914 706104100 705787897 704327285 702538252 702373624 702466667 702129960 700976193 699057519
1570.5 699057519 697631001 696578562 695263743 694242239 693252623 691588879 689508140 687576771
1586.8 687576771 686062932 684786677 683268130 681106687 678460360 675802231 673381329 671238005
1603.2 671238005 669094205 666423559 662959039 659276009 656028271 652737796 649041295 646233201
1619.5 646233201 643527508 639725685 635976851 632899106 630381525 628712833 627190590 624706328
1635.8 624706328 622598648 621898890 621981859 622521579 623183906 623940945 624925077 626213491 628538609
$$ packed form
1515.4F87227130J576781J532257J916170K196252K011180J678586J155913P69198
1531.8G00063467P73966J167894J286566R38833J91033m9532R2566L34859N49972N47290
1552.2G05896914K07186l16203j460612j789033j64628R3043l36707j153767j918674
1570.5F99057519j426518j052439j314819j021504r89616j663744k080739j931369
1586.8F87576771j513839j276255j518547k161443k646327k658129k420902k143324
1603.2F71238005k143800k670646l464520l683030l247738l290475l696501k808094
1619.5F46233201k705693l801823l748834l077745k517581j668692j522243k484262
1635.8F24706328k107680o99758Q2969N39720O62327P57039R84132J288414K325118
$$ plain form
1654.1 628538609 631478012 634464681 637504101 640579879 643751562 646989584 650994658 656036198
1670.5 656036198 660671890 664960444 669258893 673270822 677350044 682220578 688523412 693798125
1686.8 693798125 697722912 701557338 705194235 709179223 713567853 717389405 720662951 723026991
1703.1 723026991 724995852 727308214 729844928 732304990 734410763 736053228 737638414 739619315
1719.4 739619315 741873562 744267464 746531010 748245537 749484360 750596941 752147138 754313111
1735.7 754313111 756393492 758203149 759681225 761013567 762594998 764687836 767356217 770156384
1752 770156384 772311389 773844898 775267065 776979864 779162884 781359315 783008754 784051776 784752429
1770.4 784752429 785576344 786928356 788563550 789986789 790854990 791247547 791629493 792420447 793596387
$$ packed form
1654.1F28538609K939403K986669L039420L075778L171683L238022M005074N041540
1670.5F56036198M635692M288554M298449M011929M079222M870534O302834N274713
1686.8F93798125L924787L834426L636897L984988M388630L821552L273546K364040
1703.1G23026991J968861K312362K536714K460062K105773J642465J585186J980901
1719.4G39619315K254247K393902K263546J714527J238823J112581J550197K165973
1735.7G54313111K080381J809657J478076J332342J581431K092838K668381K800167
1752G70156384K155005J533509J422167J712799K183020K196431J649439J043022P00653
1770.4G84752429Q23915J352012J635194J423239Q68201L92557L81946P90954J175940
$$ plain form
1788.8 793596387 794844270 795876086 796456456 796766937 797188997 798104048 799458027 800640404 801245391
1807.1 801245391 801391780 801556945 802188218 803279579 804421604 805195212 805453837 805423260 805595458
1825.5 805595458 806262136 807236850 808092892 808485091 808438182 808372021 808712900 809396982 810068429 810420215
1845.9 810420215 810403526 810251653 810325444 810770571 811424494 811920822 811989427 811730623 811542153 811681151
1866.3 811681151 812161565 812801123 813202024 813206613 813066304 813178897 813666642 814346135 814910471 815125167
1886.7 815125167 814997196 814903617 815197825 815779150 816360474 816664696 816608429 816387117 816340268 816609085
1907.1 816609085 817044139 817369580 817392111 817169547 816964567 817076683 817478776 817905843 818118334 818036139
1927.5 818036139 817836225 817804694 818060160 818482995 818799078 818789184 818525910 818336487 818484545 818913519
$$ packed form
1788.8G93596387J247883J031816N80370L10481M22060R15051J353979J182377O04987
1807.1H01245391J46389J65165O31273J091361J142025P73608K58625l0577J72198
1825.5H05595458O66678R74714Q56042L92199m6909o6161L40879O84082O71447L51786
1845.9H10420215j6689j51873P3791M45127O53923M96328O8605k58804j88470J38998
1866.3H11681151M80414O39558M00901M589j40309J12593M87745O79493N64336K14696
1886.7H15125167j27971r3579K94208N81325N81324L04222n6267k21312m6849K68817
1907.1H16609085M35054L25441K2531k22564k04980J12116M02093M27067K12491q2195
1927.5H18036139j99914l1531K55466M22835L16083r894k63274j89423J48058M28974
$$ plain form
1947.9 818913519 819382787 819645584 819622397 819476724 819477439 819777429 820248961 820610225 820693552 820575058
1968.3 820575058 820463300 820536435 820842326 821222663 821428895 821329653 821101129 821027637 821185827 821460009
1988.7 821460009 821665287 821661174 821475148 821281254 821244597 821382523 821561277 821589172 821328640 820880890
2009 820880890 820488751 820305943 820285082 820189774 819812655 819175184 818449676 817913473 817809224 817907572
2029.4 817907572 817763627 817292571 816691697 816194475 815937817 815888822 815847635 815625608 815219462 814798892
2049.8 814798892 814568579 814583898 814720631 814805269 814718127 814499259 814360201 814453840 814709961 814936996
2070.2 814936996 815004945 814889371 814702928 814650655 814810514 815040767 815173209 815169990 815087318 815048456 815151274
2092.7 815151274 815389752 815655351 815798044 815768182 815697432 815763712 816002667 816310227 816527784 816552520
$$ packed form
1947.9H18913519M69268K62797k3187j45673P15K99990M71532L61264Q3327j18494
1968.3H20575058j11758P3135L05891L80337K06232r9242k28524p3492J58190K74182
1988.7H21460009K05278m113j86026j93894l6657J37926J78754K7895k60532m47750
2009H20880890l92139j82808k0861r5308l77119o37471p25508n36203j04249R8348
2029.4H17907572j43945m71056o00874m97222k56658m8995m1187k22027m06146m20570
2049.8H14798892k30313J5319J36733Q4638q7142k18868j39058R3639K56121K27035
2070.2H14936996O7949j15574j86443n2273J59859K30253J32442l219q2672l8862J02818
2092.7H15151274K38478K65599J42693k9862p0750O6280K38955L07560K17557K4736
$$ plain form
2113.1 816552520 816422403 816303372 816347659 816561282 816800892 816888750 816774487 816564918 816441655 816535056
2133.5 816535056 816794097 816993594 816970587 816783965 816605985 816587150 816769183 817027986 817166865 817106485
2153.9 817106485 816966653 816978455 817259371 817723334 818178117 818449259 818534851 818662167 819038272 819632828
2174.3 819632828 820274353 820767701 821028411 821172118 821412385 821865082 822458982 823023736 823390186 823535562
2194.6 823535562 823633969 823889673 824359119 824929893 825412869 825669408 825752437 825906098 826319218 826917470
2215 826917470 827456295 827753544 827815413 827829957 828033924 828482449 828996897 829342604 829406738 829307973 829333305
2237.5 829333305 829653561 830136597 830538452 830718815 830699205 830655992 830778897 831118166 831525326 831779242
2257.9 831779242 831790507 831701875 831753850 832038522 832462370 832847476 833031058 832995713 832946420 833098710
$$ packed form
2113.1H16552520j30117j19031M4287K13623K39610Q7858j14263k09569j23263R3401
2133.5H16535056K59041J99497k3007j86622j77980j8835J82033K58803J38879o0380
2153.9H17106485j39832J1802K80916M63963M54783K71142Q5592J27316L76105N94556
2174.3H19632828O41525M93348K60710J43707K40267M52697N93900N64754L66450J45376
2194.6H23535562R8407K55704M69446N70774M82976K56539Q3029J53661M13120N98252
2215H26917470N38825K97249O1869J4544K03967M48525N14448L45707O4134r8765K5332
2237.5H29333305L20256M83036M01855J80363j9610m3213J22905L39269M07160K53916
2257.9H31779242J1265q8632N1975K84672M23848L85106J83582l5345m9293J52290
$$ plain form
2278.3 833098710 833437860 833795428 834013700 834055603 834027767 834066808 834287584 834688604 835044205 835149884
2298.7 835149884 835035801 834907711 835000277 835354090 835805595 836162269 836299717 836282551 836352170 836661696
2319.1 836661696 837113619 837482870 837642670 837591231 837454498 837450743 837608337 837746561 837752819 837599456
2339.5 837599456 837243140 836736262 836206794 835880518 835959494 836378694 836863935 837237358 837511837 837669253
2359.9 837669253 837607741 837201118 836499691 835608900 834680676 833958983 833498597 833085060 832514703 831811428
2380.2 831811428 831183612 830837071 830779910 830835581 830781579 830483913 830038905 829675138 829518795 829523146
2400.6 829523146 829504192 829284966 828833580 828277171 827846885 827667534 827612042 827423751 826943874 826244533
2421 826244533 825567603 825131118 824919760 824695289 824225843 823509395 822784483 822248340 821869910 821534276
$$ packed form
2278.3H33098710L39150L57568K18272M1903k7836L9041K20776M01020L55601J05679
2298.7H35149884j14083j28090R2566L53813M51505L56674J37448j7166O9619L09526
2319.1H36661696M51923L69251J59800n1439j36733l755J57594J38224O258j53363
2339.5H37599456l56316n06878n29468l26276P8976M19200M85241L73423K74479J57416
2359.9H37669253o1512m06623p01427q90791r28224p21693m60386m13537n70357p03275
2380.2H31811428o27816l46541n7161N5671n4002k97666m45008l63767j56343M351
2400.6H29523146j8954k19226m51386n56409m30286j79351n5492j88291m79877o99341
2421H26244533o76930m36485k11358k24471m69446p16448p24912n36143l78430l35634
$$ plain form
2441.4 821534276 821111858 820480883 819732666 819099069 818675041 818394184 818099976 817626655 816950381 816242337
2461.8 816242337 815692186 815341592 815093160 814764440 814240038 813586712 812980294 812544405 812261045 812013149
2482.2 812013149 811641812 811092377 810522318 810123086 809918940 809785306 809564233 809188128 808735430 808330774
2502.6 808330774 808054566 807936668 807890773 807686448 807224035 806696951 806315303 806089699 805902243 805632293
2523 805632293 805170178 804514885 803843975 803333879 802992523 802680671 802224278 801549971 800769985 800089240
2543.4 800089240 799638152 799325049 798884451 798196673 797415972 796719670 796171725 795784295 795425475 794892550
2563.8 794892550 794180632 793466985 792921126 792558312 792221129 791755259 791121781 790391266 789718270 789237916
2584.2 789237916 788968682 788751900 788374126 787810981 787230372 786801815 786568820 786401570 786083698 785526991
$$ packed form
2441.4H21534276m22418o30975p48217o33597m24028k80857k94208m73321o76274p08044
2461.8H16242337n50151l50594k48432l28720n24402o53326o06418m35889k83360k47896
2482.2H12013149l71337n49435n70059l99232k04146j33634k21073l76105m52698m04656
2502.6H08330774k76208j17898m5895k04325m62413n27084l81648k25604j87456k69950
2523H05632293m62115o55293o70910n10096l41356l11852m56393o74307p79986o80745
2543.4H00089240m51088l13103m40598o87778p80701o96302n47945l87430l58820n32925
2563.8G94892550p11918p13647n45859l62814l37183m65870o33478p30515o72996m80354
2584.2G89237916k69234k16782l77774n63145n80609m28557k32995j67250l17872n56707
$$ plain form
2604.6 785526991 784832537 784179449 783678591 783281744 782819867 782128751 781207919 780224860 779350042 778619289
2625 778619289 777882338 776957095 775837958 774655998 773542702 772565544 771692932 770774066 769701838
2643.4 769701838 768537343 767387390 766353071 765454292 764566839 763585627 762502909 761363924 760284901
2661.7 760284901 759347081 758503914 757664084 756748259 755757689 754787207 753931284 753192961 752461731 751655519
2682.1 751655519 750806987 749935627 749056160 748246491 747495174 746696293 745805383 744840860 743844688 742849708
2702.5 742849708 741872132 740942776 740011692 738988519 737905264 736831546 735828459 734940529 734129965
2720.9 734129965 733323693 732493281 731660068 730841517 730055749 729343534 728723228 728091240 727337539 726526737
2741.2 726526737 725768626 725124121 724597692 724074066 723430932 722697616 721987784 721377850 720889688 720453560
$$ packed form
2604.6G85526991o94454o53088n00858l96847m61877o91116r20832r83059q74818p30753
2625G78619289p36951r25243j119137j181960j113296r77158q72612r18866j072228
2643.4G69701838j164495j149953j034319q98779q87453r81212j082718j138985j079023
2661.7G60284901r37820q43167q39830r15825r90570r70482q55923p38323p31230q06212
2682.1G51655519q48532q71360q79467q09669p51317p98881q90910r64523r96172r94980
2702.5G42849708r77576r29356r31084j023173j083255j073718j003087q87930q10564
2720.9G34129965q06272q30412q33213q18551p85768p12215o20306o31988p53701q10802
2741.2G26526737p58111o44505n26429n23626o43134p33316p09832o09934m88162m36128
$$ plain form
2761.6 720453560 719942570 719313562 718622863 717946649 717334390 716771603 716164172 715397537 714453161 713449061
2782 713449061 712530851 711721063 710885167 709850132 708593249 707238078 705888093 704585671 703300714
2800.4 703300714 701932788 700379312 698650062 696893036 695192516 693492174 691738546 689866900
2816.7 689866900 687819839 685683012 683566511 681468546 679341912 677137077 674772859 672231734
2833 672231734 669628680 667047620 664418936 661555231 658352673 654888511 651284695 647715330 644434690
2851.4 644434690 641568065 639014304 636574090 634050488 631318867 628287554 624823213 620862007
2867.7 620862007 616502464 611871421 607013702 602006435 597106516 592625797 588726699 585481942
2884 585481942 582920969 581006765 579678178 578807294 578194082 577642858 576998293 576195657 575258017
$$ packed form
2761.6G20453560n10990o29008o90699o76214o12259n62787o07431p66635r44376j004100
2782G13449061r18210q09788q35896j035035j256883j355171j349985j302422j284957
2800.4G03300714j367926j553476j729250j757026j700520j700342j753628j871646
2816.7F89866900k047061k136827k116501k097965k126634k204835k364218k541125
2833F72231734k603054k581060k628684k863705l202558l464162l603816l569365l280640
2851.4F44434690k866625k553761k440214k523602k731621l031313l464341l961206
2867.7F20862007m359543m631043m857719n007267m899919m480719l899098l244757
2884E85481942k560973j914204j328587q70884o13212n51224o44565q02636r37640
$$ plain form
2902.4 575258017 574179173 572890759 571301222 569278955 566724658 563667893 560241938 556651533
2918.7 556651533 553139627 549937963 547225296 545172751 543949306 543636620 544341683 546177268 549053252
2937 549053252 552796721 557254612 562196672 567394018 572698474 578050256 583432496 588743508 593914866
2955.4 593914866 599024594 604115427 609060287 613649189 617802203 621587694 625106990 628506601
2971.7 628506601 631860197 635098279 638201416 641165793 643875003 646280527 648462892 650466859
2988 650466859 652290463 653870821 655109525 656058729 656802595 657302141 657507241 657387257 656975508
3006.4 656975508 656387568 655688941 654811502 653674066 652280748 650645614 648794591 646860301 644939363
3024.7 644939363 642955720 640885174 638779998 636601686 634253323 631814122 629537404 627372980
$$ packed form
2902.4E75258017j078844j288414j589537k022267k554297l056765l425955l590405
2918.7E56651533l511906l201664k712667k052545j223445l12686P05063J835585K875984
2937E49053252L743469M457891M942060N197346N304456N351782N382240N311012N171358
2955.4E93914866N109728N090833M944860M588902M153014L785491L519296L399611
2971.7F28506601L353596L238082L103137K964377K709210K405524K182365K003967
2988F50466859J823604J580358J238704R49204P43866M99546K05100j19984m11749
3006.4F56975508n87940o98627q77439j137436j393318j635134j851023j934290j920938
3024.7F44939363j983643k070546k105176k178312k348363k439201k276718k164424
$$ plain form
3041.1 627372980 625021398 622407317 619685709 617022216 614424706 611841738 609262407 606578231
3057.4 606578231 603781164 601076722 598549783 596110761 593575656 590827584 588022470 585380733
3073.7 585380733 582944036 580558181 578045487 575426698 572768688 570037186 567290425 564609706
3090 564609706 561914563 559189081 556597888 554160535 551605880 548874676 546296000 543979764 541658998
3108.4 541658998 539135993 536604166 534285784 532028675 529670656 527170062 524505258 521844327
3124.7 521844327 519382000 517077923 514767885 512418270 510160387 508024275 505824745 503436387
3141 503436387 500997722 498702973 496586442 494620323 492715478 490640134 488346398 486083984 483968467
3159.4 483968467 481949896 479994327 478047758 476072550 474096090 472182989 470350832 468557149
$$ packed form
3041.1F27372980k351582k614081k721608k663493k597510k582968k579331k684176
3057.4F06578231k797067k704442k526939k439022k535105k748072k805114k641737
3073.7E85380733k436697k385855k512694k618789k658010k731502k746761k680719
3090E64609706k695143k725482k591193k437353k554655k731204k578676k316236k320766
3108.4E41658998k523005k531827k318382k257109k358019k500594k664804k660931
3124.7E21844327k462327k304077k310038k349615k257883k136112k199530k388358
3141E03436387k438665k294749k116531j966119j904845k075344k293736k262414k115517
3159.4D83968467k018571j955569j946569j975208j976460j913101j832157j793683
$$ plain form
3175.7 468557149 466745496 464931369 463186443 461502016 459822655 458162546 456515789 454823375
3192 454823375 453129292 451480031 449860930 448331416 446911633 445502222 444046587 442571253 441144228
3210.3 441144228 439793408 438471973 437181652 435901791 434559196 433184445 431877404 430685043
3226.7 430685043 429599106 428635180 427706569 426578552 425290346 424091667 423024148 422025502 421077281
3245 421077281 420116901 419035614 417925924 417015076 416228592 415319294 414333850 413448781 412631541 411847562
3265.4 411847562 411205232 410675168 410028458 409171432 408223063 407296896 406438023 405668348 404980063 404311836
3285.8 404311836 403670549 403147370 402672708 402082026 401315868 400413305 399541497 398897231 398475021 398002356
3306.2 398002356 397228658 396195769 395141065 394230247 393407136 392589003 391806304 391090393 390356481
$$ packed form
3175.7D68557149j811653j814127j744926j684427j679361j660109j646757j692414
3192D54823375j694083j649261j619101j529514j419783j409411j455635j475334j427025
3210.3D41144228j350820j321435j290321j279861j342595j374751j307041j192361
3226.7D30685043j085937r63926r28611j128017j288206j198679j067519r98646r48221
3245D21077281r60380j081287j109690r10848p86484r09298r85444q85069q17240p83979
3265.4D11847562o42330n30064o46710q57026r48369r26167q58873p69675o88285o68227
3285.8D04311836o41287n23179m74662n90682p66158r02563q71808o44266m22210m72665
3306.2C98002356p73698j032889j054704r10818q23111q18133p82699p15911p33912
$$ plain form
3324.6 390356481 389450759 388417751 387445241 386589557 385864019 385244966 384547681 383691192 382784307
3342.9 382784307 381837457 380925655 380190104 379412830 378369570 377236009 376272917 375489920 374702424
3361.3 374702424 373927265 373350501 372861207 372124881 371040374 369889885 368965894 368255824 367603838
3379.6 367603838 366868913 366109312 365522921 365220159 365134060 364906341 364338577 363765031 363522083 363429666
3400 363429666 363005936 362239420 361636519 361349642 361153811 360921562 360582888 360212147 359974861 359812945
3420.4 359812945 359672219 359659433 359823704 360087812 360263348 360450476 360817790 361015707 360849440 360708028
3440.8 360708028 360867679 361233383 361612976 361935467 362328380 362832189 363374859 363983959 364656687 365206212
3461.2 365206212 365736425 366629541 367732346 368476212 368755192 369062930 369704604 370588064 371424496
$$ packed form
3324.6C90356481r05722j033008r72510q55684p25538o19053o97285q56489r06885
3342.9C82784307r46850r11802p35551p77274j043260j133561r63092p82997p87496
3361.3C74702424p75159n76764m89294p36326j084507j150489r23991p10070o51986
3379.6C67603838p34925p59601n86391l02762q6099k27719n67764n73546k42948r2417
3400C63429666m23730p66516o02901k86877j95831k32249l38674l70741k37286j61916
3420.4C59812945j40726j2786J64271K64108J75536J87128L67314J97917j66267j41412
3440.8C60708028J59651L65704L79593L22491L92913N03809N42670O09100O72728N49525
3461.2C65206212N30213Q93116J102805P43866K78980L07738O41674Q83460Q36432
$$ plain form
3479.6 371424496 371991128 372584790 373448223 374276221 374963343 375756174 376701951 377708644 378671557
3497.9 378671557 379590839 380479634 381211847 381872028 382657170 383597106 384689748 385726780 386521697
3516.3 386521697 387301087 388340801 389619350 390723109 391465813 392224848 393280476 394554764 395894438
3534.6 395894438 397087395 398105353 399318933 400794923 402157038 403192610 404247850 405554801
3551 405554801 406937420 408380717 409981519 411738962 413565278 415249556 416704208 418362856 420582861
3569.3 420582861 422980964 425293475 427645147 430088311 432644397 435382903 438168108 440708160
3585.6 440708160 443038493 445745647 448732406 451593965 454515040 457763970 461114943 464407414
3601.9 464407414 467662692 470719039 473664165 476828128 480245620 483803302 487327486 490750998
$$ packed form
3479.6C71424496N66632N93662Q63433Q27998O87122P92831R45777J006693R62913
3497.9C78671557R19282Q88795P32213O60181P85142R39936J092642J037032P94917
3516.3C86521697P79390J039714J278549J103759P42704P59035J055628J274288J339674
3534.6C95894438J192957J017958J213580J475990J362115J035572J055240J306951
3551D05554801J382619J443297J600802J757443J826316J684278J454652J658648K220005
3569.3D20582861K398103K312511K351672K443164K556086K738506K785205K540052
3585.6D40708160K330333K707154K986759K861559K921075L248930L350973L292471
3601.9D64407414L255278L056347K945126L163963L417492L557682L524184L423512
$$ plain form
3618.3 490750998 494351685 498070389 501628160 504778504 507740617 511420012 515398502 519159317
3634.6 519159317 522788763 526347041 529897332 533479750 536888123 539875388 542904854 546745420
3650.9 546745420 550751925 554372191 558001280 561761975 565205693 568324327 571450949 574414372
3667.2 574414372 577005982 579779565 582537472 584892631 587776124 591114283 594236135 597137451
3683.5 597137451 599878371 602304876 604233027 606238484 608657181 611057460 613135517 614853621
3699.8 614853621 616426110 618292511 620373011 622161448 623422801 624658108 626551569 628618777
3716.2 628618777 630367815 631789505 633016467 634189904 635515928 637182117 638807058 639983654
3732.5 639983654 640812814 641898930 643483222 644955754 645601034 645813406 646904230 648017287 648484647
$$ packed form
3618.3D90750998L600687L718704L557771L150344K962113L679395L978490L760815
3634.6E19159317L629446L558278L550291L582418L408373K987265L029466L840566
3650.9E46745420M006505L620266L629089L760695L443718L118634L126622K963423
3667.2E74414372K591610K773583K757907K355159K883493L338159L121852K901316
3683.5E97137451K740920K426505J928151K005457K418697K400279K078057J718104
3699.8F14853621J572489J866401K080500J788437J261353J235307J893461K067208
3716.2F28618777J749038J421690J226962J173437J326024J666189J624941J176596
3732.5F39983654Q29160J086116J584292J472532O45280K12372J090824J113057M67360
$$ plain form
3750.8 648484647 649531782 651192605 652529955 653494000 654652476 655980945 657083511 657956064 658678532
3769.2 658678532 659516573 660671353 661869884 662847400 663531959 664203465 664929628 665648937 666553557
3787.5 666553557 667612135 668602645 669344008 669837475 670406222 670911908 671256959 672116101 672953784
3805.9 672953784 673490345 674407482 675519168 676195204 676482797 677055061 677520573 677918613 678791344
3824.3 678791344 679626942 680295467 680888057 681435823 682079077 682437420 682451487 682917595 683772027 684659839
3844.6 684659839 685581386 686369956 686534047 685682058 685508788 686822832 688089848 688736200 688876510
3863 688876510 689112186 689657629 689974606 690292716 690941989 691647530 692245245 692489028 692745388 693291545
3883.4 693291545 693662763 694078982 694484770 694612205 695069730 695826352 696202457 696147382 696036518 696066678
$$ packed form
3750.8F48484647J047135J660823J337350R64045J158476J328469J102566Q72553P22468
3769.2F58678532Q38041J154780J198531R77516O84559O71506P26163P19309R04620
3787.5F66553557J058578R90510P41363M93467N68747N05686L45051Q59142Q37683
3805.9F72953784N36561R17137J111686O76036K87593N72264M65512L98040Q72731
3824.3F78791344Q35598O68525N92590N47766O43254L58343J4067M66108Q54432Q87812
3844.6F84659839R21547P88570J64091q51989j73270J314044J267016O46352J40310
3863F88876510K35676N45443L16977L18110O49273P05541N97715K43783K56360N46157
3883.4F93291545L71218M16219M05788J27435M57525P56622L76105n5075j10864L0160
$$ plain form
3903.8 696066678 696480274 697207451 697850645 698266625 698450148 698428452 698488891 698877752 699319959 699533522
3924.2 699533522 699746311 700071216 700256765 700425327 700826287 701218903 701372325 701325059 701262057 701464057
3944.6 701464057 701888025 702255011 702512622 702716470 702928960 703209937 703534782 703780711 703899086 704050004
3965 704050004 704245687 704379380 704530358 704736650 704969108 705190659 705315113 705435455 705618501 705766141
3985.4 705766141 705913305 706105173 706261814 706344783 706443787 706664562
3997.6 706664562
$$ packed form
3903.8F96066678M13596P27177O43194M15980J83523k1696O0439L88861M42207K13563
3924.2F99533522K12789L24905J85549J68562M00960L92616J53422m7266o3002K02000
3944.6G01464057M23968L66986K57611K03848K12490K80977L24845K45929J18375J50918
3965G04050004J95683J33693J50978K06292K32458K21551J24454J20342J83046J47640
3985.4G05766141J47164J91868J56641Q2969R9004K20775
3997.6G06664562
##END=$$ End of the data block
