##TITLE=$$ Begin of the data block
##JCAMP-DX=5.00 $$ ACD/SpecManager v 10.08
##SPECTROMETER/DATA SYSTEM=Alpha
##DATE=26 Dec 2014 10:25:20
##DATA TYPE=INFRARED SPECTRUM
##DATA CLASS=XYDATA
##ORIGIN=
##OWNER=
##NPOINTS=1765
##FIRSTX=399.76428223
##LASTX=3997.64306641
##MAXX=3997.64306641
##MINX=399.76428223
##MAXY=0.83813202
##MINY=0.28938356
##XFACTOR=1.0000000000
##YFACTOR=1.000000000000000e-9
##FIRSTY=0.57918382
##DELTAX=2.03961372
##XUNITS=1/CM
##YUNITS=ARBITRARY UNITS
##XYDATA=(X++(Y..Y))
399.8E79183817k813161k361893l094793k614378k17259K512812L725112K757907k50459
418.1E76827705l431022k782822j281381j029074j685440l108442m414261m024386
434.4E55070877j679361J449645L733754M335999L244520K174496K461791L234744
450.8E74026465L023684J390279q20339k534270k601862j749993j142859j727700l247679
469.1E64615726m538714m667938k760589n68629J16587n22852j577675j740277m83871
487.5E47871768Q43823R29118l81828k181709l177285k797901j585067p93516j453340
505.8E37274063l170789m570126m691303l755748k872348k959192l724873m066288
522.1E07463396l425360j874268Q4281J353264J673162J800716K550840M061520N589426
$$ y = [579183817, 576370656, 574008763, 570913970, 568299592, 568082333, 570595145, 574320257, 577078164, 576827705, 573396683, 570613861, 569332480, 568303406, 566617966, 563509524, 559095263, 555070877, 553391516, 554841161, 558574915, 562910914, 566155434, 568329930, 570791721, 574026465, 577050149, 578440428, 577620089, 575085819, 572483957, 570733964, 569591105, 567863405, 564615726, 560077012, 555409074, 552648485, 552079856, 552196443, 551673591, 550095916, 548355639, 547871768, 548715591, 549644709, 549262881, 547081172, 543903887, 541105986, 539520919, 538727403, 537274063, 534103274, 529533148, 524841845, 521086097, 518213749, 515254557, 511529684, 507463396, 504038036, 502163768, 502248049, 503601313, 505274475, 507075191, 509626031, 513687551, 519276977]
540.5E19276977N948007M498720J914739n34057j894593j902700j427531j698911l002048
558.9E21178603m722416o134212o659031o313533n545944m622489l479063j794547
575.2D81907368O14702L537566O370216Q041442P684588N762935L747463K695799K364159
593.5E22726238K021432J120925m04060j632512j509249k33710J146674J862407J574695
611.9E26672840P98583P88927K119482L973782N023539M662752L322840K066850J761675
630.2E51191270K523303L348887L078997J636863O4850l73959O20424K029062K546906
648.6E66666603J755118L68834l96371J38521J480699K344966J953959R08852Q285
667E75229466k81572R77635K400815K915323K057314O62267L8147O21796J735747K296507
$$ y = [519276977, 525224984, 529723704, 531638443, 531104386, 529209793, 527307093, 525879562, 524180651, 521178603, 516456187, 510321975, 503662944, 497349411, 491803467, 487180978, 483701915, 481907368, 482522070, 486059636, 492429852, 500471294, 508155882, 513918817, 517666280, 520362079, 522726238, 524747670, 525868595, 525464535, 523832023, 522322774, 522089064, 523235738, 525098145, 526672840, 527471423, 528260350, 530379832, 534353614, 539377153, 544039905, 547362745, 549429595, 551191270, 553714573, 557063460, 560142457, 561779320, 561844170, 561470211, 562090635, 564119697, 566666603, 568421721, 568790555, 568394184, 568532705, 570013404, 572358370, 574312329, 575221181, 575229466, 574947894, 575925529, 578326344, 581241667, 583298981, 583961248, 583999395, 584621191, 586356938, 588653445]
687.3E88653445J470089m26590k047301k455890j945019j467764j712799k638996l376722
705.7E74052453k763450o49870J974166L879130M373908L979921L820479M481793N764961
724.1E98913491O817400O605625M994810L097057K152384K386093K985894K853156
740.4F30805910J349151r99868k941907l651917l381729l055453l418505m452050n264401
758.7F04989231m827083k935588l58999J918674L422022M351437N363047O918728Q675635
777.1F27517104R662330Q987248O793618M431248L216148L461182M396021M902065
793.4F73366964M412472L284037K537966K929926M010379M553139L868103K116323
809.7G01079309L20315k61366N28991J635611J757980L32236j881182l502429l807723
$$ y = [588653445, 590123534, 589696944, 587649643, 585193753, 583248734, 581780970, 580068171, 577429175, 574052453, 571289003, 570639133, 572613299, 576492429, 580866337, 584846258, 588666737, 593148530, 598913491, 605730891, 612336516, 617331326, 620428383, 622580767, 624966860, 627952754, 630805910, 632155061, 631155193, 628213286, 624561369, 621179640, 618124187, 614705682, 610253632, 604989231, 600162148, 597226560, 596867561, 598786235, 602208257, 606559694, 611922741, 618841469, 627517104, 637179434, 646166682, 652960300, 657391548, 660607696, 664068878, 668464899, 673366964, 677779436, 681063473, 683601439, 686531365, 690541744, 695094883, 698962986, 701079309, 701399624, 701138258, 701667249, 703302860, 705060840, 705393076, 703511894, 700009465, 696201742]
828.1F96201742l255964l009081l797650n277276o336510o056428m505754k774894
844.4F61188185k071142k755642m154980n112052m979491m048705k803743j003027
860.7F34259403J759708M935205P847726J0536015J2490571J2290001R316623M932165
877F98367417J228988q45551j769782k750873m576743o729185p862807p183671n286097
895.4F62591696l679931l512681m803419o537914p503629p432938p137477p619143
911.7F14364564r077787j0598004j0822773r036064n835772k775907j108587p94649
928E64315021o87897K76327K130389M074872N204022N163252M115164K186001m61162
946.4E86315989l496229o783545j0249615j3415217j5566647j6437412j6526520j6636133
$$ y = [696201742, 692945778, 689936697, 686139047, 680861771, 674525261, 668468833, 663963079, 661188185, 659117043, 656361401, 652206421, 647094369, 642114878, 638066173, 635262430, 634259403, 636019111, 640954316, 648802042, 659338057, 671828628, 684118629, 693435252, 698367417, 699596405, 698750854, 696981072, 694230199, 689653456, 682924271, 675061464, 667877793, 662591696, 658911765, 655399084, 650595665, 644057751, 636554122, 629121184, 621983707, 614364564, 605286777, 594688773, 583866000, 574829936, 568994164, 566218257, 565109670, 564315021, 563627124, 563903451, 566033840, 570108712, 575312734, 580475986, 584591150, 586777151, 586315989, 582819760, 576036215, 565786600, 552371383, 536804736, 520367324, 503840804, 487204671]
962.7D87204671j7288596j8487870j9707948k0242930j9886136j9008726j7917245
977C54665220j6603172j4814675j2354582r397924o366134l690243j665026l89904
993.3B89383560L33071Q48770J374692J771092J718313J136661K75939m83781p96974
1011.6B95561343m53233L51965J210392J837164K244145K666771L281563L946960M286647
1030C14933717M110873L410906K362102J389980Q94457Q76546J054526J202702J436144
1048.4C31671953K148569L510207N251527O869882Q094698R058118R933680J0204673
1064.7C86743307Q440971L384799l933280r840370j1283397q700192m638374r63122
1081C59210342J741767L470123M379839M905998N447507N936980O021828N308628L733665
$$ y = [487204671, 469916075, 451428205, 431720257, 411477327, 391591191, 372582465, 354665220, 338062048, 323247373, 310892791, 301494867, 295128733, 291438490, 289773464, 289383560, 289716631, 290565401, 291940093, 293711185, 295429498, 296566159, 296842098, 296358317, 295561343, 295108110, 295460075, 296670467, 298507631, 300751776, 303418547, 306700110, 310647070, 314933717, 319044590, 322455496, 324817598, 326207578, 327102035, 327978581, 329033107, 330235809, 331671953, 333820522, 337330729, 342582256, 349452138, 357546836, 366604954, 376538634, 386743307, 395184278, 398569077, 394635797, 384795427, 373512030, 364811838, 360173464, 359210342, 360952109, 364422232, 368802071, 373708069, 379155576, 385092556, 391114384, 396423012, 400156677]
1099.4D00156677J850128N66840M97997J573354L088564M206746M444033L962338L262312
1117.7D23608989K607822K188325K158195K526760L200352L964484M371822L843814
1134D48470563K023399q75622m130841o895154q436800q587986p711947o327390m907966
1152.4D02620256l630549k381265r84311O47038K522499M552245O538778Q304924R887159
1170.7D28076774J1365741J2658805J3567746J3919383J3649464J2860179J1859297
1185E17957389J0895908R853304Q360088O354391M235268K542376J690865J730561
1201.3E63620150K228141K649844K844691L070831L660917M555762N320013N428672
1217.7E93379021M532993K870917J166105J2159m83572o82354j023710j563251k027452
$$ y = [400156677, 402006805, 402573645, 403071642, 404644996, 407733560, 411940306, 416384339, 420346677, 423608989, 426216811, 428405136, 430563331, 433090091, 436290443, 440254927, 444626749, 448470563, 450493962, 449618340, 445487499, 438592345, 430155545, 421567559, 413855612, 407528222, 402620256, 398989707, 396608442, 395624131, 396271169, 398793668, 403345913, 409884691, 418189615, 428076774, 439442515, 452101320, 465669066, 479588449, 493237913, 506098092, 517957389, 528853297, 538706601, 547066689, 553421080, 557656348, 560198724, 561889589, 563620150, 565848291, 568498135, 571342826, 574413657, 578074574, 582630336, 587950349, 593379021, 597912014, 600782931, 601949036, 601961195, 601477623, 600795269, 599771559, 598208308, 596180856]
1236E96180856k090633j577913o27637L69787J023590J260400J391411J685917K056599
1254.4E99672377K217352J948357J299322O82473O63042J367271K289176K718449K265811
1272.7F15123630J176953Q2374n39601n93603l61323k88964n94616j084625j436532
1291.1F11483693j528978j465976j473248j691401k054215k329290k321303k021491
1307.4E96597791j501203j051009j038134j351773j590133j626194j700520k241969
1323.7E84496856l409148m771828n640686n595088m704833l446579k275944j329481
1340E53323269o12617j51872J89304M25398L72887M888n78404j114189j336992j275361
1360.4E49246311r95695n24581l50833n08606l78728J43707Q28027J302362J276076
$$ y = [596180856, 594090223, 592512310, 591884673, 592254460, 593278050, 594538450, 595929861, 597615778, 599672377, 601889729, 603838086, 605137408, 605819881, 606482923, 607850194, 610139370, 612857819, 615123630, 616300583, 616382957, 615843356, 615249753, 614888430, 614599466, 614004850, 612920225, 611483693, 609954715, 608488739, 607015491, 605324090, 603269875, 600940585, 598619282, 596597791, 595096588, 594045579, 593007445, 591655672, 590065539, 588439345, 586738825, 584496856, 581087708, 576315880, 570675194, 565080106, 560375273, 556928694, 554652750, 553323269, 552710652, 552558780, 552748084, 553173482, 553546369, 553551257, 552972853, 551858664, 550521672, 549246311, 548250616, 547726035, 547375202, 546866596, 546487868, 546631575, 547459602, 548761964, 550038040]
1378.8E50038040R74536J012206J890719L444075M330218L699362K474547R85920l65019
1397.1E68484604j094162j084983r34661j258671j692832k092123k335727j967788
1413.5E56023657j243829q78573p89821l82721k1875L16620R02056J500488J826822
1431.8E57252824J721680J477838J460791J662135J915514J881600J324355K66969
1448.1E68963706p29858j138509j185536j689673j834571k78652P49410J589775K953171
1466.5E67399263M334808O118357Q941472R610772Q119106P215857P008672P052720
1482.8F25801027O550133N994737N640328N088687M185021M006326M536867M336119
1499.1F66139245L432155K659917K378463K753139K938688K743780K452493J934707
$$ y = [550038040, 551012576, 552024782, 553915501, 557359576, 561689794, 565389156, 567863703, 568849623, 568484604, 567390442, 566305459, 565370798, 564112127, 562419295, 560327172, 557991445, 556023657, 554779828, 553901255, 553111434, 552728713, 552706838, 553023458, 553925514, 555426002, 557252824, 558974504, 560452342, 561913133, 563575268, 565490782, 567372382, 568696737, 568963706, 568233848, 567095339, 565909803, 564220130, 562385559, 562106907, 562856317, 564446092, 567399263, 571734071, 577852428, 586793900, 596404672, 604523778, 611739635, 618748307, 625801027, 632351160, 638345897, 643986225, 649074912, 653259933, 657266259, 661803126, 666139245, 669571400, 672231317, 674609780, 677362919, 680301607, 683045387, 685497880, 687432587]
1515.4F87432587J591861J575351J942575K178610J980841J635253J127601P97510
1531.8G00262189Q30352J204491J344979R90033J29342j09553P7009L40819N48661
1550.1G05618322N34832K30492k42711j366973j835227k81155L8088l48509j156389
1568.5G01190770j928568j432657j039327j312852j044392j000226j662016k087354
1584.8F89683378j927316j499176j295209j538337k142548k628386k648056k404392
1601.1F73599958k161383k208054k723456l471493l656686l210187l283441l747463
1617.4F49137795k822340k640605l741860l761589l120542k570570j703500j511216
1633.7F27265573k438367k089143p19547R5010O05762P21872P55369R77278J306951
$$ y = [687432587, 689024448, 690599799, 692542374, 694720984, 696701825, 698337078, 699464679, 700262189, 701092541, 702297032, 703642011, 704632044, 704761386, 704651833, 704728842, 705069661, 705618322, 706153154, 706383646, 706140935, 704773962, 702938735, 702657580, 702695668, 702347159, 701190770, 699262202, 697829545, 696790218, 695477366, 694432974, 693432748, 691770732, 689683378, 687756062, 686256886, 684961677, 683423340, 681280792, 678652406, 676004350, 673599958, 671438575, 669230521, 666507065, 663035572, 659378886, 656168699, 652885258, 649137795, 646315455, 643674850, 639932990, 636171401, 633050859, 630480289, 628776789, 627265573, 624827206, 622738063, 622018516, 622113526, 622719288, 623441160, 624196529, 625173807, 626480758]
1652.1F26480758K354026K964973L005624L060282L106534L198564L235340L980458
1668.4F51386559N032063M653811M301429M297197M028856M111767M904866O327272
1684.7F89043820N276203L897905L761471L577172M004300M426777L806115L264606
1701.1G21058369K369761J947343K267898K518355K474189K133966J687169J583159
1717.4G38040209J909196K221644K404988K283811J741350J267851J124501J540601
1733.7G52534151K147615K055228J775205J464426J359880J615525K107143K681255
1750G67740428K796829K126873J506686J395464J706242K208174K203107J639843J050472
1768.4G84374118P31945Q62360J330376J573801J403212Q90672M11034L81708P82967
$$ y = [626480758, 628834784, 631799757, 634805381, 637865663, 640972197, 644170761, 647406101, 651386559, 656418622, 661072433, 665373862, 669671059, 673699915, 677811682, 682716548, 689043820, 694320023, 698217928, 701979399, 705556571, 709560871, 713987648, 717793763, 721058369, 723428130, 725375473, 727643371, 730161726, 732635915, 734769881, 736457050, 738040209, 739949405, 742171049, 744576037, 746859848, 748601198, 749869049, 750993550, 752534151, 754681766, 756736994, 758512199, 759976625, 761336505, 762952030, 765059173, 767740428, 770537257, 772664130, 774170816, 775566280, 777272522, 779480696, 781683803, 783323646, 784374118, 785106063, 785968423, 787298799, 788872600, 790275812, 791166484, 791577518, 791959226, 792742193]
1786.7G92742193J185179J265048J019061N63085L19839M42564R16243J326024J176656
1805.1H00955892O37710J45495J19149O09279J109481J165390P75397K61783j0073
1823.4H05769503J84655O63638R60887Q47876L88980p1228r8705L16799O70910O98566
1843.8H10331881L96967j2219j84000M6134M54903O65367M74810N8830k31504j58906
1864.2H11842263J45614M77493O49810M11450K921j69694P7188N13732P36535N74350
1884.6H15261662J91689j56284j29223K91705O32286O27578K91526r4592k30432m5061
1905H16640854K57611M30107L32535K6345k20895j98126J15991M00245M23670K23279
1925.4H18431616o0499j98603l9458K51949M00603K98798p570k71499j97768J53422
$$ y = [792742193, 793927372, 795192420, 796211481, 796774566, 797094405, 797536969, 798453212, 799779236, 800955892, 801593602, 801739097, 801858246, 802467525, 803577006, 804742396, 805517793, 805779576, 805769503, 805954158, 806617796, 807578683, 808426559, 808815539, 808744311, 808645606, 808962405, 809633315, 810331881, 810728848, 810716629, 810532629, 810578763, 811033666, 811699033, 812173843, 812232673, 812001169, 811842263, 811987877, 812465370, 813115180, 813526630, 813529551, 813359857, 813437045, 813950777, 814687312, 815261662, 815453351, 815297067, 815167844, 815459549, 816091835, 816719413, 817010939, 816916347, 816685915, 816640854, 816898465, 817328572, 817661107, 817687452, 817466557, 817268431, 817384422, 817784667, 818208337, 818431616, 818371117, 818172514, 818133056, 818385005, 818785608, 819084406, 819076836, 818805337, 818607569, 818760991]
1945.8H18760991M38273M81129K78115k0027j52290L338L08454M77850L53515O6340
1966.2H20995688j31964j24753P4268L22818L98040K29061p3016k31087j01447J49190
1986.6H21506798K82645J96577l2247k05814j92762j6510J78039J97410k324k82347
2007H21629465m43340l92973j71542K980r1255l84092o33657p13647n35488j24931
2027.4H18141520R1255j17898m57287o22571n22852k63929n5551n1916k26617m11630
2047.8H15502524m23789k30372K8134J66476J01625q0287j98364j23441P3194K31087
2068.2H15046787K30909N5968j47223j78158k4379J54436K20180J41024p629j05679
2088.6H15386236n3048J28388K87652K73585J07527n0306o7473Q3626K71499L42607
$$ y = [818760991, 819199264, 819680393, 819958508, 819938481, 819786191, 819789529, 820097983, 820575833, 820929348, 820995688, 820863724, 820738971, 820813239, 821136057, 821534097, 821763158, 821690142, 821459055, 821357608, 821506798, 821789443, 821986020, 821953773, 821747959, 821555197, 821538687, 821716726, 821914136, 821911812, 821629465, 821186125, 820793152, 820621610, 820624590, 820533335, 820149243, 819515586, 818801939, 818266451, 818141520, 818232775, 818114877, 817657590, 817035019, 816512167, 816248238, 816192687, 816140771, 815914154, 815502524, 815078735, 814848363, 814876497, 815042973, 815144598, 815064311, 814865947, 814742506, 814815700, 815046787, 815277696, 815333664, 815186441, 815008283, 814983904, 815138340, 815358520, 815499544, 815491915, 815386236, 815333188, 815461576, 815749228, 816022813, 816130340, 816080034, 816012561, 816096187, 816367686, 816710293]
2109H16710293K37942J5318j50263j24216L6120J89424K22743P2717j38640k16782
2129.4H16854656j26362Q5354K74837K27928j3411j92702j53363M1426K03967K24650
2149.8H17426980J19388l0220j09136j19K50399M44949M50909K82407R7930J11043
2170.2H19044530L46482N90682O53863M92871K54154J48535K35021M27127N85794N82874
2190.6H23361933L78132J57058J27375K77937M78268N70833M56155K12609O4373J65761
2211H26250434M25100O03497N39005K86162N7995L7015K37047M67122N06461L32355
2231.4H29742193P2003q0109K9206K95162M52161L92020J84715j4782m0233J20997
2251.8H31153333L40104M41015K97666K4140j02640J7107K49088M14312L93152J88827
$$ y = [816710293, 816948235, 816963553, 816813290, 816689074, 816725194, 816914618, 817137361, 817210078, 817071438, 816854656, 816728294, 816813648, 817088485, 817316413, 817303002, 817110300, 816956937, 816998363, 817202330, 817426980, 817546368, 817516148, 817407012, 817406893, 817657292, 818102241, 818553150, 818835557, 818933487, 819044530, 819391012, 819981694, 820635557, 821128428, 821382582, 821531117, 821766138, 822193265, 822779059, 823361933, 823740065, 823897123, 824024498, 824302435, 824780703, 825351536, 825807691, 826020300, 826084673, 826250434, 826675534, 827279031, 827818036, 828104198, 828162193, 828199208, 828436255, 828903377, 829409838, 829742193, 829814196, 829734087, 829763293, 830058455, 830510616, 830902636, 831087351, 831072569, 831032336, 831153333, 831493437, 831934452, 832232118, 832256258, 832153618, 832170725, 832419813, 832834125, 833227277, 833416104]
2272.2H33416104l1411m8101J39475L25024L55005K19822L7014m3630L0041K21312
2292.5H34620655L98635L66390J32203p7486r5665Q9586L30984M26114L27170J20580
2312.9H36639166j2219P6294K98202M29094L45707J49846k0266n6743O2286J43052
2333.3H38054419P7605o4373k24352l62992m28796n05507l70383P7426M33326M72665
2353.7H37159038M03583L45468J49787j37329l70205o12438r34124r76443o95825m54545
2374.1H33876967m14013n44548o80626o33597l76404q1300M4226o0320k81691m20332
2394.5H30428362l55780j47939K7835j4543k67208m85003n27084m11689k08557r8168
2414.9H27940226k28048m94182o52492n94854l82364k16842k77519n13852p16865p20858
$$ y = [833416104, 833384693, 833336592, 833476067, 833801091, 834156096, 834375918, 834412932, 834369302, 834399343, 834620655, 835019290, 835385680, 835517883, 835440397, 835344732, 835434318, 835765302, 836191416, 836518586, 836639166, 836626947, 836703241, 837001443, 837430537, 837776244, 837926090, 837905824, 837849081, 837911367, 838054419, 838132024, 838067651, 837843299, 837480307, 837051511, 836546004, 836175621, 836253047, 836686373, 837159038, 837562621, 837908089, 838057876, 837920547, 837550342, 836937904, 836003780, 835027337, 834331512, 833876967, 833462954, 832918406, 832237780, 831604183, 831227779, 831146479, 831190705, 831130385, 830848694, 830428362, 830072582, 829924643, 829952478, 829937935, 829670727, 829185724, 828658640, 828246951, 828038394, 827940226, 827712178, 827217996, 826565504, 825970650, 825588286, 825371444, 825093925, 824580073, 823863208, 823142350]
2435.3H23142350n40853l41534k71559l92020o40929p69794o51002m47809l05474k97845
2455.7H18483531m75287o94334p12038n17308l13759k36631l28540n49853p10309o37293
2476.1H13308179m07695k42174k48492l82542n09322n33164m31597k36630j19508j94907
2496.5H10002148l62575m70996m41670k89560j09016n2631k21908m51625n01215l92199
2516.9H06708753k40981j64927k62975m73082o48558o53983m78506l18110l33190n00857
2537.3H02633584p13587q04544o58750l89219k81572m63664p36952q38161p26819n20408
2557.7G96499908l46124l37064n09859o96480p27832n77033l89635l23236m14729o10412
2578.1G91567504p44938o79255m60982k75255k68042l99768n37634n59687m34638k41816
$$ y = [823142350, 822601497, 822259963, 821988404, 821596384, 820955455, 820185661, 819534659, 819086850, 818781376, 818483531, 818008244, 817313910, 816601872, 816084564, 815770805, 815534174, 815205634, 814655781, 813945472, 813308179, 812900484, 812658310, 812409818, 812027276, 811517954, 810984790, 810553193, 810316563, 810197055, 810002148, 809639573, 809168577, 808726907, 808437347, 808328331, 808275700, 808053792, 807602167, 807100952, 806708753, 806467772, 806302845, 806039870, 805566788, 804918230, 804264247, 803785741, 803467631, 803134441, 802633584, 801919997, 801115453, 800456703, 800067484, 799785912, 799322248, 798585296, 797747135, 797020316, 796499908, 796153784, 795816720, 795306861, 794610381, 793882549, 793305516, 792915881, 792592645, 792177916, 791567504, 790822566, 790143311, 789682329, 789407074, 789139032, 788739264, 788201630, 787641943, 787207305, 786965489]
2598.5G86965489j39057k73049n52237p18534o65903n15521m42982n26547o95229q50975
2618.9G81585455r20177q52882p36952p28548r01103j137137j196087j071870r44555
2637.2G73096144q84354r34005j080036j201391j199186j049936q87274q67427r75370
2655.6G64017165j101911j137436j042604r08256q30710q52227r40680r73881r28879
2673.9G55300581q54134p71761p39098p85350q68023r35078r23514p95841o85990p37429
2694.3G47204363q80539r79841r99987r88364r74000r51528r63688j020789j065135
2712.7G38380492j050413r75013r14573q64745p89046p76291q21173q22306p82787
2731.1G30584145p23541o52909o54161p44582q06987p50482o52313n94795n69403o19412
$$ y = [786965489, 786826432, 786553383, 786001146, 785282612, 784616709, 784101188, 783658206, 783131659, 782436430, 781585455, 780665278, 779812396, 779075444, 778346896, 777445793, 776308656, 775112569, 774040699, 773096144, 772211790, 771277785, 770197749, 768996358, 767797172, 766747236, 765859962, 764992535, 764017165, 762915254, 761777818, 760735214, 759826958, 758996248, 758144021, 757203341, 756229460, 755300581, 754446447, 753674686, 752935588, 752150238, 751282215, 750347137, 749423623, 748627782, 747941792, 747204363, 746323824, 745343983, 744343996, 743355632, 742381632, 741430104, 740466416, 739445627, 738380492, 737330079, 736355066, 735440493, 734575748, 733786702, 733010411, 732189238, 731366932, 730584145, 729860604, 729207695, 728553534, 727808952, 727001965, 726251483, 725599170, 725004375, 724434972, 723815560]
2751.4G23815560p08937p08759o03259m67717l99590m73082o28591p23600o93500n84960
2771.8G17823565n34832o19352p60556r01937r92417r58085q68083q66234j016974
2790.2G10305095j227439j342773j347125j304686j301706j401126j552939j675547
2806.5F99151754j738071j729190j699925j761317j929164k074301k109528k094567
2822.8F84015691k079546k103627k215326k380490k519131k587974k616644k677381
2839.1F64835572k858817l159881l452480l602624l549695l280401k885699k564848
2855.5F39481127k415240k471685k722561l077448l506064l972531m365026m647494
2871.8F12303078m892766n036354m870117m429758l895640l275454k588987j922667
$$ y = [723815560, 723106623, 722397864, 721794605, 721326888, 720927298, 720454216, 719825625, 719102025, 718408525, 717823565, 717288733, 716669381, 715908825, 715006888, 714014471, 713056386, 712188303, 711322069, 710305095, 709077656, 707734883, 706387758, 705083072, 703781366, 702380240, 700827301, 699151754, 697413683, 695684493, 693984568, 692223251, 690294087, 688219786, 686110258, 684015691, 681936145, 679832518, 677617192, 675236702, 672717571, 670129597, 667512953, 664835572, 661976755, 658816874, 655364394, 651761770, 648212075, 644931674, 642045975, 639481127, 637065887, 634594202, 631871641, 628794193, 625288129, 621315598, 616950572, 612303078, 607410312, 602373958, 597503841, 593074083, 589178443, 585902989, 583314002, 581391335]
2888.1E81391335j307309q37743o22631n95510o62028p79271r06587j092732j356840
2906.5E73230684j646102k013445k511560l030658l418684l580332l487468l169715
2922.8E50372720k682209k052844j281380l87908O70791J848579K922237L789961M464209
2941.1E57664156M928172N194962N305230N342245N360782N300582N187392N134165
2957.4E99417686N111576M959404M595935M159630L791034L503740L372013L355742
2973.8F32266760L274619L152788L009558K717674K371549K168715K054394J898825
2990.1F52914882J605332J198887R03964P14243M80652K05636j06991l89933n65291
3008.4F56961381o78360q54909j122475j406014j658022j817942j874447j945913k040982
$$ y = [581391335, 580084026, 579246283, 578623652, 578028142, 577366114, 576586843, 575680256, 574587524, 573230684, 571584582, 569571137, 567059577, 564028919, 560610235, 557029903, 553542435, 550372720, 547690511, 545637667, 544356287, 543968379, 544639170, 546487749, 549409986, 553199947, 557664156, 562592328, 567787290, 573092520, 578434765, 583795547, 589096129, 594283521, 599417686, 604529262, 609488666, 614084601, 618244231, 622035265, 625539005, 628911018, 632266760, 635541379, 638694167, 641703725, 644421399, 646792948, 648961663, 651016057, 652914882, 654520214, 655719101, 656623065, 657337308, 657817960, 658023596, 657916605, 657526672, 656961381, 656283021, 655428112, 654305637, 652899623, 651241601, 649423659, 647549212, 645603299, 643562317]
3026.8F43562317k050161k067090k168178k328634k437890k288222k142191k329052
3043.1F25750899k617418k738595k684117k585292k543270k556801k685070k831221
3059.4F04509115k758503k534508k409339k515614k721489k787113k702534k535641
3075.7E83544374k414644k478183k606093k678454k731622k722621k665937k718031
3092.1E62528789k739012k530217k381564k546966k733588k620041k378941k338946
3108.4E42259514k488255k493143k335131k302170k379418k516985k675116k658188
3124.7E22411108k458990k292513k304912k373099k289176k129853k166689k380192
3141E04015684k444267k299994k147377k005964j926929k079398k284348k252072k102792
$$ y = [643562317, 641512156, 639445066, 637276888, 634948254, 632510364, 630222142, 628079951, 625750899, 623133481, 620394886, 617710769, 615125477, 612582207, 610025406, 607340336, 604509115, 601750612, 599216104, 596806765, 594291151, 591569662, 588782549, 586080015, 583544374, 581129730, 578651547, 576045454, 573367000, 570635378, 567912757, 565246820, 562528789, 559789777, 557259560, 554877996, 552331030, 549597442, 546977401, 544598460, 542259514, 539771259, 537278116, 534942985, 532640815, 530261397, 527744412, 525069296, 522411108, 519952118, 517659605, 515354693, 512981594, 510692418, 508562565, 506395876, 504015684, 501571417, 499271423, 497124046, 495118082, 493191153, 491111755, 488827407, 486575335, 484472543]
3159.4D84472543k015561j980901j981258j986653j950651j887023j854629j849830
3175.7D68966037j828760j787752j747817j705885j669496j643300j654416j709700
3192D55218911j726568j701653j648247j531362j406193j377732j444727j490146j429885
3210.3D41462398j332254j272976j250327j302331j379520j384020j298457j174212
3226.7D31068301j085996r92537r73850j169980j309902j215994j097917r80407q69126
3245D21372592r57071j146853j120895r09597q11368r10730r69558q82000q29905p99925
3265.4D12034690o39677n07712o46383q93890r80378q99553p60496o92457p21573p53403
3285.8D04539168o85215n29736m98116o41793p75636q64595q69900o51359l82960m47393
$$ y = [484472543, 482456982, 480476081, 478494823, 476508170, 474557519, 472670496, 470815867, 468966037, 467137277, 465349525, 463601708, 461895823, 460226327, 458583027, 456928611, 455218911, 453492343, 451790690, 450142443, 448611081, 447204888, 445827156, 444382429, 442892283, 441462398, 440130144, 438857168, 437606841, 436304510, 434924990, 433540970, 432242513, 431068301, 429982305, 428989768, 428015918, 426845938, 425536036, 424320042, 423222125, 422241718, 421372592, 420415521, 419268668, 418147773, 417238176, 416426808, 415516078, 414546520, 413664520, 412834615, 412034690, 411395013, 410887301, 410240918, 409347028, 408366650, 407467097, 406706601, 406014144, 405292571, 404539168, 403853953, 403324217, 402826101, 402184308, 401408672, 400544077, 399674177, 399022818, 398639858, 398192465]
3306.2C98192465q08239j066297j038581r09180q63581q29578p66486p36534p68722
3324.6C90405267r16123j035392r56923q28236p16597o13749p24495r42498r75430
3342.9C82695824r28581q38965p08282q42512j140862j150638q72165o52880o88463
3361.3C74872476p87705o64711n41509p68721j123339j148045q83191p00891p02054
3379.6C67552310p92712p79330n82815k83509l4720j84476n95182o26803k52604q2016
3400C63338143m24266p87080o06745k44707j82390k73407l77655l90529k32697j36167
3420.4C59682500j23053j1951J58250K66999J94848J79589L21954J63913k02686k00420
3440.8C60429943J34468M01526M33416L53932L64870M24266N03629O51687P48039O23405
$$ y = [398192465, 397384226, 396317929, 395279348, 394370168, 393506587, 392677009, 391910523, 391173989, 390405267, 389489144, 388453752, 387496829, 386668593, 385951996, 385338247, 384613752, 383671254, 382695824, 381767243, 380928278, 380219996, 379377484, 378236622, 377085984, 376213819, 375560939, 374872476, 374084771, 373420060, 372878551, 372109830, 370986491, 369838446, 368955255, 368254364, 367552310, 366759598, 365980268, 365397453, 365113944, 365079224, 364894748, 364299566, 363672763, 363420159, 363338143, 362913877, 362126797, 361520052, 361275345, 361092955, 360819548, 360441893, 360051364, 359818667, 359682500, 359559447, 359547496, 359705746, 359972745, 360167593, 360347182, 360669136, 360833049, 360630363, 360429943, 360564411, 360965937, 361399353, 361753285, 362118155, 362542421, 363046050, 363697737, 364445776, 365069181]
3461.2C65069181N99175R10640J053095P25806L12805K70039N33104Q80420R47356
3479.6C71301621O24359N74499Q47638Q22842O81043Q14408R78112R92060R36061R38743
3500C79511386Q97527O90997O35176Q21114J014829J137852J012952P40706P68155
3518.3C87230694J068056J272738J083285P76082P99000J028806J218617J327962J250177
3536.7C97055417J094461J251697J466245J295417R87619J095593J335830J345515
3553D06927794J404107J634568J851648J868486J703471J519054J681567K180665K341181
3571.3D23112541K255500K305031K436846K646685K885520K869517K490461K234697
3587.7D43236798K718598L026008K859950K968550L315866L341228L289521L307521
$$ y = [365069181, 365668356, 366578996, 367632091, 368357897, 368670702, 368940741, 369473845, 370354265, 371301621, 371925980, 372500479, 373348117, 374170959, 374852002, 375666410, 376644522, 377636582, 378572643, 379511386, 380408913, 381099910, 381735086, 382556200, 383571029, 384708881, 385721833, 386462539, 387230694, 388298750, 389571488, 390654773, 391430855, 392229855, 393258661, 394477278, 395805240, 397055417, 398149878, 399401575, 400867820, 402163237, 403150856, 404246449, 405582279, 406927794, 408331901, 409966469, 411818117, 413686603, 415390074, 416909128, 418590695, 420771360, 423112541, 425368041, 427673072, 430109918, 432756603, 435642123, 438511640, 441002101, 443236798, 445955396, 448981404, 451841354, 454809904, 458125770, 461466998, 464756519, 468064040]
3604D68064040L076166K935976L174126L427028L571660L517926L378361L587902L737419
3622.3D98470604L561497L191769L053367L718377L989279L764391L580749L509342
3638.7E26839375L568531L597378L402889L103912L207982L816247L886938L572642
3655E54995894L658593L757417L359855L044784L152072L051400K628863K742052K769292
3673.3E83160222K448797K920091L250778L032565K891600K756655K442718K002418
3689.6F04905844K046227K390921K375722K063036J739502J655936J915276K047718
3706F21140182J763165J243293J166642J862168K096236J774788J447499J281559J177848
3724.3F34953380J243770J626193J657784J180172Q36671J155495J612425J504600
$$ y = [468064040, 471140206, 474076182, 477250308, 480677336, 484248996, 487766922, 491145283, 494733185, 498470604, 502032101, 505223870, 508277237, 511995614, 515984893, 519749284, 523330033, 526839375, 530407906, 534005284, 537408173, 540512085, 543720067, 547536314, 551423252, 554995894, 558654487, 562411904, 565771759, 568816543, 571968615, 575020015, 577648878, 580390930, 583160222, 585609019, 588529110, 591779888, 594812453, 597704053, 600460708, 602903426, 604905844, 606952071, 609342992, 611718714, 613781750, 615521252, 617177188, 619092464, 621140182, 622903347, 624146640, 625313282, 627175450, 629271686, 631046474, 632493973, 633775532, 634953380, 636197150, 637823343, 639481127, 640661299, 641497970, 642653465, 644265890, 645770490]
3740.6F45770490P06971J87099J052737J170158M85421R43184J601755J409650J033187
3759F54360652J094341J215697J036405Q76486P55012Q32141J101017J145065R88364
3777.3F63405180P43747P12990P65861P61032Q84235R65714R30131P95483O26624O64651
3797.7F71255648M63605K45988Q37207Q33035N21004R00924J069546O47902L26157
3816.1F77101016O84857N44072L53574Q37863Q44121O69658N74708N22435O82831M61697
3836.5F83276832K7478L26097P71880R48071R64582P74384K17795p45833j98364J232684
3856.9F87595606J222670O34551J43290K53319O06597L74079K56597N13435O35922
3875.2F92236066O01828K51532K79665O12556L62278L16262L84629J99556M88162P41780
$$ y = [645770490, 646477461, 646664560, 647717297, 648887455, 649372876, 650316060, 651917815, 653327465, 654360652, 655454993, 656670690, 657707095, 658583581, 659338593, 660170734, 661271751, 662416816, 663405180, 664148927, 664861917, 665627778, 666388810, 667273045, 668238759, 669168890, 669964373, 670590997, 671255648, 671719253, 671965241, 672802448, 673635483, 674156487, 675057411, 676126957, 676774859, 677101016, 677785873, 678329945, 678683519, 679521382, 680365503, 681035161, 681609869, 682132304, 682815135, 683276832, 683304310, 683630407, 684402287, 685350358, 686314940, 687089324, 687307119, 686561286, 686362922, 687595606, 688818276, 689452827, 689596117, 689849436, 690456033, 690830112, 691086709, 691600144, 692236066, 692837894, 693089426, 693369091, 693981647, 694343925, 694660187, 695044816, 695244372, 695732534, 696474314]
3895.6F96474314M16517M0531m6015L5108L81708O80685N81205L50892J83344N7042
3916F99155331J02460L44694M15802K45809K01464K54512J63972J71602L72827M04954
3936.4G01833427K39551M4704j1266K16961L91543L29673K30849J63794J74284K34842
3956.8G03848362K87294K91050K30610J81258J27912R3936J44780J97351K30908K23160
3977.2G05856621J25587J00076J45138J52945J68026J84357J83344J36077J24395K44737
3997.6G07421303
$$ y = [696474314, 696890831, 696931362, 696885347, 696920455, 697302163, 697982848, 698564053, 698914945, 699098289, 699155331, 699257791, 699602485, 700018287, 700264096, 700465560, 700720072, 700884044, 701055646, 701428473, 701833427, 702072978, 702117682, 702106416, 702323377, 702714920, 703044593, 703275442, 703439236, 703613520, 703848362, 704135656, 704426706, 704657316, 704838574, 704966486, 705060422, 705205202, 705402553, 705633461, 705856621, 705982208, 706082284, 706227422, 706380367, 706548393, 706732750, 706916094, 707052171, 707176566, 707421303]
##END=$$ End of the data block
