##TITLE=$$ Begin of the data block
##JCAMP-DX=5.00 $$ ACD/SpecManager v 10.08
##SPECTROMETER/DATA SYSTEM=Alpha
##DATE=26 Dec 2014 10:25:20
##DATA TYPE=INFRARED SPECTRUM
##DATA CLASS=XYDATA
##ORIGIN=
##OWNER=
##NPOINTS=1765
##FIRSTX=399.76428223
##LASTX=3997.64306641
##MAXX=3997.64306641
##MINX=399.76428223
##MAXY=0.83827859
##MINY=0.28940666
##XFACTOR=1.0000000000
##YFACTOR=1.000000000000000e-9
##FIRSTY=0.57889438
##DELTAX=2.03961372
##XUNITS=1/CM
##YUNITS=ARBITRARY UNITS
##XYDATA=(X++(Y..Y))
399.8E78894377k154827k718807l579497k658844n9187K613604L767848K779185l24368
$$ 578894377 576739550 574020743 570441246 567782402 567723215 570336819 574104667 576883852 576559484
418.1E76559484l743768l285825j437187m96447j301468l276705m533470l954232j557946
$$ 576559484 572815716 569529891 568092704 567596257 566294789 563018084 558484614 554530382 552972436
436.5E52972436J543820L744781M227817L247082K498806K641737L062070K862095
$$ 552972436 554516256 558261037 562488854 565735936 568234742 570876479 573938549 576800644
452.8E76800644J428128q41737k852380k831042j522362p63536j614928l338099m617572
$$ 576800644 578228772 577387035 574534655 571703613 570181251 569417715 567802787 564464688 559847116
471.2E59847116m601478k707243p31886j32024o95348j618266j609504k43902J035452
$$ 559847116 555245638 552538395 551806509 551674485 550979137 549360871 547751367 547507465 548542917
489.5E48542917J042127k66254k077341l208637k925515j703084r79542j568556l036201
$$ 548542917 549585044 549318790 547241449 544032812 541107297 539404213 538424671 536856115 533819914
507.9E33819914m391074m675448l831804k956510l029108l739357m109978l523827
$$ 533819914 529428840 524753392 520921588 517965078 514935970 511196613 507086635 503562808
524.2E03562808j864672K32756J487196J763165J862049K624571M129827N460382N873918
$$ 503562808 501698136 501930892 503418088 505181253 507043302 509667873 513797700 519258082 525132000
542.5E25132000M723728K019882o77585k007306j993239j553893j728356k925396m698336
$$ 525132000 529855728 531875610 531198025 529190719 527197480 525643587 523915231 520989835 516291499
560.9E16291499o170452o653070o284535n595595m719257l463566j662284P59482L649920
$$ 516291499 510121047 503467977 497183442 491587847 486868590 483405024 481742740 482502222 486152142
579.3D86152142O406367P978886P609904N765081L730237K550602K248943K079010
$$ 486152142 492558509 500537395 508147299 513912380 517642617 520193219 522442162 524521172
595.6E24521172J182079l80695j508891j428545l17394J056790J862884J604378P99417
$$ 524521172 525703251 525322556 523813665 522385120 522067726 523124516 524987400 526591778 527391195
613.9E27391195P43389K068997L988862N085647M743397L401697K071917J713276K492487
$$ 527391195 528134584 530203581 534192443 539278090 544021487 547423184 549495101 551208377 553700864
632.3E53700864L301502L039181J708329J96933k98619O22213K008259K576888J823187
$$ 553700864 557002366 560041547 561749876 561946809 561648190 562270403 564278662 566855550 568678737
650.6E68678737L84748m28021R6976J417041K277553J924992R59754J23501k93493
$$ 568678737 569063485 568635464 568732440 570149481 572427034 574352026 575311780 575435281 575141788
669E75141788Q27312K332866K927423K041876O49750P2539O62148J774550K268731
$$ 575141788 575969100 578301966 581229389 583271265 583921015 583993554 584655702 586430252 588698983
687.3E88698983J390875m24624j980543k446115j983166j473367j733363k650499l264546
$$ 588698983 590089858 589665234 587684691 585238576 583255410 581782043 580048680 577398181 574133635
705.7E74133635k632797o11782J961708L845334M356205L982723L816366M478038N780041
$$ 574133635 571500838 570889056 572850764 576696098 581052303 585035026 588851392 593329430 599109471
724.1E99109471O827354O556988M949510L111005K149522K393723L063500K907991
$$ 599109471 605936825 612493813 617443323 620554328 622703850 625097573 628161073 631069064
740.4F31069064J322746j075506l025353l685772l326655k972543l424585m505515
$$ 631069064 632391810 631316304 628290951 624605179 621278524 618305981 614881396 610375881
756.7F10375881n277514m868567l016591l93868J975298L562987M465222N351425O848156
$$ 610375881 605098367 600229800 597213209 596819341 598794639 602357626 606822848 612174273 619022429
775.1F19022429Q617163R581744Q934558O853163M538357L296793L495395M366875
$$ 619022429 627639592 637221336 646155894 653009057 657547414 660844207 664339602 668706477
791.4F68706477M843592M370451L269196K541065K900779L955186M542172L884077
$$ 668706477 673550069 677920520 681189716 683730781 686631560 690586746 695128918 699012995
807.7F99012995K143502L40104k81632N30064J687050J813650L23117j963258l568291
$$ 699012995 701156497 701496601 701214969 701745033 703432083 705245733 705568850 703605592 700037301
826G00037301l811479l201842k961278l835261n333305o327450o066620m586041k815962
$$ 700037301 696225822 693023980 690062702 686227441 680894136 674566686 668500066 663914025 661098063
844.4F61098063k075076k814949m172444n003154m888118m057407k792597r26673J792609
$$ 661098063 659022987 656208038 652035594 647032440 642144322 638086915 635294318 634367645 636160254
862.8F36160254M898191P813990J0548115J2527346J2249530R222329M899203J197994
$$ 636160254 641058445 648872435 659420550 671947896 684197426 693419755 698318958 699516952
879.1F99516952r13024j830816k803207m586815o694973p801473p139206n320013l720641
$$ 699516952 698603928 696773112 693969905 689383090 682688117 674886644 667747438 662427425 658706784
897.4F58706784l518522m810452o531239p487952p422269p130384p610917r052754
$$ 658706784 655188262 650377810 643846571 636358619 628936350 621805966 614195049 605142295
913.7F05142295j0576427j0827481r047568n843342k760768j078724p85113o84798
$$ 605142295 594565868 583738387 574690819 568847477 566086709 565007985 564222872 563538074
930.1E63538074K92361K146662M066348N171179N113364M077613K207339m00961l454148
$$ 563538074 563830435 565977097 570043445 575214624 580327988 584405601 586612940 586211979 582757831
948.4E82757831o772936j0266661j3476074j5636981j6451597j6502976j6634018j7308294
$$ 582757831 575984895 565718234 552242160 536605179 520153582 503650606 487016588 469708294
964.7D69708294j8514216j9728750k0253390j9879341j8952340j7848432j6570300
$$ 469708294 451194078 431465328 411211938 391332597 372380257 354531825 337961525
979C37961525j4798731j2355089r417713o353169l626168j614809l89189L23653Q50320
$$ 337961525 323162794 310807705 301389992 295036823 291410655 289795846 289406657 289730310 290580630
997.4B90580630J351208J717001J673669J132369K88635m87894p77512l86626M10020
$$ 290580630 291931838 293648839 295322508 296454877 296743512 296255618 295478106 295091480 295501500
1015.7B95501500J196117J759618K195299K689361L314048L968001M328787M131794
$$ 295501500 296697617 298457235 300652534 303341895 306655943 310623944 314952731 319084525
1032C19084525L360063K300173J398683R50217R03070J054734J230329J461148K130211
$$ 319084525 322444588 324744761 326143444 327093661 327996731 329051465 330281794 331742942 333873153
1050.4C33873153L485024N238920O858289Q106471R076803R887487J0129839Q434505
$$ 333873153 337358177 342597097 349455386 357561857 366638660 376526147 386655986 395090491
1066.7C95090491L426611l899068r808719j1245727q650244m616320j015186J665294
$$ 395090491 398517102 394618034 384809315 373563588 364913344 360297024 359281838 360947132
1083C60947132L424019M394263M976153N523652N980790N999237N253017L724635J850158
$$ 360947132 364371151 368765414 373741567 379265219 385246009 391245246 396498263 400222898 402073056
1101.4D02073056N00738M20362J582682L162533M232884M426449L954589L252835K634465
$$ 402073056 402573794 402994156 404576838 407739371 411972255 416398704 420353293 423606128 426240593
1119.8D26240593K252728K167970K481103L194988L993004M361838L811270K010942
$$ 426240593 428493321 430661291 433142394 436337382 440330386 444692224 448503494 450514436
1136.1D50514436q86947m142434o870478q404553q576035p711381o352127m922509
$$ 450514436 449627489 445485055 438614577 430210024 421633989 413922608 407570481 402647972
1152.4D02647972l598332k357483j006633O07431K510339M587739O582350Q333176
$$ 402647972 399049640 396692157 395685524 396292955 398803294 403391033 409973383 418306559
1168.7D18306559R898722J1347890J2638718J3576836J3931781J3631224J2850285
$$ 418306559 428205281 439553171 452191889 465768725 479700506 493331730 506182015
1183E06182015J1890411J0916472R849965Q387030O396949M216492K470791J653076
$$ 506182015 518072426 528988898 538838863 547225893 553622842 557839334 560310125 561963201
1199.3E61963201J752317K249538K616406K789020L049076L672302M594564N351961
$$ 561963201 563715518 565965056 568581462 571370482 574419558 578091860 582686424 588038385
1215.6E88038385N411982M511893K874732J166761J9789m62592o85274j042545j557648
$$ 588038385 593450367 597962260 600836992 602003753 602023542 601560950 600875676 599833131 598275483
1234E98275483k014041k093971j580954o23643L69489J030684J281678J387298J643539
$$ 598275483 596261442 594167471 592586517 591962874 592332363 593363047 594644725 596032023 597675562
1252.3E97675562K042413K259612J977384J301050O99341O69957J349210K276719K713978
$$ 597675562 599717975 601977587 603954971 605256021 605955362 606625319 607974529 610251248 612965226
1270.7F12965226K250254J154125O6578n42461n78702l28600k45452n63860j093924
$$ 612965226 615215480 616369605 616436183 615893722 615315020 614986420 614740968 614177108 613083184
1289F13083184j473904j568615j485110j466930j698970k065122k314866k306700j998901
$$ 613083184 611609280 610040665 608555555 607088625 605389655 603324533 601009667 598702967 596704066
1307.4E96704066j467824j039386j037180j341403j600087j663625j729905k265275
$$ 596704066 595236242 594196856 593159676 591818273 590218186 588554561 586824656 584559381
1323.7E84559381l424644m763365n620480n573094m692137l452063k285003j343131
$$ 584559381 581134737 576371372 570750892 565177798 560485661 557033598 554748595 553405464
1340E53405464o11723j20044J96636L94523L70980M0948n64694j132608j338661j249611
$$ 553405464 552793741 552673697 552870333 553264856 553635836 553676784 553112090 551979482 550640821 549391210
1360.4E49391210r98557n59628l46660m85718l80397J37627Q32319J310229J273692
$$ 549391210 548392653 547833025 547486365 547000647 546620250 546757877 547590196 548900425 550174117
1378.8E50174117R63807J012147J907289L452360M309953L674268K442301R40978l60012
$$ 550174117 551137924 552150071 554057360 557509720 561819673 565493941 567936242 568877220 568517208
1397.1E68517208j024425j046836r59397j290679j697719k071082k319575j964807
$$ 568517208 567492783 566445947 565486550 564195871 562498152 560427070 558107495 556142688
1413.5E56142688j223564q37207p66158m07279o9499K80559Q95202J506567J831115
$$ 556142688 554919124 554081917 553315759 552908480 552838981 553119540 554014742 555521309 557352424
1431.8E57352424J744866J517773J453101J619399J903236J891315J319051K63452
$$ 557352424 559097290 560615063 562068164 563687563 565590799 567482114 568801165 569064617
1448.1E69064617p03811j107455j161456j681626j873553l16858P47144J623035K995789
$$ 569064617 568360806 567253351 566091895 564410269 562536716 562219858 562967002 564590037 567585826
1466.5E67585826M341662O089926Q942544R639084Q095384P199466P032633P053316
$$ 567585826 571927488 578017414 586959958 596599042 604694426 611893892 618926525 625979841
1482.8F25979841O528258O009340N673290N094409M174769M002809M534900M318595
$$ 625979841 632508099 638517439 644190729 649285138 653459907 657462716 661997616 666316211
1499.1F66316211L429711K669931K402067K806544K924740K704680K457977J973390
$$ 666316211 669745922 672415853 674817920 677624464 680549204 683253884 685711861 687685251
1515.4F87685251J612783J543104J916588K199053J994193J639724J142859Q08835
$$ 687685251 689298034 690841138 692757726 694956779 696950972 698590696 699733555 700542390
1531.8G00542390Q19385J189769J350522J034856J74641j33335J7047K96175N42879
$$ 700542390 701361775 702551544 703902066 704936922 705111563 704978228 704995275 705291450 705834329
1550.1G05834329N52356K32041k51233j343489j832068l19362J6511l45767j151859
$$ 705834329 706386685 706618726 706367493 705024004 703191936 702872574 702889085 702543318 701391459
1568.5G01391459j939238j440405j016319j270056j055658j055598j691282k080262
$$ 701391459 699452221 698011816 696995497 695725441 694669783 693614185 691922903 689842641
1584.8F89842641j939892j536370j318991j545429k151370k641082k661347k415717
$$ 689842641 687902749 686366379 685047388 683501959 681350589 678709507 676048160 673632443
1601.1F73632443k152622k181470k714873l490567l666579l202796l263593l713668
$$ 673632443 671479821 669298351 666583478 663092911 659426332 656223536 652959943 649246275
1617.4F49246275k832591k705932l795504l750623l100335k564013j687229j488328
$$ 649246275 646413684 643707752 639912248 636161625 633061290 630497277 628810048 627321720
1633.7F27321720k423942k081096o91116J15693O07550P58052Q02159R73463J337111
$$ 627321720 624897778 622816682 622125566 622241259 622848809 623606861 624409020 625382483 626719594
1652.1F26719594K424836K944350K962113L042996L119886L213942L261327M052163
$$ 626719594 629144430 632088780 635050893 638093889 641213775 644427717 647689044 651741207
1668.4F51741207N084276M619539M250884M299342M047275M115701M939139O380438
$$ 651741207 656825483 661445022 665695906 669995248 674042523 678158224 683097363 689477801
1684.7F89477801N254567L866315L764689L574252L980458M420817L821253L248573
$$ 689477801 694732368 698598683 702363372 705937624 709918082 714338899 718160152 721408725
1701.1G21408725K358377J986563K296090K483666K439737K134562J681566J562953
$$ 721408725 723767102 725753665 728049755 730533421 732973158 735107720 736789286 738352239
1717.4G38352239J900256K218544K421201K311468J746833J248181J109421J537562
$$ 738352239 740252495 742471039 744892240 747203708 748950541 750198722 751308143 752845705
1733.7G52845705K142906K073168J817763J487851J346469J608730K127588K659916
$$ 752845705 754988611 757061779 758879542 760367393 761713862 763322592 765450180 768110096
1750G68110096K724588K103091J543283J442552J717269K170026K163351J657009J118303
$$ 768110096 770834684 772937775 774481058 775923610 777640879 779810905 781974256 783631265 784749568
1768.4G84749568P64369P98226J273692J597404J435041Q82626M06146M13656Q08418
$$ 784749568 785513937 786312163 787585855 789183259 790618300 791500926 791907072 792320728 793129146
1786.7G93129146J193225J290501J034975N39720K93195M36425R22621J310288J146198
$$ 793129146 794322371 795612872 796647847 797187567 797480762 797917187 798839808 800150096 801296294
1805.1H01296294O33001J75774J49131N95093J055360J121461P79152K92659J3113
$$ 801296294 801929295 802105069 802254200 802849293 803904653 805026114 805805266 806097925 806111038
1823.4H06111038J91986O60062R43482Q13067L80874l2485o8605L14236O82235P14838
$$ 806111038 806303024 806963086 807906568 808719635 809100509 809068024 808999419 809313655 809995890 810710728
1843.8H10710728L69489l8802j75119O1989M57764O67512M73738L1352k68102j69635
$$ 810710728 811080217 811041415 810866296 810928285 811386049 812053561 812527299 812558651 812290549 812120914
1864.2H12120914J76847N20170O36697L67582j8597j54257J12236N18441P18117N61714
$$ 812120914 812297761 812817931 813454628 813822210 813803613 813649356 813761592 814280033 814998150 815559864
1884.6H15559864J68800j68800r7632L27885O28352O05226K92897p6235k30312n4479
$$ 815559864 815728664 815559864 815462232 815790117 816418469 817023695 817316592 817240357 817010045 816955566
1905H16955566K73884M52161L31461J1683k36691j92701J41263M07755M13954K03729
$$ 816955566 817229450 817681611 818013072 818024755 817788064 817595363 817736626 818144381 818558335 818762064
1925.4H18762064r1791k13385l1650K74956M15087K74897j8359k41220j86860J28567
$$ 818762064 818670273 818456888 818425238 818700194 819115281 819390178 819371819 819130599 818943739 819072306
1945.8H19072306M11272M84467L07679q464j67727r120L08395M79638L66032P7367
$$ 819072306 819483578 819968045 820275724 820267260 820099533 820090413 820398808 820878446 821244478 821321845
1966.2H21321845j41680j16348Q8036K97129L84867K63214m9531k50101j47582J06752
$$ 821321845 821180165 821063817 821151853 821448982 821833849 822097063 822047532 821797431 821649849 821756601
1986.6H21756601K75135K21134q822k07722j93656L58J82688J83463j0907k71857m20511
$$ 821756601 822031736 822252870 822244048 822036326 821842670 821843028 822025716 822209179 822198272 821926415 821505904
2009H21505904l84390j86026n007p9453l86000o59644p17879n14567j24335O2585j49012
$$ 821505904 821121514 820935488 820930481 820851028 820465028 819805384 819087505 818572938 818448603 818511188 818362176
2031.5H18362176m63366n96941m97758k67267n6386l9816k32935m33922m30524k10107
$$ 818362176 817898810 817301869 816804111 816536844 816480458 816440642 816207707 815773785 815343261 815133154
2051.9H15133154M4287J55389P4685q7858j76966j13785P2718K48849K41578M5895
$$ 815133154 815177441 815332830 815407515 815319657 815142691 815028906 815101624 815350473 815592051 815637946
2072.3H15637946j49727j86324m9591J62482K60175J60455j9252j40369q4281J30296
$$ 815637946 815488219 815301895 815252304 815414786 815674961 815835416 815816164 815675795 815591514 815721810
2092.7H15721810L14832L11613J33514n5492q6903N6743K44618L34620K44975L3677
$$ 815721810 816036642 816348255 816481769 816426277 816339374 816396117 816640735 816975355 817220330 817254007
2113.1H17254007j26243r8586O1691J91212K00390P4625j19686k25603j29462R2745
$$ 817254007 817127764 817029178 817090869 817282081 817482471 817557096 817437410 817211807 817082345 817175090
2133.5H17175090K37108J75595j2815j55568j29342M2975K10642K55228J31666o8545
$$ 817175090 817412198 817587793 817574978 817419410 817290068 817333043 817543685 817798913 817930579 817862034
2153.9H17862034j44303J1563K80142M66645M63784K70187O6698J13487L73066N81145
$$ 817862034 817717731 817729294 818009436 818476081 818939865 819210052 819276750 819390237 819763303 820344448
2174.3H20344448O25193N00083K73705J47640K49923M60446N92351N49256L27885J19567
$$ 820344448 820969641 821469724 821743429 821891069 822140992 822601438 823193789 823743045 824070930 824190497
2194.6H24190497J25289L02256N00500N84602M50373K00331O8426J67072M11630N94198
$$ 824190497 824315786 824618042 825118542 825703144 826153517 826353848 826422274 826589346 827000976 827595174
2215H27595174N64099L28660P6353K8432K15709M51267N10335L43382O7711r0003L4451
$$ 827595174 828159273 828487933 828564286 828592718 828808427 829259694 829770029 830113411 830181122 830091119 830125570
2237.5H30125570L12388M69268L99232J71899m1961m8995J42634L51846M16040K71321
$$ 830125570 830437958 830907226 831306458 831478357 831436396 831387401 831530035 831881881 832297921 832569242
2257.9H32569242K3365r9063K0623K65121M25339L98576J95384m1008o6220J44183
$$ 832569242 832592607 832493544 832514167 832779288 833204627 833603203 833798587 833757579 833691359 833835542
2278.3H33835542L49164L67165K16603K9683m8160L8087K25186L72112L47495J50740
$$ 833835542 834184706 834551871 834768474 834798157 834749997 834788084 835013270 835385382 835732877 835883617
2298.7H35883617p4684j22130P9870L44634M39823L33249J04189p4863J2159L00169
$$ 835883617 835808933 835686803 835766673 836111307 836551130 836884379 836988568 836913705 836925864 837226033
2319.1H37226033M89474L90052J46747p2539j52230M589J51456R5010n7638k28763
$$ 837226033 837715507 838105559 838252306 838179767 838027537 838032126 838183582 838278592 838220954 837992191
2339.5H37992191l57687l96729m54724l18586R6619M22895M09901K72035K60175J51753
$$ 837992191 837634504 837237775 836783051 836464465 836561084 836983979 837393880 837665915 837926090 838077843
2359.9H38077843q7857l62873o43134q53300q41797o16431m25994m30465n62549o49869
$$ 838077843 837989986 837627113 836983979 836130679 835288882 834672451 834246457 833815992 833253443 832603574
2380.2H32603574n90682l65675q8930K9326p7904k78115m17471l90887j87397l278
$$ 832603574 832012892 831647217 831558287 831587613 831509709 831231594 830814123 830423236 830235839 830232561
2400.6H30232561k7597k15948m25637n28872m32670k11000r4950k20895m81844o46413
$$ 830232561 830204964 829989016 829563379 829034507 828601837 828390837 828295887 828074992 827593148 826946735
2421H26946735n90980l82423k21670k66134n00262p26640p30455n37754l39686k79725
$$ 826946735 826355755 825973332 825751662 825485528 824985266 824258626 823528171 822990417 822650731 822371006
2441.4H22371006m12345o66320p95007o59406m26889k82883k93911m73559o79671o95706
$$ 822371006 821958661 821292341 820497334 819837928 819411039 819128156 818834245 818360686 817681015 816985309
2461.8H16985309n20229l12150k21967l25501n46992p15137o62923m13596k16723k19822
$$ 816985309 816465080 816152930 815930963 815605462 815058470 814343333 813680410 813266814 813050091 812830269
2482.2H12830269l69668n40018n83291m28855k03312j24156k13266l65674m77254m42446
$$ 812830269 812460601 811920583 811337292 810908437 810705125 810580969 810367703 810002029 809524775 809082329
2502.6H09082329k75790q6785l9041k18570m36962m86254l87967k41399j64687k63215
$$ 809082329 808806539 808719754 808680713 808462143 808025181 807538927 807150960 806909561 806744874 806481659
2523H06481659n05864p07269o83427m67837k81751k93016m88281p15256p94530o58929
$$ 806481659 805975795 805268526 804585099 804117262 803835511 803542495 803054214 802338958 801544428 800885499
2543.4H00885499m30048l36468m61757o64592p79271p48754n82456l75987l21388m76241
$$ 800885499 800455451 800118983 799657226 798992634 798213363 797464609 796882153 796506166 796184778 795708537
2563.8G95708537o72936p30336n89311l83020l19600m39167o26683p29442o60300m62949
$$ 795708537 795035601 794305265 793715954 793332934 793013334 792574167 791947484 791218042 790557742 790094793
2584.2G90094793k78890k51293l77656n34653n68986m33266k52843j84119l08037n44667
$$ 790094793 789815903 789564610 789186954 788652301 788083315 787650049 787397206 787213087 786905050 786360383
2604.6G86360383o98686o59167m97461l91841m73320p18296r33528r55224q39472p30693
$$ 786360383 785661697 785002530 784505069 784113228 783639908 782921612 781988084 781032860 780193388 779462695
2625G79462695p39694q97705j102924j198888j118422r68516q76069r23037j088679
$$ 779462695 778723001 777825296 776722372 775523484 774405062 773436546 772560477 771637440 770548761
2643.4G70548761j179159j143932j043141r16123q85845r86337j082182j115680j087725
$$ 770548761 769369602 768225670 767182529 766266406 765380561 764394224 763312042 762196362 761108637
2661.7G61108637r38535p97629q36790r41217r62674r25005q64744p88331p43330p59542
$$ 761108637 760170102 759372473 758535683 757594466 756631792 755706787 754842043 754053712 753310382 752550840
2682.1G52550840q16941q93772r20593q30055p42375p91431q95977r53436r79900r92060
$$ 752550840 751733899 750840127 749919534 749089479 748347104 747555673 746659696 745706260 744726360 743734300
2702.5G43734300r76086r39309r36985r89080j043498j074672j038730r23038q17298
$$ 743734300 742758214 741818905 740881920 739892840 738849342 737774670 736735940 735812902 734995604
2720.9G34995604q01087q36849q55029q50320p85052o75559o22034o61433p54655p89284
$$ 734995604 734194517 733357668 732502639 731652319 730867267 730191708 729569674 728908241 728153586 727364302
2741.2G27364302p34091o57439n60403n14508o00516p01309p04109o19829n06282m29809
$$ 727364302 726630211 725972772 725412369 724897861 724297345 723596036 722891927 722272098 721765816 721336007
2761.6G21336007m59313n90265p02977p05540o08862n33640o11007q00491r46224r64403
$$ 721336007 720876694 720286429 719583452 718877912 718269050 717735410 717124403 716323912 715377688 714413285
2782G14413285r02414q43525q62539j029730j258254j366734j363099j350999j334488
$$ 714413285 713510871 712667346 711804807 710775077 709516823 708150089 706786990 705435991 704101503
2800.4G04101503j352251j505792j717210j797139j739681j682103j698196j829862
$$ 704101503 702749252 701243460 699526250 697729111 695989430 694307327 692609131 690779269
2816.7F90779269k032578k144933k136767k096176k116501k230168k381623k514243
$$ 690779269 688746691 686601758 684464991 682368815 680252314 678022146 675640523 673126280
2833F73126280k584874k609790k673804k858282l159642l466785l643989l597617l307581
$$ 673126280 670541406 667931616 665257812 662399530 659239888 655773103 652129114 648531497 645223916
2851.4F45223916k889991k556503k423585k482116k708912l053724l505707m007280
$$ 645223916 642333925 639777422 637353837 634871721 632162809 629109085 625603378 621596098
2867.7F21596098m374325m613161m844904m997313m873813m456639l885507l246844
$$ 621596098 617221773 612608612 607763708 602766395 597892582 593435943 589550436 586303592
2884E86303592k610147j969755j317620q43942o72758o32703o48380p74026r33528
$$ 586303592 583693445 581723690 580406070 579562128 578889370 578256667 577608287 576834261 575900733
2902.4E75900733j088619j292467j595855k012074k526581l074706l496170l618121
$$ 575900733 574812114 573519647 571923792 569911718 567385137 564310431 560814261 557196140
2918.7E57196140l439426l118277k731442k127886j254559l15666O90460J854301K956271
$$ 557196140 553756714 550638437 547906995 545779109 544524550 544208884 544899344 546753645 549709916
2937E49709916L779471M403174M904330N213618N326450N358636N391360N330324N198836
$$ 549709916 553489387 557892561 562796891 568010509 573336959 578695595 584086955 589417279 594616115
2955.4E94616115N143344N107761M934490M543423M096389L789961L574789L440678
$$ 594616115 599759459 604867220 609801710 614345133 618441522 622231483 625806272 629246950
2971.7F29246950L382147L286063L154636K981484K720952K442181K223015K056539
$$ 629246950 632629097 635915160 639069796 642051280 644772232 647214413 649437428 651493967
2988F51493967J887679J595914J200974R38654P51853M63307J65999j00434l50952
$$ 651493967 653381646 654977560 656178534 657117188 657869041 658332348 658498347 658397913 658046961
3006.4F58046961n45860o95824q66294j107454j386464j655459j864016j930297j921654
$$ 658046961 657501101 656805277 655938983 654831529 653445065 651789606 649925590 647995293 646073639
3024.7F46073639j954317j990318k068698k226592k393960k453328k308666k190054
$$ 646073639 644119322 642129004 640060306 637833714 635439754 632986426 630677760 628487706
3041.1F28487706k314806k566874k738178k688348k543270k488077k559722k737820
$$ 628487706 626172900 623606026 620867848 618179500 615636230 613148153 610588431 607850611
3057.4F07850611k834022k724171k544105k435743k521456k743303k832532k734304
$$ 607850611 605016589 602292418 599748313 597312570 594791114 592047811 589215279 586480975
3073.7E86480975k545833k422810k479255k569616k635479k745509k760947k675950
$$ 586480975 583935142 581512332 579033077 576463461 573827982 571082473 568321526 565645576
3090E65645576k694011k711177k552092k397776k505481k720654k652764k387703k330065
$$ 565645576 562951565 560240388 557688296 555290520 552785039 550064385 547411621 545023918 542693853
3108.4E42693853k509832k521634k317011k275944k390325k525926k674878k663850
$$ 542693853 540184021 537662387 535345376 533069432 530679107 528153181 525478303 522814453
3124.7E22814453k463222k292573k295971k362311k290249k156258k186715k372563
$$ 522814453 520351231 518058658 515762687 513400376 511110127 508953869 506767154 504394591
3141E04394591k448619k315014k140671j984954j926690k094478k292543k258689k115398
$$ 504394591 501945972 499630958 497490287 495505333 493578643 491484165 489191622 486932933 484817535
3159.4D84817535k034396k015531k019555j975268j898706j862257j857877j829267
$$ 484817535 482783139 480767608 478748053 476772785 474874079 473011822 471153945 469324678
3175.7D69324678j782596j747847j752495j796216j777113j657515j610786j690179
$$ 469324678 467542082 465794235 464041740 462245524 460468411 458810896 457200110 455509931
3192D55509931j721352j689703j630544j527220j452208j427352j423032j443594j430899
$$ 455509931 453788579 452098876 450468332 448941112 447488904 446061552 444638520 443194926 441764027
3210.3D41764027j367152j316517j285226j302003j368791j387716j308441j200169
$$ 441764027 440396875 439080358 437795132 436493129 435124338 433736622 432428181 431228012
3226.7D31228012j105338r69798r38296j167983j335323j230717j073032r57698q95172
$$ 431228012 430122674 429152876 428214580 427046597 425711274 424480557 423407525 422449827 421554655
3245D21554655r73165j143903j138717r31143q42572r50098r97156q85754p73013p10994
$$ 421554655 420581490 419437587 418298870 417367727 416525155 415575057 414577901 413692147 412919134 412208140
3265.4D12208140o14137n42104o78718r19133r90123r05722q12412p45952o92308o89745
$$ 412208140 411594003 411051899 410373181 409454048 408463925 407558203 406745791 405999839 405307531 404617786
3285.8D04617786o78300n64754m98921n76347p12216q60363q87424o63102m00692m74393
$$ 404617786 403939486 403374732 402875811 402299464 401587248 400726885 399839461 399176359 398775667 398301274
3306.2C98301274q31843j088619j079500r18835p91639p79331q18044p85977p50362
$$ 398301274 397469431 396380812 395301312 394382477 393590838 392811507 391993463 391207486 390457124
3324.6C90457124q79795j020312r67950q31425p04378o42031p79063r64165r70482
$$ 390457124 389577329 388557017 387589067 386757642 386053264 385411233 384632170 383668005 382697523
3342.9C82697523r13769q32111p11411q41946j142293j157313r07720p40885q08150
$$ 382697523 381783754 380951643 380240232 379398286 378255993 377098680 376190960 375450075 374641925
3361.3C74641925q37535n88119m38243p07566j104892j172840q94577o79910p02083
$$ 374641925 373804390 373216271 372778028 372070462 370965570 369792730 368898153 368218243 367516160
3379.6C67516160p86334p50482n99534l61025j13845j84834n49763o39022k92241r5636
$$ 367516160 366729826 365979344 365379810 365018785 364904940 364720106 364170343 363531321 363239080 363143444
3400C63143444m11749p43210o06150l15666k26944k54244l26932l67343k44468j28419
$$ 363143444 362731695 361988485 361382335 361066669 360839725 360585481 360258549 359891206 359646738 359518319
3420.4C59518319j29997o3718J13547K44171K08973K39552L48240J43379j98275j64628
$$ 359518319 359388322 359324604 359438151 359682322 359891295 360130847 360479087 360622466 360424191 360259563
3440.8C60259563J53452L70055L97414L68089M09215M56840M89116O18994P37459N97387
$$ 360259563 360413015 360783070 361180484 361548573 361957788 362414628 362903744 363522738 364260197 364857584
3461.2C64857584N41330Q98957J115054P57128K91258K88516N87642Q72165Q67427
$$ 364857584 365398914 366297871 367412925 368170053 368461311 368749827 369337469 370209634 371077061
3479.6C71077061N83023N99831Q68946Q17537O64473Q10266J008749J037359R58472
$$ 371077061 371660084 372259915 373128861 373946398 374610871 375421137 376429886 377467245 378425717
3497.9C78425717R27717Q79109P05629O73384Q31067R49532J060188J040161Q51541
$$ 378425717 379353434 380232543 380938172 381611556 382442623 383392155 384452343 385492504 386344045
3516.3C86344045Q60185J081854J234233J067877P99596Q27104J060933J249701J332223
$$ 386344045 387204230 388286084 389520317 390588194 391387790 392214894 393275827 394525528 395857751
3534.6C95857751J221836J056313J225114J458347J335651J080900J158029J310170
$$ 395857751 397079587 398135900 399361014 400819361 402155012 403235912 404393941 405704111
3551D05704111J332700J488447J689971J803040J826972J705736J484424J626909K198487
$$ 405704111 407036811 408525258 410215229 412018269 413845241 415550977 417035401 418662310 420860797
3569.3D20860797K423406K351105K364099K414137K572417K814532K846390K578765
$$ 420860797 423284203 425635308 427999407 430413544 432985961 435800493 438646883 441225648
3585.6D41225648K370059K743602K989561K843082K923369L278553L384293L324389
$$ 441225648 443595707 446339309 449328870 452171952 455095321 458373874 461758167 465082556
3601.9D65082556L326863L163904L021032L161698L364980L516049L537029L498971
$$ 465082556 468409419 471573323 474594355 477756053 481121033 484637082 488174111 491673082
3618.3D91673082L665954L694653L516615L197432L091275L749907L984571L776610
$$ 491673082 495339036 499033689 502550304 505747736 508839011 512588918 516573489 520350099
3634.6E20350099L627836L535629L526508L537655L393650L096819L196836L855407
$$ 520350099 523977935 527513564 531040072 534577727 537971377 541068196 544265032 548120439
3650.9E48120439L923416L595233L654778L743410L437043L178298L191054K976715
$$ 548120439 552043855 555639088 559293866 563037276 566474319 569652617 572843671 575820386
3667.2E75820386K544344K770722K858341K433896K832412L240049L066123K908468
$$ 575820386 578364730 581135452 583993793 586427689 589260101 592500150 595566273 598474741
3683.5E98474741K794921K503932K004504K032817K379477K351164K076626J726031
$$ 598474741 601269662 603773594 605778098 607810915 610190392 612541556 614618182 616344213
3699.8F16344213J558602J872540K116024J845956J326442J235366J824498K020836
$$ 616344213 617902815 619775355 621891379 623737335 625063777 626299143 628123641 630144477
3716.2F30144477J730204J423895J262903J202524J336753J674473J620651J168549
$$ 630144477 631874681 633298576 634561479 635764003 637100756 638775229 640395880 641564429
3732.5F41564429Q44538J114011J642108J553535O88613K02059J090646J160980M72188
$$ 641564429 642408967 643522978 645165086 646718621 647407234 647609293 648699939 649860919 650333107
3750.8F50333107R45568J612961J395345J000702J074553J218974J068235R17434P74026
$$ 650333107 651278675 652891636 654286981 655287683 656362236 657581210 658649445 659566879 660340905
3769.2F60340905P97630J045167J109898R90927P80344P25866P58290P55608Q84354
$$ 660340905 661138535 662183702 663293600 664284527 665064871 665790737 666549027 667304635 668188989
3787.5F68188989R91404R40144P54476N89430O88136N57363K67207O96421P69437N95927
$$ 668188989 669180393 670120537 670875013 671464443 672152579 672709942 672977149 673673570 674443007 675038934
3807.9F75038934R79304J106441O47783L46244P01725M94361K84314P96259Q72493
$$ 675038934 676018238 677124679 677772462 678118706 678820431 679314792 679599106 680395365 681267858
3826.3F81267858P63237O33478N07593O66142M67837J2099L03984P42018Q85606R22442
$$ 681267858 682031095 682664573 683172166 683838308 684306145 684318244 684622228 685364246 686249852 687172294
3846.7F87172294Q08060K87652p34329k48135J200855J209736O40690J80185K59281
$$ 687172294 687980354 688268006 687533677 687285542 688486397 689696133 690336823 690517008 690776289
3865F90776289N69760L80516K89619N19693O16253O21855L71158L92854O30558L54469
$$ 690776289 691346049 691726565 692016184 692535877 693152130 693773985 694145143 694537997 695168555 695523024
3885.4F95523024L01420L68655J81198M10795O46234L60489L2544p75R5427L80337
$$ 695523024 695824444 696193099 696374297 696785092 697431326 697791815 697824359 697823584 697919011 698299348
3905.8F98299348O36995N96523M18067K26081L6478L2663L28779M79758K94924K17617
$$ 698299348 698936343 699532866 699950933 700177014 700213492 700246155 700574934 701054692 701349616 701567233
3926.2G01567233K72870J56641J41382L65078M06802J97470l7610o2704K34127M45306
$$ 701567233 701840103 701996744 702138126 702503204 702910006 703107476 703069866 703007162 703241289 703686595
3946.6G03686595L60310K36034J65999J58787K23458K90513K66790J79828J47521J57178
$$ 703686595 704046905 704282939 704448938 704607725 704831183 705121696 705388486 705568314 705715835 705873013
3967G05873013J57892J71483K26855K77996K03610M5597N9247K02477K68579K25126
$$ 705873013 706030905 706202388 706429243 706707239 706910849 706956446 707015693 707218170 707486749 707711875
3987.4G07711875J09673P9691J25528J48713K26260
$$ 707711875 707821548 707901239 708026767 708175480 708401740
3997.6G08401740
$$ 708401740
##END=$$ End of the data block
