##TITLE=$$ Begin of the data block
##JCAMP-DX=5.00 $$ ACD/SpecManager v 10.08
##SPECTROMETER/DATA SYSTEM=16PC
##DATE=Mon Sep 23 10:44:42 2013
##DATA TYPE=INFRARED SPECTRUM
##DATA CLASS=XYDATA
##ORIGIN=
##OWNER=
##NPOINTS=3601
##FIRSTX=400.00000000
##LASTX=4000.00000000
##MAXX=4000.00000000
##MINX=400.00000000
##MAXY=45.89762878
##MINY=11.92274094
##XFACTOR=1.0000000000
##YFACTOR=0.000000100000000
##FIRSTY=37.47916412
##DELTAX=1.00000000
##XUNITS=1/CM
##YUNITS=TRANSMITTANCE
##XYDATA=(X++(Y..Y))
400C74791641K1623345J8856048O373635J230735J162987j828880p656365q675079
408D05878067n561600l255348N35011J581192K104988k552757j8364181j6782036M036674
417C67620010Q171082o10848j461982K353668L042221R51042K481003J0227928P404061
426D00178185q887063j0272483K426643M120102k444267l167382O72799Q8233n936889
435C76777878m353981N467186P956962P018090K607803j0282745j1577607k063980
443C71549606J330376K474556K818565J012078J005439K132149L106842N676766M137497
452C95243874k472649m603119l858337l371468k591362n90591M245758M529266K95639
461C86827011j211433j730690j553269K91329K09350j605034k337951l195496k169876
$$ y = [374791641, 396414986, 415271034, 421644669, 422875404, 424038391, 422209511, 414553146, 405878067, 400316467, 397061119, 397596130, 399177322, 401282310, 398729553, 380365372, 363583336, 367620010, 375791092, 375180244, 373718262, 376071930, 379114151, 380065193, 382546196, 392774124, 400178185, 391291122, 381018639, 383445282, 387565384, 385121117, 381953735, 382626534, 382714767, 376777878, 372423897, 377891083, 385848045, 392866135, 395473938, 385191193, 373613586, 371549606, 372879982, 375354538, 378173103, 379185181, 380190620, 382322769, 385429611, 391106377, 395243874, 392771225, 388168106, 384309769, 380938301, 378346939, 377756348, 382002106, 386531372, 386827011, 385615578, 383884888, 382331619, 382622948, 382832298, 381227264, 378889313, 375693817, 373523941]
470C73523941J040726L220062O155014N911598J872750M37507Q4648M96865K676735
479C95419846K928733J826973P68204j354942j512528k35061J568794O157608N404243
488D10971870j359443l337403k035369k228241l985444k257804N198936M355202o188622
497C99133682o807098J134872L469696L331681K349624j233368k019615n83420k6207
506C98749847N74112O29883J94779l58582j552086j672020j128464L815K695313L136177
516D01272774K060661L39508l988037l950577N83153K115021L064384J250267n259056
525C97488098o558380m022369k059708J426697K457123J547851O10581j350899k264481
534C87274513l351707j801224L978233M809151J756172k63443m223594l147583M798660
$$ y = [373523941, 374564667, 377784729, 383939743, 389851341, 391724091, 392161598, 392246246, 392743111, 395419846, 398348579, 400175552, 400943756, 399588814, 398076286, 397841225, 399410019, 405567627, 410971870, 409612427, 406275024, 404239655, 402011414, 398025970, 395768166, 400967102, 405322304, 399133682, 392326584, 393461456, 396931152, 400262833, 402612457, 401379089, 399359474, 398776054, 398749847, 399323959, 399953842, 400148621, 399790039, 398237953, 396565933, 395437469, 395441284, 398136597, 401272774, 403333435, 403672943, 399684906, 395734329, 396317482, 398432503, 401496887, 402747154, 397488098, 390929718, 386907349, 384847641, 386274338, 388731461, 390279312, 390889893, 389538994, 387274513, 383922806, 382121582, 386099815, 390908966, 392665138, 392401695, 388178101, 385030518, 389829178]
543C89829178N299530q31604k535553j636505j899719l659745j814842N296707N925904
552C93973351Q95500j336823l555755l083001J135598K201767J452941M35830j906166
561C90213242k896042l521233k509346J314392J976013L09487j049767l646126l939857
570C76250763k234497q56400J380692K056618J622200O91146j821746k190323p91817
579C74106636J54762J988640J569748j449852k541771l286590j891137K690087M478912
588C75819435N345345L787040k092590l207207m53224O67572J839142J827240N82924
597C84115677m65851k140045k583733k242317j192589J750946J923333p82013j277466
606C77105942l36380M5280N24292M67530j60714n85060j235733j167755k71110O6528
$$ y = [389829178, 395128708, 394297104, 391761551, 390125046, 388225327, 384565582, 382750740, 388047447, 393973351, 394868851, 393532028, 389976273, 386893272, 388028870, 390230637, 391683578, 392119408, 390213242, 387317200, 383795967, 381286621, 382601013, 384577026, 384886513, 383836746, 380190620, 376250763, 374016266, 373159866, 374540558, 376597176, 378219376, 378910522, 377088776, 374898453, 374106636, 374261398, 376250038, 377819786, 376369934, 373828163, 370541573, 368650436, 371340523, 375819435, 381164780, 384951820, 382859230, 379652023, 379198799, 379866371, 381705513, 383532753, 384115677, 383649826, 381509781, 378926048, 376683731, 375491142, 377242088, 379165421, 378383408, 377105942, 376769562, 376814842, 377339134, 377806664, 377645950, 377060890, 375825157, 374657402, 374386292, 374452820]
616C74452820j6670L13263J443405R90143j820107j511536J939049K959252L113479
625C81863098J714249k664337l633957j954575r77516J054764M60396k960434m726639
634C68175049o031761o585617n732041o387710r646912q218498j937866J242599L308067
643C28185310M270821M005661K998810P7972n54085J112709Q34466j312981j389732
652C38228951M79698Q52356L54766p7743j124382j006355K07176J013756K070655K249947
662C43248825J43051K511521J4014015R250641j5997429j9458275n873222J450080
670C29289207J1219979J1908531J522293m40102L699990L727684J547813k44636l787499
679C58443260l125648K269478M325866N207062M327316M35829q80241q42323j54267
$$ y = [374452820, 374436150, 374749413, 376192818, 377182961, 375362854, 373851318, 375790367, 378749619, 381863098, 383577347, 380913010, 377279053, 375324478, 374346962, 375401726, 375862122, 372901688, 368175049, 362143288, 355557671, 349825630, 343437920, 333791008, 325572510, 323634644, 324877243, 328185310, 332456131, 336461792, 339460602, 339538574, 338984489, 340097198, 340931664, 339618683, 338228951, 338708649, 339561005, 339915771, 339838028, 338713646, 337707291, 337914467, 338928223, 340998878, 343248825, 343391876, 345903397, 359917412, 369168053, 353170624, 333712349, 327839127, 329289207, 340509186, 352417717, 353940010, 353499908, 357199898, 360927582, 362475395, 362230759, 358443260, 355317612, 357587090, 361912956, 367120018, 371447334, 371883163, 371002922, 370160599, 370006332]
688C70006332K304764K753983J688232R07669n97458n91507P77207J863746L784905
697C82897873L715515J699448L85513j536140j477471Q24433J726646K307167J895447
706C92438431k5063p19528j030464l24021K242356K661209J611710L84597k486953
715C94752274k428284J020889J442413o39419r03854K14576J33515j101494j090050
724C91400566k43645O82106K790223K424469o89736j800766k385864j289864K902031
733C93789520L375778P27425o16341k138595k334366j288643j67847J981736K510566
742C95839233J826516R45320j356583j200943J516571K500076K963791K345314p400
751D05371895r26247j208801q33511Q30688J235466Q02498L92914n83878o30112N0507
$$ y = [370006332, 372311096, 375065079, 376753311, 377660980, 377063522, 376472015, 377249222, 379112968, 382897873, 386613388, 388312836, 388698349, 387162209, 385684738, 386509171, 388235817, 390542984, 392438431, 392413368, 391693840, 390663376, 390339355, 392581711, 395242920, 396854630, 397239227, 394752274, 392323990, 393344879, 394787292, 394147873, 393244019, 393458595, 393592110, 392490616, 391400566, 391156921, 391839027, 394629250, 397053719, 396363983, 394563217, 392177353, 390887489, 393789520, 397165298, 397892723, 397276382, 395137787, 392803421, 391514778, 391346931, 393328667, 395839233, 397665749, 398611069, 397254486, 396053543, 397570114, 400070190, 403033981, 405379295, 405371895, 404445648, 403236847, 402403336, 403234024, 404469490, 405271988, 405664902, 405081024, 404450912, 404501419]
761D04501419P72476K536087K025109j125336k138863k131195j419296O46324J784325
770D05451050L233452K317657j832733l065338k665062j645775J382103J873245J94779
779D05243378n77431j577377j347542M17480J037369J182289Q50449l04947q97637
788D04026031j463165j249084r4643O02455J591721J271934q46138j203766m19845
797D02215500M20074K429009K237320j60942j372567k697715k330551L05900J095772
806D02141800Q17070M71611r20067m44183K461891K630959K59666k73247O32515J96228
816D07974243j784820j720429K13623J127510K180100J623382j025657k087136k510070
825D03990746k179871p99179L27606K146225K174873K85607n31883j138230j083603
$$ y = [404501419, 405273895, 407809982, 409835091, 408709755, 406570892, 404439697, 403020401, 403666725, 405451050, 408684502, 411002159, 409169426, 406104088, 403439026, 401793251, 403175354, 405048599, 405243378, 404665947, 403088570, 401741028, 402158508, 403195877, 404378166, 405228615, 404923668, 404026031, 402562866, 401313782, 401219139, 401821594, 403413315, 404685249, 403839111, 402635345, 402215500, 402635574, 405064583, 407301903, 407140961, 405768394, 403070679, 400740128, 401046028, 402141800, 402958870, 403430481, 402510414, 402066231, 404528122, 407159081, 407418747, 407145500, 407778015, 407974243, 406189423, 404468994, 404682617, 405810127, 407990227, 409613609, 408587952, 406500816, 403990746, 401810875, 401011696, 401339302, 403485527, 405660400, 405946007, 405414124, 404275894, 403192291]
834D03192291p8201K67258N11627K9831j461983k206078l178138k234688J256943K619018
844C98717880L160019K323837j164665j651764K63710J320572L039360K597580l86696
853D08219833j565933k159119j638908Q00591J408348R23881J37558j922607k160797
862D02042847j038285J92414K752037L009071J139412O8932j291542j514435o53725
871D04706726P5798J550217J477012k07901r56077j713982j246719R20334J651497
880D06256905J831779J055489j483193k156029j493949j002541R42230o50635o375312
889C96924744q867035j1618119q027114M230041R253502J1020889R520760K062836
897D04500504n81284l60031k51503R62944J384506J442909J317978P97768N47180J37329
$$ y = [403192291, 403114090, 403381348, 403892975, 403922806, 402460823, 400254745, 397076607, 394841919, 396098862, 398717880, 401877899, 404201736, 403037071, 401385307, 401649017, 402969589, 406008949, 408606529, 408219833, 406653900, 404494781, 402855873, 403656464, 405064812, 405988693, 406126251, 404203644, 402042847, 401004562, 401196976, 403949013, 406958084, 408097496, 408166428, 406874886, 405360451, 404706726, 404782524, 406332741, 407809753, 407601852, 406645775, 404931793, 403685074, 404605408, 406256905, 408088684, 409144173, 407660980, 405504951, 404011002, 403008461, 403950691, 403300056, 396924744, 388057709, 376439590, 368412476, 372642517, 381896019, 392916908, 402437668, 404500504, 403919220, 403559189, 403307686, 404270630, 405655136, 407098045, 408416023, 409213791, 409760971, 409898300]
907D09898300O15807K658844K510566J81885o15806p43637m68979O17523J144867J715431
917D17514801J289825m82788j161346j497269r29107J238365J662712P26700K40555
926D18602448l47825o40411r52454m22515J605758J643448j32332r43413j833686j406212
936D15172806Q62617J478424J215477M70620j528283k091865j919289r05494J936912
945D14691925K550583J586456M96369j887551k347221j319885k76566J954575K154808
954D17603493N19523n14755k167473k000541L54766R82514O53992J98364r01261j408805
964D13319817j833420j374970L18756J038781J524696J025925j241684j390953K57034
973D11643982J098404K188682J907082L2425r31015j894226j718979p4387N74799R93729
$$ y = [409898300, 410514107, 413172951, 415683517, 415865402, 415249596, 414505959, 414036980, 414654503, 415799370, 417514801, 418804626, 418321838, 417160492, 415663223, 414734116, 415972481, 417635193, 418361893, 418602448, 418254623, 417614212, 416661758, 416239243, 417845001, 419488449, 419356117, 418412704, 416579018, 415172806, 416035423, 417513847, 418729324, 419199944, 417671661, 415579796, 413660507, 412755013, 414691925, 417242508, 418828964, 419325333, 417437782, 415090561, 413770676, 413494110, 415448685, 417603493, 418123016, 417608261, 415440788, 413440247, 413795013, 414777527, 415431519, 415629883, 414728622, 413319817, 411486397, 410111427, 410430183, 411468964, 412993660, 414019585, 412777901, 411386948, 411643982, 412742386, 414931068, 416838150, 416870575, 415939560, 414045334, 412326355, 412251968, 412826767, 413820496]
983D13820496N86509j159401j600532j295090o54220J022834J342774O70433o1302
992D12672501j651268j836777q49953k6703J544953J551132J2894q42591j962166j786460
1002D06825562p0343O43234J164436P95364q95957j483689j677742j065025J008987
1011D05244827J512528R92050K90871j354676j733322j208305n37644J098404J178513
1020D05483246k40555q67157j516571j219254L96958Q70705P27195L23982q85467j075287
1030D01997795n24521N4856J261711J412391Q33969r8915k085228k704849k043037
1039C98104172k181511k553711l344994n496292n061111k167244k51770K116432K649536
1048C81813507J128235P16171P80106O88820L64036P46765J978379K549400L305931
$$ y = [413820496, 414407005, 413247604, 411647072, 410351982, 409697762, 410720596, 412063370, 412733803, 412672501, 411021233, 409184456, 408334503, 408307800, 409852753, 411403885, 411416779, 410574188, 408612022, 406825562, 406755219, 407398453, 408562889, 409358253, 408462296, 406978607, 405300865, 404235840, 405244827, 406757355, 407749405, 408040276, 406685600, 404952278, 403743973, 403206329, 404304733, 405483246, 405242691, 404375534, 402858963, 401639709, 402036667, 402907372, 403634567, 403958549, 403073082, 401997795, 401473274, 401528130, 402789841, 404202232, 405036201, 404937286, 402852058, 400147209, 398104172, 395922661, 393368950, 390023956, 384527664, 379466553, 377299309, 377047539, 379163971, 381813507, 382941742, 383657913, 384438019, 385126839, 385490875, 386237640, 388216019, 390765419, 394071350]
1057C94071350K369385j026383j939773j248856l82652K125969J836777j121750k824059
1066C91860008n378952m278679J273156L582725M723778M093895O24885q09440j250229
1075C94441147j409302q46634o12259J00861q86459l920289n440254o153106o792298
1084C68481407p386207p090836o634941l950348J830559N169182P669677Q451462P196655
1093C73736610O056099M168969K825737J517524R87053J326561J422882J887093J386871
1102C95315399l38554r15985r45092m03404J397820J678238Q01086R1553j262665j338234
1112C94080162k32925N19027J734276J677246K72980m42505j123161j190186n74836
1121C94720078j30883O59943N75523o54449p26700J61896M95681N98908O87332Q41141
$$ y = [394071350, 396440735, 395414352, 393474579, 392225723, 391843071, 393969040, 395805817, 394684067, 391860008, 386481056, 382202377, 383475533, 387058258, 391782036, 395875931, 396500816, 395691376, 394441147, 393031845, 392185211, 391572952, 391673813, 390787354, 386867065, 381426811, 375273705, 368481407, 361095200, 354004364, 347369423, 343419075, 345249634, 350418816, 358088493, 366539955, 373736610, 379792709, 383961678, 386787415, 388304939, 389291992, 390618553, 392041435, 393928528, 395315399, 394976845, 394060860, 393115768, 392712364, 394110184, 395788422, 396589508, 396681061, 395418396, 394080162, 393847237, 394366264, 396100540, 397777786, 398050766, 397608261, 396485100, 395294914, 394720078, 394589195, 395249138, 395824661, 395170212, 394443512, 394605408, 395101089, 395699997, 396387329, 397228470]
1131C97228470N23109n29060p31697m24156J65939J704712J752586L44277k19803n14298
1141C99300079n41191k07405J13945Q34007O79474m94232q38776p91053m54903Q40416
1151C98440361N14755j357307k496987l971557l790856k052803l59039K455483L329010
1160C90711060K740860J835823n03045r52987K06260P70798J667252J391907l18299
1169C97549629r08851r76792o90956L91960O67343M75884N8403q87375j394501j759796
1179C92524948j765480j207352j121292j283149j554490k674827j825829J272469K680282
1188C85045280L502617L257981J436004N58625j42098j19438R47456J226197J410713
1197C97123337N56221k083283k580185j399498o08444P03316R59892L75748l32832
$$ y = [397228470, 397751579, 397222519, 396490822, 396066666, 396232605, 397937317, 399689903, 400034180, 399814377, 399300079, 398758888, 398551483, 398665428, 399499435, 400178909, 399684677, 398845901, 398054848, 397599945, 398440361, 398955116, 397597809, 395100822, 391129265, 387338409, 385285606, 384926567, 387382050, 390711060, 393451920, 395287743, 394784698, 393831711, 394037971, 394808769, 396476021, 397867928, 397549629, 396640778, 395663986, 394973030, 395364990, 396032333, 396508217, 396566620, 395679245, 394284744, 392524948, 390759468, 389552116, 388430824, 387147675, 385593185, 382918358, 381092529, 382364998, 385045280, 388547897, 391805878, 393241882, 393800507, 393658409, 393538971, 394486427, 395712624, 397123337, 397679558, 395596275, 393016090, 391616592, 391008148, 391711464, 392671356, 393047104, 392714272]
1206C92714272j829873k177238j623154j115799j0032O1531q99315j267433j531601
1215C82321358j363755m96635l30925o32973r36775j509895j748581j767121j714248
1224C71820450j448136j387863j510124j489410j700631r72747O96640K125015M438171
1233C70571365M312744K173462l55987m242630p244835j0485878j1717110j1536369
1241C31474762r800873o327896j994362M564762Q764515J2309303J2964745J0339737
1249C62294693Q232574N157929L258476J861839J512261K889900K729874J480102O13938
1258C90031586n61982p48138K95639L07541j83334j033059k543220l651619m949799
1267C76963615n136718m660836l032455N51681K388230L222236L775368L648529L716469
$$ y = [392714272, 390884399, 388707161, 387084007, 385968208, 385958176, 386019707, 385120392, 383852959, 382321358, 380957603, 380460968, 380130043, 379497070, 378560295, 377050400, 375301819, 373534698, 371820450, 370372314, 368984451, 367474327, 365984917, 364284286, 363311539, 364008179, 366133194, 370571365, 374884109, 377057571, 376701584, 372458954, 365214119, 354728241, 343011131, 331474762, 321673889, 315345993, 313351631, 317916393, 326680908, 338990211, 351954956, 362294693, 370527267, 375685196, 378943672, 380805511, 382317772, 385207672, 387937546, 389417648, 390031586, 389469604, 388721466, 389017105, 389324646, 389141312, 388108253, 385565033, 381913414, 376963615, 371826897, 367166061, 364133606, 364685287, 367073517, 370295753, 374071121, 377719650, 381436119]
1276C81436119M055748L483734J832276R54628K45323K69661J270027J710205K365341
1285C97623062J667023q64754j744957j695404j316566N493M13399M89501k41050k470017
1295C91865730k955436k135048j499901l53775O180J33743q91914l541222n013008
1304C75615349n561104o973991r652596j0206718r533158p434845l574867M99725O383439
1313C29561234R243011J0253906R546738N864181M103394K913017K802124M540901
1321C78828506M539757L308296K395630J166077O12755N53360P20520J461754J652221
1330C95238876J447678J347542J091499J219025K166252J647491L0251j871338o006699
1339C96310577n393524Q69522K192993k59170n54581P8697O18706J688919J814881
$$ y = [381436119, 385491867, 388975601, 390807877, 391762505, 392007828, 392277489, 393547516, 395257721, 397623062, 399290085, 398425331, 396680374, 394984970, 393668404, 393673897, 394087296, 394576797, 394335747, 391865730, 388910294, 386775246, 385275345, 384921570, 384927750, 385061493, 384169579, 380628357, 375615349, 370054245, 363080254, 353427658, 343220940, 333687782, 326252937, 322678070, 323177795, 329561234, 338804245, 349058151, 358604889, 364469070, 368572464, 371485481, 374287605, 378828506, 383368263, 386676559, 389072189, 390238266, 390851021, 391404381, 392124901, 393586655, 395238876, 396686554, 398034096, 399125595, 400344620, 402510872, 404158363, 404188614, 402317276, 396310577, 390917053, 391786575, 393979568, 393720398, 393165817, 393244514, 393863220, 395552139, 397367020]
1348C97367020P71751R29604K528419K237053J20430p50542j426468p76519J731643
1357D02732391K835961M425544K202759n781669p434349m869004j726379N774231O147652
1366D04307137j352807k258758J785507K887497L806572J395950p080307p532844j62125
1375C95795822J741867M76608J39962o24428m90646J57814J527786N506782M336319
1384D08567886k532959n146942o694107m378319L712655P132530J0133285O150704
1392D16944733r887200j1129646K371101L971100l131408n088082o328125k985687
1400C84736786R428482R088516m669876p366180k749482l05633L699074L813247p15980
1409C94958954j427879M04624J410447K129097L773460R183655N784721q317451j2972107
$$ y = [397367020, 398138771, 399068375, 401596794, 403833847, 403954277, 403203735, 401777267, 401000748, 402732391, 405568352, 409993896, 412196655, 406414986, 398980637, 394111633, 392385254, 398159485, 404307137, 402954330, 400695572, 402481079, 405368576, 409175148, 410571098, 403490791, 395957947, 395795822, 397537689, 398014297, 398154259, 397529831, 397039185, 397196999, 398724785, 404231567, 408567886, 406034927, 400887985, 394193878, 389815559, 393528214, 400660744, 410794029, 416944733, 407057533, 395927887, 398298988, 402270088, 399138680, 394050598, 387722473, 384736786, 394165268, 403253784, 398583908, 391217728, 388468246, 388162613, 391861687, 395674934, 394958954, 393531075, 393935699, 395346146, 397475243, 401248703, 410432358, 416217079, 407899628, 394927521]
1418C94927521j4054566q216362J2377510J3037911p650147r339103M849929P052422
1426C92985115K376061j745911j0523834j0551911j601944K005120O724586J053810
1434C80721092k2240410k2723922k429467O338845J2354583J2827416M733543K955704
1442C72537384O258965M698257r0370m705658j4566651j1399497P449607J3091355
1450C73273392P766456J1399994K9288521K0319939k1373253l1211167j9045562j0051041
1458C60367279N832214J3536683J9103775J3435592j0803451j5176049m238128J794319
1466C83852234R349136J2927513J7170449R010772j9621353k3381958m598388O93817
1474C85402222j084595M16298L591766M507065M367333K285003m873276l688087P174721
$$ y = [394927521, 380872955, 372656593, 385034103, 398072014, 390421867, 381082764, 385932693, 392985115, 395361176, 393615265, 383091431, 372539520, 370937576, 372942696, 379667282, 380721092, 358480682, 335756760, 333327293, 339666138, 352020721, 364848137, 369581680, 372537384, 378796349, 383494606, 383404236, 378698578, 364131927, 352732430, 360182037, 373273392, 381039848, 392439842, 421728363, 442048302, 420675049, 389463882, 370418320, 360367279, 366199493, 379736176, 398839951, 412275543, 401472092, 386296043, 382057915, 383852234, 393201370, 406128883, 423299332, 432310104, 412688751, 389306793, 384708405, 385402222, 384317627, 384733925, 388325691, 392832756, 397200089, 399485092, 394611816, 390923729, 398098450]
1483C98098450Q958358M258385J448631o25114n722046j9174347j5893707O029625
1491C77378235J3867378J6735306J0897865j0837326j5968552q510818m907837j847267
1499C76806984L863335J3380050J8883438L0648957J5393524m1086464m8696747j4820099
1507C54372978k3613J3695259J4890175k763023k524147J6992340J3503075j5817147
1515C92325897j7386207P309684J0632248J027375p652779k7853508k3647308J2078056
1523C46833458J4944572j2724647j5845299j578827L634720P364502N773087k275010
1531C46126556q401870k1878243j4000664K3355027K8986206J1497726k328148k9698143
1539C33658447k8570633N580902J2607575q36144j222381O839523Q256683O258469
$$ y = [398098450, 407056808, 411315193, 412763824, 412138710, 406416664, 387242317, 371348610, 377378235, 391245613, 407980919, 418878784, 408041458, 392072906, 383562088, 378654251, 376806984, 380670319, 394050369, 412933807, 443582764, 458976288, 417889824, 369193077, 354372978, 354349365, 368044624, 382934799, 380171776, 377647629, 394639969, 408143044, 392325897, 374939690, 382249374, 392881622, 393908997, 386256218, 358402710, 334755402, 346833458, 361778030, 349053383, 333208084, 331629257, 335263977, 342628479, 348401566, 346126556, 337724686, 315846443, 301845779, 325200806, 354187012, 365684738, 363356590, 333658447, 305087814, 310668716, 323276291, 322440147, 321217766, 328057289, 336313972, 342572441]
1547C42572441L020058n330811n482673M123687L937035q441467l867646K7565499
1555C58096123J7083168m2591553n3579597k9484501j3770581J3239861J6300201p300377
1563B57992744j1472473j992683j845360o705780j0889511k0686874j6623726M872074
1571A92648411J0034084M709244p25975j4816055j3761998L399144R015083Q432140
1579A98934078P915020M198075M078388P272014Q116722P317296P713565R289246R269257
1588B64103661P720222P148972P633934O350994K771625J832238L121147L348102L672848
1597C07703743K745857K91596j238365k796174l027191j492023j305104j477966k850284
1606B96554089o685963p093430m951725k637615J006832L723145J1360416K777329
$$ y = [342572441, 345592499, 340261688, 334779015, 338902702, 342839737, 334398270, 330530624, 358096123, 375179291, 332587738, 279008141, 249523640, 235753059, 248992920, 265293121, 257992744, 246520271, 244527588, 242682228, 235976448, 225086937, 204400063, 187776337, 192648411, 202682495, 207391739, 206665764, 191849709, 178087711, 181486855, 190501938, 198934078, 206849098, 211047173, 215125561, 222397575, 230514297, 237831593, 245545158, 254834404, 264103661, 271823883, 278972855, 286606789, 292957783, 295729408, 297561646, 300682793, 304030895, 307703743, 310449600, 310741196, 309502831, 306706657, 303679466, 302187443, 300882339, 299404373, 296554089, 289868126, 282774696, 277822971, 275185356, 276192188, 279915333, 291275749, 294053078]
1614B94053078k9599915l4336796j4931926q828869o509781q605480j9255867k1270523
1622A50713921j8439532j2794971k52009M879713K855063O964207J6167163K1331540
1630A71425095K6097068K5036087J8493195J0516396o805897n878201J6297341K0133018
1638B75314102R653549Q345852J2361279J3605842J8210411R744874j9897690k1860600
1646C05477619j456261J3706456M4611206L4930458k5314560l9883614k5641670j1369476
1654B95060158K1052360K7925721J1063118O912689J0766983N005378j3832321j4287719
1662C49666367K160301R967575J8795967J5539627k859573j1063843j9371491j1927375
1670C50907555K2549629K3076782j0010490j7074585r104500j783829J4604111J6875229
$$ y = [294053078, 264453163, 230116367, 215184441, 206355572, 199845791, 191240311, 171984444, 150713921, 132274389, 119479418, 119227409, 124107122, 126962185, 133926392, 150093555, 171425095, 197522163, 222558250, 241051445, 251567841, 244761944, 238883743, 255181084, 275314102, 284967651, 293313503, 305674782, 319280624, 337491035, 347235909, 327338219, 305477619, 304021358, 317727814, 362339020, 397269478, 371954918, 332071304, 306429634, 295060158, 316112518, 344038239, 355101357, 362014046, 372781029, 377786407, 363954086, 349666367, 351826668, 361794243, 380590210, 396129837, 393270264, 382206421, 362834930, 350907555, 373457184, 396533966, 386523476, 369448891, 360344391, 358560562, 373164673, 390039902]
1678C90039902K956657M323006K9095878J3314705n9782257n9190254J5568733L1574936
1686C67901306P782250J294136m192353n68618J8543701J9522438N971908k904434
1694D13350334j9248009j3697128K7430535K0043601m6029815m6013107J7423858L0181656
1702C83441925R413490O05355j1681328j1181374M949341R067307M841079N238533
1710C94694328Q467446Q727073Q907547L246308j0443459j7652016k6586799j8931618
1718C50428810J3314476J9829521N618592R81102k291222j666527N328636O266365
1726C97809753J663895J877098N772362P526626J5715104J857757n1592827m5967102
1734C34662666K5068283L7509919O040115m069099r843827q452186N433578P669449
$$ y = [390039902, 392996559, 397319565, 426415443, 439730148, 379947891, 320757637, 336326370, 367901306, 375683556, 376977692, 372785339, 372216721, 390760422, 410282860, 416254768, 413350334, 394102325, 380405197, 407835732, 427879333, 381849518, 335836411, 353260269, 383441925, 392855415, 393460770, 381779442, 370598068, 375547409, 384614716, 389455795, 394694328, 403161774, 411888847, 420796394, 424042702, 413599243, 395947227, 369360428, 350428810, 363743286, 383572807, 389191399, 390172501, 387881279, 386214752, 391543388, 397809753, 399473648, 401350746, 407123108, 414649734, 430364838, 432222595, 380629768, 334662666, 359730949, 397240868, 403280983, 399211884, 389368057, 380915871, 386349449, 394018898]
1742C94018898m07448k174Q749504P595062k386322p261047j1855126j0798950l798485
1751C73853912K600441J5454750J3079415r160042j1044502N409012Q047599K992363
1759D01232948k091407j5162697j2052040J1010856J4772415K786179R1057J862793
1767D02450104K357712O531219L02811k3158074k2449760K708702R789925N622177
1775C84154816N417556P184983L676681q738785q290023P008285P441063o207962p358780
1784C84287834N13306M726677J0218124R920578N251198k394676k1254540j9774666
1792C71493835M073830J0620384O425362M915466K910881k98042o918449p412644k075195
1801C83735428P33108L702660M429817K663117J810569J567116k55813m858971n252113
$$ y = [394018898, 393611450, 393609276, 402358780, 409953842, 407567520, 400306473, 388451347, 377652397, 373853912, 376454353, 391909103, 404988518, 395828476, 384783974, 390192986, 398240585, 401232948, 399141541, 383978844, 371926804, 382937660, 397710075, 400496254, 400587311, 402450104, 404807816, 411339035, 411641846, 388483772, 366034012, 368742714, 378532639, 384154816, 389572372, 396757355, 400434036, 391695251, 383405228, 390413513, 397854576, 391646614, 384287834, 384801140, 389527817, 399745941, 409666519, 414917717, 412523041, 391268501, 371493835, 375567665, 386188049, 392613411, 397528877, 400439758, 400141716, 393223267, 385810623, 383735428, 384468536, 388171196, 392601013, 395264130, 397074699, 398641815, 398386002, 393527031, 388274918]
1810C88274918k024422J89056L842125L754387p42225j795044q96912P0076J826515
1819C92498474L369599P261734M253387r591332r281654O016998P976036Q84285m086456
1828C99301071j4154434j1618881O783752J0298233K266159P5836P5341n19295k502441
1837C90005341Q7738R998817J0277023L638039l826866k0712853j8733749N298614
1845C76032104J0345231J195449k71110K084503J826057l49273p94678K2888L24021
1854C90415192P61490N02128p50084r80110n83420M311P89146K181282N202790N355110
1864D02897835M357109j70479j2395134j3269196l743896R37233N718002O066094Q30612
1873C91228180q53272q67385q21343R4185K49863k92778j52855Q06350O54450j389237
$$ y = [388274918, 386250496, 386439552, 390281677, 394036064, 393293839, 391498795, 390601883, 390671959, 392498474, 395868073, 403129807, 407383194, 397791862, 388510208, 394527206, 402503242, 403387527, 399301071, 385146637, 373527756, 380311508, 390609741, 392875900, 392951736, 393027077, 392507782, 390005341, 390093079, 400091896, 410368919, 414006958, 410180092, 389467239, 370733490, 376032104, 386377335, 387572784, 387301674, 389386177, 391212234, 390862961, 390068283, 390091171, 390415192, 391176682, 391678810, 390928726, 389948616, 389365196, 389369507, 390158653, 392339935, 397542725, 402897835, 407254944, 407084465, 394689331, 381420135, 377676239, 378613472, 384331474, 390397568, 391228180, 390374908, 389507523, 388686180, 388780365, 389030228, 388737450, 388584595, 389390945, 390045395, 388656158]
1883C88656158k71835N688706M708976l582725n915604n498886k770462O109734O217460
1892C93341522k868652m539490j104355O2714Q10852J117020Q58078N49316l02582
1901C87924423k39372Q16345J094818J175881N07583j360626k077827k423516j630096
1910C83787613O58035K247582M672050L987579j4801k556571o625405n050888M803162
1919C85908356N221634l519059m812011r29375O09894K028694J953125k97546o27060
1928C85536652O31828P11212q1787k10762J21117J89323j25198L75976K080460K238502
1938C91467323J912117l97186p308731o849060J697540L493805K87285p8430J228332
1947C85452995J035195o10123p27882O98356O20117r24606j041641Q8920K93274j13983
$$ y = [388656158, 388384323, 394073029, 398782005, 395199280, 389283676, 383784790, 381014328, 387124062, 393341522, 390472870, 385933380, 384829025, 384891739, 385702591, 386819611, 387677689, 388227005, 387924423, 387685051, 388501396, 389596214, 390772095, 391279678, 389919052, 387841225, 385417709, 383787613, 384445648, 386693230, 391365280, 395352859, 395338058, 392781487, 386156082, 381105194, 385908356, 391129990, 387610931, 382798920, 381869545, 382479439, 384508133, 386461258, 386163712, 385536652, 386168480, 386879692, 386797905, 386587143, 386708260, 386897583, 386772385, 387148361, 389228821, 391467323, 393379440, 392982254, 385673523, 378824463, 380522003, 384015808, 384303093, 384224663, 385452995, 386488190, 385878067, 385150185, 385848541, 386468658, 385544052, 384502411, 384591331, 384884605, 384770622]
1957C84770622k19574l30696j32561M32244Q18252J714249R09348k344628k846489
1966C82770767j133919k60810P60078J030693M69666K99453L55492P1297p04804q02498
1976C82855415k91824o5346J36147J67618r7275r766N26886M76837l59039j50452J428376
1987C84617577J242637l87192j611480l970146l155938J744995K768479Q17566K43645
1996C82310143J51863k31972j049996r59854J90239M50402Q4152j5259P1259k27433
2006C80773544j236190j084824K62031P89643R37919R61075R85413K51045j891632
2015C80748024k087097m60396J32790L60984M05312N3139k5978K9564J02043L51677
2025C79610062K52494k62260m00085l62168j38244N44281N83877N1499k35520o12984
$$ y = [384770622, 384551048, 384220352, 384087791, 384520035, 385338287, 387052536, 387961884, 385617256, 382770767, 381636848, 381376038, 382136116, 383166809, 383636475, 383935928, 384291420, 384362717, 383657913, 382855415, 382563591, 382498245, 382634392, 382802010, 382704735, 382694969, 383221855, 383698692, 383339653, 383189201, 384617577, 385860214, 385473022, 383861542, 379891396, 376735458, 378480453, 381248932, 382066498, 382310143, 382462006, 382230034, 381180038, 380220184, 380410423, 380860825, 380944977, 380929718, 381000977, 380773544, 379537354, 378452530, 378714561, 379504204, 380442123, 381403198, 382388611, 382639656, 380748024, 378660927, 378200531, 378333321, 378694305, 379099617, 379152756, 379126778, 379156342, 379258385, 379610062, 379862556, 379600296, 379200211, 378838043, 378699799, 379244080, 379827957, 379879456, 379643936, 379030952]
2035C79030952n58395J33782J15623o31599o85196j98136J8120K04811K06719q4649
2045C77552032q0337K63443J78833l41911n02587m73976l69301j25427J18027O16798
2055C76835594M84467m85916n83649K0256K96364P47452L90510j180649j359214l57399
2065C74807816O5841L65944M76380L58581K31247o447j73073m39872l05901M32472
2075C75812988M57764j84746l61671l17612k09541J04637K12707K24343J09176k75116
2085C75572929l29971r3956j1444L586M8408J54000R7999j43051k55089l51944k94647
2096C74396820J9531L8605k39601k55318o5346n493r9640Q0109O73294O92597K30560
2107C75466118r7771n73616o90002n27611k73476L62397M05540k25067k32926K91138
$$ y = [379030952, 378472557, 378606339, 378721962, 378090363, 377405167, 377207031, 377225151, 377429962, 377636681, 377552032, 377471695, 377735138, 377913971, 377572060, 377069473, 376595497, 376226196, 376100769, 376218796, 376835594, 377320061, 376834145, 376250496, 376270752, 376567116, 377314568, 377705078, 376524429, 375165215, 374807816, 374873657, 375239601, 375715981, 376074562, 376305809, 376299362, 376126289, 375686417, 375380516, 375812988, 376270752, 376086006, 375724335, 375406723, 375197182, 375301819, 375514526, 375738869, 375848045, 375572929, 375242958, 375149002, 375137558, 375141144, 375189552, 375343552, 375441551, 375298500, 375043411, 374691467, 374396820, 374416351, 374454956, 374215355, 373960037, 373894691, 373889198, 373789558, 373869667, 374542961, 375235558, 375466118, 375368347, 374794731, 374104729, 373577118, 373303642, 373666039, 374071579, 373846512, 373613586, 373904724]
2117C73904724M13895L25889J95504r0599k50321m20570l38822J16120J95045K1439
2127C74072304j53046m86870n98182o43959l81470M24385N86967J43776J30883M56581
2137C73551369M49638K02446J5717k63443l24479r3002j77841o16341o52313m21982
2147C71669769j36871M47540N61714L01590N2224m71840n16663q2970P4883J68075
2157C72067451J03722j65939l59535o97632n81246J18027K84424J9302L0747K97546
2167C71116867J93367m03175l83606L21617L24249l50685m14886j4267J44233K93465
2177C70827179K07443k42233l17078n8670l9825k10266j99089o9619N9128L19710L00407
2188C70577087j3809j53808k77749k21977P4158K04086L16849K22931j56403l18298
$$ y = [373904724, 374318619, 374644508, 374840012, 374749413, 374499092, 374078522, 373739700, 373855820, 374050865, 374072304, 373919258, 373432388, 372834206, 372190247, 371808777, 372233162, 372820129, 372963905, 373094788, 373551369, 374001007, 374203453, 374219170, 373955727, 373631248, 373538246, 373360405, 372744064, 372091751, 371669769, 371532898, 371980438, 372542152, 372843742, 372895966, 372424126, 371907463, 371824493, 371899376, 372067451, 372171173, 372005234, 371645699, 370948067, 370366821, 370484848, 370769272, 370788574, 370819321, 371116867, 371310234, 370907059, 370523453, 370845070, 371169319, 370818634, 370403748, 370389481, 370533714, 370827179, 371034622, 370792389, 370475311, 370416641, 370376816, 370166550, 369967461, 369897842, 369956970, 370276680, 370577087, 370563278, 370409470, 370131721, 369909744, 369983902, 370187988, 370504837, 370727768, 370571365, 370253067]
2198C70253067m24843l32374Q1558J80473P6065m2686l53546l34282K0981J65939K73933
2209C69564285J95504j37558l03498m92363l65944K55814L12080j82876k28386N1498
2219C68668556J50185K80380R5863o58035o17256L07312L95279k11449l63579l14025
2229C67733231k01950J11846K06948J60675Q4648j53542j37329J62850K10991J28517
2239C68306885l7689m49906n05676k16217j40686k42233j09444L19252L82652J73569
2249C67480507k1210m47273m08897J65939K89917J12076K3346q7243j69296l17306
2259C66620560k06490K48680L80249M02718J23253p44095q64754l51677r0828K20528
2269C65738144K55356k3117j40915j87645k81563m94728m24156J0757Q2970k47498
$$ y = [370253067, 369828224, 369495850, 369577408, 369757881, 369833946, 369791260, 369437714, 369103432, 369124413, 369290352, 369564285, 369759789, 369622231, 369318733, 368826370, 368460426, 368716240, 369028320, 368845444, 368617058, 368668556, 368818741, 369099121, 369194984, 368536949, 367919693, 368227005, 368622284, 368410835, 368047256, 367733231, 367531281, 367643127, 367850075, 368010750, 368095398, 367941856, 367804527, 367967377, 368178368, 368306885, 368269196, 367819290, 367313614, 367097397, 366956711, 366714478, 366605034, 366924286, 367306938, 367480507, 367459297, 367012024, 366603127, 366769066, 367058983, 367171059, 367194405, 367107162, 366937866, 366620560, 366414070, 366662750, 367042999, 367445717, 367568970, 366824875, 365960121, 365608444, 365517616, 365738144, 365993500, 365970383, 365829468, 365641823, 365360260, 364865532, 364441376, 364452133, 364535103, 364287605]
2279C64287605r5367M74701Q36143J314621J230736N95322M1465r50546r35097J73340
2289C66972923N84832P90863O14166k66800l88413J01586L29971N62172O07986L43323
2299C70252609M51584R10034J124611J330605J178283O05088K08397j22338n43327
2308C75395546j174469j382332j642723o88057J903038L173828M398346L433724m24385
2317C82992516k216607l038635l467789l684272k392769J457901K367020J079826J12991
2326C73210182j507263k404442l164787k820015j190415L6469K143860J683006k025146
2335C63961449k818795r33685j590958m083633o020050q090286r927254j5131226r669075
2344C05696487P367135J8309364L1829109L0907173J4053078M246254o319275r401321
$$ y = [364287605, 364192238, 364666939, 365503082, 366817703, 368048439, 368643761, 368685226, 367734680, 366799583, 366972923, 367557755, 368348618, 368962784, 368695984, 368307571, 368409157, 368739128, 369301300, 369909286, 370252609, 370704193, 371614227, 372738838, 374069443, 375247726, 375852814, 376061211, 375938873, 375395546, 374221077, 372838745, 371196022, 370507965, 372411003, 375584831, 379983177, 383416901, 382992516, 380775909, 377737274, 374269485, 370585213, 368192444, 369650345, 372017365, 373097191, 373210182, 371702919, 369298477, 366133690, 363313675, 362123260, 362159729, 364303589, 365986595, 363961449, 361142654, 360208969, 358618011, 354534378, 348514328, 340424042, 330496788, 315365562, 305696487, 313063622, 331372986, 363202095, 394109268, 408162346, 412408600, 406089325, 396688004]
2352C96688004k827416l531456r995956j1359673r365082p905006n660057m017601
2360C42025757k145310j986732m111748m301071l311653k337914m91638j32294j486320
2369C21721077j288872J57814P95593R78737J346817J848908K046356J773377K129058
2378C31508865L183136L555069L435364L441582L567467L217430K292900J783600J533012
2387C57518425J177559P99904M32014p629k25792k84424k29378N6267J48316J51634
2397C59536896O8893k53219k06223K83012L13302k7695j90964l70254l43094k7161
2407C58783493K6207j74522j12763K52953K40097j54495k36283j01318o2218m0283
2417C58420868l9368o2942r4147j39961j92909l44239k39143K16255K91328K6207j1901
$$ y = [396688004, 393860588, 390329132, 380333176, 368973503, 359608421, 351703415, 346043358, 342025757, 339880447, 337893715, 333781967, 329480896, 326169243, 323831329, 323339691, 323207397, 321721077, 320432205, 320590019, 321385612, 322364349, 323711166, 325560074, 327606430, 329379807, 331508865, 334692001, 338247070, 341682434, 345124016, 348691483, 351908913, 354201813, 355985413, 357518425, 358695984, 359495888, 359927902, 359920273, 359694481, 359410057, 359180679, 359236946, 359385262, 359536896, 359605789, 359352570, 359146347, 359429359, 359742661, 359714966, 359524002, 359153748, 358810654, 358783493, 358809700, 358635178, 358522415, 358775368, 359015465, 358860970, 358624687, 358523369, 358461151, 358420868, 358381500, 358318558, 358224411, 358084450, 357891541, 357547302, 357308159, 357524414, 357815742, 357841949, 357830048]
2428C57830048J45912N3901l48587l74794n4359M3640O7215r308l42102k84424J86425
2439C56913567L31382L27149K04773j68534k92549k69890j93367O6262Q2741j08223
2449C56893311k23656m14848l59269J8082R4185m4594j22757k88238k26059J38054
2459C55464211J89094N455j11351l16124k94914j5984P9613J14937L7193k35786l23067
2470C54593277k95181k53907r7274j32065m39644l90549N1499J10168j56402k08168
2480C52781754j22529j29699j98136k26745l10402j72157K94723L86200J80016O6528
2490C52549553j09444j19438Q3695Q0337j29471j27525J02272P5111j65939l09715
2500C51929436n24292m48723r766J36643R7275R8686R2048M2878j07995q9378J06545
$$ y = [357830048, 357975960, 358029861, 357681274, 357306480, 357252121, 357295761, 357362976, 357353668, 357011566, 356727142, 356913567, 357244949, 357572098, 357776871, 357608337, 357315788, 357045898, 356852531, 356918793, 357001534, 356893311, 356669655, 356254807, 355895538, 355913620, 356007805, 355963211, 355840454, 355552216, 355326157, 355464211, 355653305, 355658760, 355547409, 355231285, 354936371, 354920387, 355000000, 355114937, 355152130, 354916344, 354593277, 354298096, 354044189, 353946915, 353814850, 353375206, 352984657, 353036156, 353146324, 352989922, 352781754, 352659225, 352529526, 352331390, 352104645, 351794243, 351622086, 351916809, 352303009, 352483025, 352549553, 352440109, 352320671, 352404366, 352484703, 352355232, 352227707, 352329979, 352405090, 352239151, 351929436, 351405144, 350956421, 350946655, 351083298, 351180573, 351279259, 351371307, 351414185, 351306190, 351216812, 351323357]
2511C51323357J76200K00043J55907Q0109j50910p47681p46269j28708O6262O2942
2521C50291252K136l01590k49633K01721K77023M6959K174O6262N3177Q583o5079j93367
2533C50139618k78244l82881l53127j69754o6490M7417M0054j41830j53809m8370M0741
2544C48673325K42500J74980k46277l04222n3635N722l0784m7684r2735r3193l4104
2555C48193893n1040j47820j76201j78794j34469k0751M9591J45454J03950j12075
2565C47671738j91422j94816j93596j70212j23978l8376J7167Q4381O3896q7242j01090
2576C46736450L5973%j83830k95144m81605l74298J71661K06452k96364k82517K79427
2587C45516205K07176n61485n95551J4534J96228J12038J80969N08080K52723q39004
$$ y = [351323357, 351499557, 351699600, 351855507, 351935616, 351784706, 351037025, 350290756, 350162048, 350228310, 350291252, 350293388, 349991798, 349742165, 349943886, 350220909, 350267868, 350270042, 350336304, 350389481, 350398064, 350332985, 350139618, 349861374, 349478493, 349125366, 348955612, 348889122, 348936539, 348976593, 348834763, 348680954, 348632584, 348673325, 348915825, 349090805, 348844528, 348540306, 348486671, 348492393, 348461609, 348413925, 348321190, 348227997, 348193893, 348142853, 347995033, 347818832, 347640038, 347505569, 347484818, 347534409, 347679863, 347783813, 347671738, 347480316, 347285500, 347091904, 346921692, 346797714, 346759338, 346776505, 346860886, 346924782, 346837540, 346736450, 346772423, 346772423, 346588593, 346293449, 345811844, 345437546, 345609207, 345815659, 345519295, 345236778, 345516205, 345723381, 345161896, 344566345, 344580879, 344777107, 344889145, 345070114, 345578194, 345830917, 344991913]
2597C44991913r10988j09444K92778P90139O75430k25067n10941n15938l07808M25606
2607C44595680N02358k4109j86920j95237j79786o5346k5024p1526J8120L23295L02811
2618C44994316l357k17171n42678n41916j94550k2163J89056J04180m30794m67797
2628C42867126j24206J22070N61943N07622j33781l06588j88598j24703o675P6522
2638C43250732K38419J13754l81469n49088o05583l85056L42369M91143K60849o4392
2648C42711678q91457q78067Q3923K19116k09579m80423r45320r20296l98178r2239
2658C38199158K73666L07808k7657j91917l70750l65258j84288Q583L34015M71611
2668C38454971M55857M67071M71802M23202L62397J69029k87285l64532o3172k6474
$$ y = [344991913, 344080925, 343971481, 344264259, 345054398, 345729828, 345504761, 344993820, 344477882, 344170074, 344595680, 345098038, 345073929, 344887009, 344691772, 344511986, 344446640, 344421616, 344350090, 344368210, 344691505, 344994316, 344990959, 344773788, 344231110, 343689194, 343494644, 343472481, 343661537, 343765717, 343334923, 342867126, 342742920, 342864990, 343426933, 343934555, 343800774, 343494186, 343305588, 343180885, 343174210, 343250732, 343489151, 343602905, 343221436, 342672348, 342066765, 341681709, 342024078, 342515221, 342776070, 342711678, 341820221, 340942154, 341026077, 341245193, 341035614, 340555191, 339609871, 338689575, 338291397, 338199158, 338472824, 338780632, 338752975, 338561058, 338190308, 337825050, 337640762, 337649345, 337983360, 338454971, 338910828, 339377899, 339849701, 340272903, 340635300, 340804329, 340517044, 340152512, 340089340, 340062866]
2678C40062866j92184j66397K5749Q8692J17530K6932k84424l28560j47323o3667l6965
2689C39102249Q9913M20074L83148o7940j77612m9362k7657p6561L357L21389K39372
2700C40160370k96822m34875m14391j31836P58171P70340o4621l85780o15082m26330
2710C38919144M46090O11802K43911L7155k28881l68805n04494l35960K95906M54406
2720C39570274L22838J03684m69437n34515j41869M5776K33422K61306J04409K0981
2730C39516869q3428r0141L586O6757K14119J15852k83012m32472n13077l53813K14576
2741C38375816L41645J64756j5258l97683m89006m06036j75476M34189N23529J41411
2751C38497887j0262p3929j81427m16259l15438L02086K48184n07583o57082l79562
$$ y = [340062866, 339870682, 339704285, 339730034, 339818726, 339936256, 339963188, 339678764, 339350204, 339202881, 339139214, 339102249, 339192162, 339612236, 339995384, 339927444, 339749832, 339700470, 339672813, 339596252, 339599609, 339920998, 340160370, 339863548, 339428673, 339014282, 338882446, 339640617, 340410957, 340346336, 339960556, 339345474, 338919144, 339365234, 339977036, 340220947, 340258102, 340029221, 339660416, 339155922, 338819962, 339115868, 339570274, 339893112, 339996796, 339527359, 338992844, 338850975, 338896751, 339130173, 339391479, 339495888, 339516869, 339433441, 339343300, 339346886, 339413643, 339627762, 339743614, 339460602, 339028130, 338515053, 338161240, 338375816, 338717461, 338882217, 338866959, 338469276, 337980270, 337574234, 337398758, 337832947, 338356476, 338497887, 338487625, 338413696, 338232269, 337816010, 337500572, 337802658, 338050842, 337543259, 336886177, 336506615]
2761C36506615k69432j86196r9907N4856j3581l40233m95452o77567n25017J32332
2771C34086418K50092j1673k52266p26433q18748o03905l98407M1504N5542l63121
2781C31259003n28794o43501n88417l28293j23024J58310K51503K45361M7455o09436
2791C29140167n66940J69754M59213O75659M63257m34417o37055l18298j65215L4104
2801C28820229J18980J84288R041o70166n79148L52631N68886M16527O1035r03855
2811C28378448j019973l77884p5340K43911K50092j70250k36015J03492j37596j078605
2821C25880280j258851r06677n72700K05497J28289q97866j199722r64203j117439
2830C19296608j605530j721134j437435j569977j862755k524147l814697m486561m460583
$$ y = [336506615, 336237183, 336050987, 335951080, 336005936, 335992355, 335652122, 335156670, 334479103, 333954086, 334086418, 334336510, 334324837, 334072571, 333346138, 332527390, 331923485, 331525078, 331566582, 331622124, 331259003, 330730209, 330086708, 329498291, 329169998, 329046974, 329205284, 329456787, 329702148, 329749603, 329140167, 328573227, 328742981, 329202194, 329877853, 330341110, 329906693, 329269638, 328951340, 328786125, 328820229, 328939209, 329123497, 329132538, 328462372, 327883224, 328235855, 328804741, 329221268, 329282303, 328378448, 327358475, 326980591, 326905251, 327149162, 327399254, 327229004, 326992989, 327096481, 326958885, 325880280, 324621429, 323714752, 323142052, 323347549, 323475838, 322577972, 321378250, 320414047, 319296608, 317691078, 315969944, 314532509, 312962532, 311099777, 308575630, 304760933, 300274372, 295813789]
2839B95813789n301227o777287q251190j0195255j1361370j2438526j1920453j0093460
2847B19475021p321109k977620P95613N100002P669945Q883705R493351Q969555Q674621
2856B58763084Q228531P787228P469883O643066N231629M168739L191471K417317J790294
2865C05691242J414051J474381J123199L58105L6716P5341n1499k76794l44773k26726
2875C09273243k95162m79470o91642r86100j236190j501809j670360j685391j888275
2884B98838844k315521k482872k505073k410164k123833j917610j655808j609344j826992
2893B79991627j845837j794815j624584j271725j042366o93092q94547j644363k283821
2902B66896477l109932l595810l808270m009494l969193m348259n136490n715370o363640
$$ y = [295813789, 290512562, 283735275, 275484085, 265288830, 253927460, 241488934, 229568481, 219475021, 212153912, 209176292, 209971905, 215071907, 222741852, 231625557, 241118908, 250088463, 258763084, 266991615, 274778843, 282248726, 288891792, 294123421, 298292160, 301483631, 303900948, 305691242, 307105293, 308579674, 309702873, 310060978, 310097694, 310173035, 310121536, 309844742, 309499969, 309273243, 308978081, 308498611, 307806969, 306820869, 305584679, 304082870, 302412510, 300727119, 298838844, 296523323, 294040451, 291535378, 289125214, 287001381, 285083771, 283427963, 281818619, 279991627, 278145790, 276350975, 274726391, 273454666, 272412300, 271719208, 270824661, 269180298, 266896477, 263786545, 260190735, 256382465, 252372971, 248403778, 244055519, 238919029, 233203659, 226840019]
2911B26840019o585121o895790n729675k827397p96070J732102J891861k40097k106190
2920B05283642m998913o306648o624718o183376m668484l107529r09099N84850J811485
2929A74881210K361546J873264K200127K697697M086971O845245Q339386R680748R054680
2938B22020874O314735L860970J15147j013508k55127J398086N459080O867161O578941
2947B51346359N827179L703118K606163J848678J779328K515564L236274M420777M972458
2956B82255898N160789N004425M397850L740807K763977K143860J695156J479149J621246
2965C10263157J557102J427899J230945Q89778P10030N75065O42281J108894J026383
2974C19431534L64551J92643L51657M05083M28200N54809R06945Q61397L96499K19574
$$ y = [226840019, 220254898, 213359108, 207629433, 204802036, 204005966, 205738068, 207629929, 207389832, 205283642, 200284729, 193978081, 187353363, 181169987, 176501503, 173393974, 172484875, 173069725, 174881210, 177242756, 179116020, 181316147, 184013844, 188100815, 194946060, 203285446, 212966194, 222020874, 228335609, 232196579, 232311726, 231298218, 231043091, 232441177, 237900257, 244767418, 251346359, 257173538, 260876656, 263482819, 265331497, 267110825, 269626389, 272862663, 277283440, 282255898, 287416687, 292421112, 296818962, 300559769, 303323746, 305467606, 307162762, 308641911, 310263157, 311820259, 313248158, 314479103, 315368881, 316078911, 316653976, 317296257, 318405151, 319431534, 319796085, 319988728, 320340385, 320745468, 321173668, 321728477, 322635422, 323496819, 323893318, 324112892]
2984C24112892K00043J50909P9613J41144M58488L84331j15128k60124j67122j53083
2994C24831963j33286j30157j96724j01776J42326L50723P38869O28700j17073k72751
3004C25740814Q2474L6735l26385m30832m53224k63214L68805L92914j58310l66669
3014C24623108m92325m15344l4790J24206K86332P4882o65436r40323j005172q34465
3024C20720673j26839j15166p17392j030693j531830j216163K28882N45253r1800j24932
3034C16539993J53790L52154P41233O29197j32103k62013K5272L02544R36508Q84056
3044C20170631J23978k16942n30491l78132M60396O62308L89824L13530L69072J40419
3054C21504593n24979o02493k05536R3956O16303O49223K51770j00861p45544q11577
$$ y = [324112892, 324312935, 324463844, 324543457, 324684601, 325143089, 325527420, 325412292, 325152168, 324985046, 324831963, 324698677, 324568520, 324371796, 324270020, 324412346, 324763069, 325501938, 326130638, 326013565, 325740814, 325823288, 325860023, 325533638, 325102806, 324649582, 324386368, 324755173, 325148087, 324989777, 324623108, 324130783, 323715439, 323680649, 323804855, 324091187, 324166069, 323500633, 322560310, 321555138, 320720673, 320593834, 320478668, 319761276, 318730583, 317198753, 315982590, 316211472, 316756725, 316664925, 316539993, 316693783, 317045937, 317787170, 318416367, 318284264, 318022251, 318047523, 318350067, 319286575, 320170631, 320294609, 320077667, 319547176, 319169044, 319629440, 320291748, 320681572, 320995102, 321364174, 321504593, 320979614, 320377121, 320171585, 320265541, 320881844, 321531067, 321782837, 321681976, 320936432, 320124855]
3064C20124855l81470L109P12414Q04405K81334P5569q7738m1465L44276L80020J15891
3075C22331200L8147R9640m58l16620l31421p0801N0774J83830J38054j85738k02903
3086C21733704M3411J39694J90964J89552J72615m272n13306n21698m6463J45912L79067
3097C21909180J23291q85506j063805n52444l73592l46661j74751J58062K90165L47595
3107C19431534J86920l33290n05695l89100m58469p37915o59218k07443j0948J50184
3117C16466560K2183n32150p11194p14302n47905o3896J52130J71662K90870N50499
3127C15084457M88282K5749o2466J81675J49250p2479k26498n07583l95317K20546
3137C14885616L76454K15301J28269J2646j13487l77197k88239K67983L41892n970
$$ y = [320124855, 319743385, 319746494, 320458908, 321263313, 321544647, 321620216, 321532478, 321491013, 321835289, 322215309, 322331200, 322369347, 322468987, 322468529, 322151909, 321820488, 321749687, 321800461, 321984291, 322122345, 321936607, 321733704, 321777115, 321916809, 322107773, 322297325, 322469940, 322465668, 321952362, 321430664, 321384201, 321530113, 321909180, 322032471, 321146965, 320083160, 319530716, 319157124, 318810463, 318635712, 318793774, 319083939, 319431534, 319618454, 319285164, 318779469, 318390369, 317931900, 317193985, 316534767, 316327324, 316316376, 316466560, 316488743, 315956593, 315245399, 314531097, 313983192, 313919296, 314071426, 314243088, 314533958, 315084457, 315572739, 315598488, 315536022, 315717697, 315866947, 315794468, 315567970, 315060387, 314665070, 314885616, 315262070, 315477371, 315605640, 315618286, 315504799, 315127602, 314839363, 315107346, 315449238, 315443268]
3147C15443268o7940R5596J7662k80151m17232n85080m00772L93372L81241n21431
3157C14058533n64804J07040L19729L59783K54860j26839k87780l10898l64762n18570
3167C12926292l27110K98023N55992P19071M95663k46754o86646j229992j076946o9866
3177C11357727L59783O45161M82082l77903o36806n12600m33445k39620j42098j21345
3187C10380936m7207P1049J37100K14576J42804n8422l09697p91549q64506o92368
3197C08182716k60353Q39711R57965J15872j25637l3875j00841k63462k83699j50223
3207C08878174j49479k66075k78225k20795j76658j44005n0068K32944J18714m77066
3217C07467461o31562m80652m03652k79178k13394k37942j21365K20547K16236j25160
$$ y = [315443268, 315375328, 315470924, 315488586, 315208435, 314791203, 314206123, 313805351, 314198723, 314579964, 314058533, 313493729, 313600769, 313920498, 314280281, 314535141, 314408302, 314120522, 313809624, 313444862, 312926292, 312599182, 312897205, 313453197, 314172268, 314667931, 314421177, 313734531, 312504539, 311427593, 311357727, 311717510, 312362671, 312844753, 312466850, 311830044, 311317444, 310883999, 310644379, 310502281, 310380936, 310333729, 310404778, 310541878, 310756454, 310899258, 310840836, 310531139, 309739590, 308875084, 308182716, 307922363, 308762074, 309720039, 309835911, 309710274, 309676399, 309575558, 309312096, 309028397, 308878174, 308728695, 308462620, 308184395, 307963600, 307786942, 307642937, 307592869, 307825813, 307944527, 307467461, 306835899, 306355247, 305951595, 305672417, 305459023, 305221081, 305099716, 305320263, 305536499, 305411339]
3227C05411339k69661k57950m63486r63707j075744r28383o90460j32332m540k06222
3237C00418854l91007o86168r31492j287003j275768r15527o13213j26591j9569l30925
3247B93841591l44734m8409k09808r13391j054268p53174o33240n18570m93278n95570
3257B88277149n89618n31426m35829j81675k38895p15981p12395k48413j46408k77748
3267B84198761l35217l49292n06153r18866r50813o48022m66346k07424k10038m91867
3277B79114723o45408p98455q47816q19931p12395m13399l74088n70297o48022o24180
3287B72660732p87487j158485j366139j540432j533260j243591j224041j394501j524467
3296B60888329j693955j814365j844406k041111k488594k595902k288818k457867l020535
$$ y = [305411339, 305141678, 304883728, 304420242, 303456535, 302380791, 301452408, 300761948, 300629616, 300625076, 300418854, 300027847, 299341679, 298410187, 297123184, 295847416, 294931889, 294318676, 294192085, 294172516, 293841591, 293496857, 293448448, 293238640, 292325249, 291270981, 290517807, 289884567, 289365997, 288872719, 288277149, 287687531, 287156105, 286720276, 286538601, 286299706, 285583725, 284871330, 284622917, 284476509, 284198761, 283863544, 283514252, 283008099, 282089233, 281138420, 280490398, 280024052, 279816628, 279606590, 279114723, 278469315, 277670860, 276823044, 276003113, 275290718, 274877319, 274503231, 273932934, 273284912, 272660732, 271873245, 270714760, 269348621, 267808189, 266274929, 265031338, 263807297, 262412796, 260888329, 259194374, 257380009, 255535603, 253494492, 251005898, 248409996, 246121178, 243663311, 240642776]
3305B40642776l416767l910064m006386l622055l587475l789196l853798l884563l842106
3314B06730366l761292l542423l146400k831231k546081k237549j969814j542568q61397
3323A84291611n07603n29766j52817O37512J006127R73243J291504J901398K287865
3332A91199074K641430K712497K395859K361298K581825K495060K021790K040863K518653
3341B12968349K707959K754936K819519K862472K881279K892266K829780K709160K534371
3350B37960091K274761K048244J802216J628647J530876J401424J292935J101036O51111
3359B51691341P44820J622677J519680M58469J12782J60465K13375M78993N12828K62967
3369B57778397L80287R85870R40781K66075J4553j0014p7476j46160j15643M8180J05133
$$ y = [240642776, 237226009, 233315945, 229309559, 225687504, 222100029, 218310833, 214457035, 210572472, 206730366, 202969074, 199426651, 196280251, 193449020, 190902939, 188665390, 186695576, 185153008, 184291611, 183784008, 183254242, 183101425, 183738937, 184745064, 185718307, 187009811, 188911209, 191199074, 193840504, 196553001, 198948860, 201310158, 203891983, 206387043, 208408833, 210449696, 212968349, 215676308, 218431244, 221250763, 224113235, 226994514, 229886780, 232716560, 235425720, 237960091, 240234852, 242283096, 244085312, 245713959, 247244835, 248646259, 249939194, 251040230, 251691341, 252436161, 254058838, 255578518, 256036987, 256149769, 256310234, 256523609, 257002602, 257515430, 257778397, 258158684, 259144554, 260085335, 260351410, 260365963, 260355949, 260278473, 260132313, 260016670, 260064850, 260169983]
3380B60169983R9411R4414o8894J79520J072426J106491L70254J1444l44505l50227
3390B62340317J43757J90487j22300k00996j62830j34468o9619l0040J5983K861j41144
3401B61832008o3667L12080L26653J8120j08490k06948j67121N8403J68323K81334
3411B62450695K22454j13029j33744K67506O9370p28359j103649j549225j116524O23226
3421B58888721J006375K77271J20411K58675J14212m07944l53336L65734M43935j1196
3431B60702858j27087j12056q107L20187L72429J35651J60446L78608N10712Q58059
3441B63191700M91848o10809j431466k873191k345314O24160J553307J259575R53674
3450B60813484m310k65580j2169J34697N18570L83149m06762n56449k84443j3352N39303
$$ y = [260169983, 260269394, 260363808, 260294914, 260474434, 261546860, 262653351, 263023605, 263035049, 262690544, 262340317, 262484074, 262674561, 262552261, 262351265, 262188435, 262053967, 261984348, 261954308, 261970291, 261973152, 261832008, 261768341, 262080421, 262407074, 262425194, 262316704, 262109756, 261942635, 262001038, 262169361, 262450695, 262673149, 262560120, 262426376, 262693882, 262763252, 262034893, 260931244, 259382019, 258265495, 258888721, 259895096, 260172367, 260292778, 260551453, 260665665, 260257721, 259904385, 260270119, 260714054, 260702858, 260575771, 260463715, 260455608, 260775795, 261148224, 261283875, 261444321, 261822929, 262333641, 263191700, 263683548, 263072739, 261641273, 258768082, 256422768, 257046928, 258600235, 259859810, 260813484, 260809174, 260543594, 260531425, 260666122, 261184692, 261567841, 261161079, 260604630, 260320187, 260306835, 260846138]
3461B60846138O65188N08785J97888p16458n69095P89890J093864P14760M28448j01338
3471B63858070l08036m34380p8449J176834J257896L46661k13623j067639r80377K15054
3481B63772011O15597P17639M37012p01408p12891L44525P16686Q10852P51266L58582
3491B67109871K25544J23730L71227J124859J436233J875153J107940j308212k269497
3500B69796848k810230j898060J464138K252083J210213L81965j386413j526108l4103
3509B67450333N05924N95341Q09898J057854J130600R64622J022339J430054J219253
3518B76186218M81854j81198j242886j414051n13077n57899j551380j466046o85215
3527B69056320K95410K229195K596397J771927P75090j408825j740456p26452O17275
$$ y = [260846138, 261511326, 262020111, 262217999, 261501541, 260932446, 261722336, 262816200, 263530960, 263959408, 263858070, 263550034, 263115654, 263037205, 264214039, 265471935, 265818596, 265604973, 264537334, 263556957, 263772011, 264387608, 265105247, 265542259, 264840851, 264127960, 264472485, 265189171, 266000023, 266751289, 267109871, 267335415, 267459145, 267830372, 268955231, 270391464, 272266617, 273374557, 272066345, 269796848, 266986618, 265088558, 266552696, 268804779, 270014992, 270396957, 269010544, 267484436, 267450333, 267956257, 268551598, 269361496, 270419350, 271549950, 272514572, 273536911, 274966965, 276186218, 276668072, 276486874, 275243988, 273829937, 273316860, 272758961, 271207581, 269741535, 269056320, 269351730, 271580925, 274177322, 275949249, 276724339, 275315514, 273575058, 272848606, 273465881]
3536B73465881L456574M143715L388405J997242q57106k675304m828930m334221p68890
3545B72987366J192093L560295K963791j671791k678147j486320m1962L339062L865719
3554B82030106J678943J004696M92096J316795M273873N006790N731583J940021q604050
3563B94870853j2450923j3624917r479045L868579Q242836O558915N331268J845360
3571B85162926M44889M61578K23160J08471K72999L20434J676808M977226O252289
3580B99900780P717361M478455m969368r713173j4395714j1358967K128124P482529
3588B81270027R592781P487526k299309m933586k675781j321316J719952J882076j284351
3597B89438019j418839J52359K373200P408142P653007M097939L84560o802311p843495
$$ y = [273465881, 276922455, 281066170, 284454575, 286451817, 285594711, 282919407, 278090477, 273756256, 272987366, 274179459, 277739754, 280703545, 279031754, 276353607, 274867287, 274825325, 278164387, 282030106, 283709049, 284713745, 285205841, 286522636, 290796509, 295803299, 301534882, 303474903, 294870853, 282419930, 268795013, 259315968, 263184547, 271427383, 277986298, 283317566, 285162926, 285607815, 286069393, 286292553, 286401024, 286674023, 286994457, 288671265, 293648491, 299900780, 307618141, 312096596, 307127228, 297414055, 283018341, 271659374, 273787498, 281270027, 290862808, 298350334, 296051025, 291117439, 288441658, 287120342, 288840294, 290722370, 289438019, 288019180, 288171539, 290544739, 297952881, 305605888, 309703827, 310088387, 303286076, 295442581]
3606B95442581l244877o04381K906074L570557L67393J096726P225284N085240n797634
3615C06046963r861698j2184143q020401N440940J2209168J7452965J6487350R672165
3623C37243309K52495j7490387k3927460k5303345j6271839J2494088J8339157M267940
3631B89603958R16710J975536K045632L049850K692700R1552J070748N322914Q253345
3640C15022945J2395382J2209435J0746460J342048k2043952k8588276k4345875j5922070
3648B60816097M045487J2711773J6614189J2446632o077766j0508042n176086j208763
3656B83663521O813755Q335113K887020K897721O682892Q549442J1798153Q918037
3664C40545654p43408p066727j6239624j3633499M588375Q447895N185585m184722
$$ y = [295442581, 292197704, 291593323, 294499397, 298069954, 298437347, 299534073, 306759357, 311844597, 306046963, 296185265, 284001122, 275980721, 281421661, 293630829, 311083794, 327571144, 337243309, 337495804, 320005417, 296077957, 270774612, 254502773, 266996861, 285336018, 289603958, 290520668, 292496204, 294541836, 297591686, 300284386, 300375938, 301446686, 306769600, 315022945, 327418327, 339627762, 350374222, 351716270, 329672318, 301084042, 276738167, 260816097, 264861584, 277573357, 294187546, 306634178, 300556412, 290048370, 284872284, 283663521, 290477276, 298812389, 301699409, 304597130, 311280022, 319829464, 331627617, 340545654, 339802246, 332735519, 316495895, 302862396, 307450771, 315898666, 321084251, 316899529]
3672C16899529l2121888k9804458M977455J4559974P475625P257461Q444309R345303
3680C07033310J1170387J0769615J0719300L860702j3100395j9828320k2080173j7163277
3688B71381149l19481O722451Q058777R032726P830620O364116L773442J584301k01722
3697C14226379l118267r896526q079987K869835Q342266J3318310J2482414N846253
3705C35990677j322518j3486366j8065223j8761406j3348103K086639R665966J4525414
3713B97285080J3996353N627174J892319J96228j555691k769222l727207m707584m317742
3722C01919708l042946l36170M176140Q450031J6996613J3813248k564164j0280151
3730C29132309j4383068j6537418j8157959j1922837M746666J4210701K3383141K2246361
$$ y = [316899529, 284777641, 254973183, 259950638, 274510612, 281986237, 289243698, 297688007, 307033310, 318203697, 328973312, 339692612, 343553314, 330452919, 310624599, 288544426, 271381149, 271061668, 277784119, 285842896, 294875622, 302706242, 309070358, 312843800, 314428101, 314226379, 311108112, 301211586, 293131599, 296001434, 304343700, 317662010, 330144424, 335990677, 334668159, 321181793, 303116570, 284355164, 271007061, 273093700, 282759666, 297285080, 311281433, 316908607, 318800926, 318997154, 317441463, 314672241, 310945034, 306237450, 301919708, 298876762, 298540592, 302716732, 311166763, 328163376, 341976624, 339412460, 329132309, 314749241, 298211823, 280053864, 268131027, 272877693, 287088394, 310471535, 332717896]
3738C32717896J0338783m77066j9094239k1805992j1090278p45545K3334980J8522740
3746C31701279k1370659k8963318j4012337m873276Q633614J4141808J4847507J0329247
3754C10433865m637471q735428n579471k028465O388187Q646736O694546L764858l341675
3763C11605682n062561j090545k219906r121895q319855q11329L914109R976158J0384311
3772C09254169N043030J324406l314972o074657r068490o643772L982315O024819J234779
3781C01761627o07719k656231k077351K022286L232708K237072K712021M458427M594803
3790C15677643L710747K327690o99539j313439Q32100K94418j005630n310784j8136749
3799B96376457j5181045O773452J0553608Q63552l941059j2778530q331527J3304939
$$ y = [332717896, 343056679, 342579613, 323485374, 301679382, 290589104, 289843559, 313178539, 331701279, 310330620, 281367302, 267354965, 262481689, 271115303, 285257111, 300104618, 310433865, 305796394, 297060966, 291481495, 289453030, 295841217, 304487953, 311182499, 314947357, 311605682, 306543121, 305452576, 303232670, 294110775, 285790920, 284979591, 288893700, 298869858, 309254169, 314297199, 315621605, 312306633, 306231976, 297163486, 290519714, 294502029, 300526848, 301761627, 301153908, 298497677, 296420326, 298442612, 301675320, 303912392, 306624413, 311082840, 315677643, 319388390, 321716080, 321016541, 319703102, 320535202, 320829620, 319823990, 314513206, 296376457, 281195412, 287968864, 298522472, 299386024, 295444965, 282666435, 274334908, 287639847]
3807B87639847J9190788J5109291J0867386K410164l851433j2362938j1756420R29356
3815C08176041K480278l692627q021603j7918339j3307113R964943J5208969O738434
3823B99628983L985405J593341J555443N474339M943847m63256o32058N028496M037857
3832C25152397k115249o907940j4768353j4508247n642185j302472K076149L364315
3840B85348415P03335K655754Q292427J2763749J9849777J9278984J4183273K306481
3848C65382195k2442093l3443451m0939579l0582905O529808K0434379K0513764J9198189
3856C04650307J1142006N294799j840343n226841o134987m521370J948815L889808
3864C09202194M575005K94227j3760109j4648437l474464J234054L847599N411625
$$ y = [287639847, 306830635, 321939926, 332807312, 335217476, 331366043, 319003105, 307246685, 308176041, 310656319, 306963692, 298942089, 281023750, 267716637, 277681580, 292890549, 299628983, 303614388, 305207729, 306763172, 312237511, 317181358, 316718102, 316086044, 321114540, 325152397, 323037148, 316129208, 301360855, 286852608, 281210423, 279907951, 281984100, 285348415, 286051750, 288707504, 296999931, 309763680, 329613457, 348892441, 363075714, 365382195, 342940102, 309496651, 268557072, 237974167, 244503975, 264938354, 285452118, 304650307, 315792313, 321087112, 319246769, 314019928, 307884941, 303363571, 305312386, 309202194, 313777199, 314071426, 300311317, 285662880, 282188416, 283422470, 287270069, 292681694]
3872B92681694M700432N569687R758949O453514o769905r406548l723392j159916K936134
3881C01040649J395226r485016p726421Q195171J0203819J801033k944488j1041641
3889B91438332q525353O756287J2229461J3283234J0933418K797127k610207q429527
3897C17872772j0615120q788585q511296r656906p172584r10302L483773Q760948R558678
3906B94021378N191078L763923L790856L108482K660294Q33740k877960m837265o828537
3915B98825989n353699J036167L045559K405892J485328j384964j897335r31492P21207
3924B97952652N330086M607200j646995m349938o272087n416393q85258J730690M391194
3933B95441151M847526K791157J702557R68685m39396l270397l502598j459122J30177
$$ y = [292681694, 297382126, 302951813, 312710762, 319164276, 312394371, 302987823, 299264431, 298104515, 301040649, 302435875, 292950859, 285224438, 293419609, 303623428, 305424461, 302479973, 291438332, 282912979, 289669266, 301898727, 315181961, 326115379, 328912506, 326302299, 317872772, 307257652, 298469067, 289957771, 280300865, 273128281, 272217979, 275701752, 284462700, 294021378, 299212456, 302976379, 306767235, 309875717, 312536011, 313369751, 310491791, 305654526, 298825989, 293472290, 294508457, 297554016, 299959908, 301445236, 300060272, 298162937, 297231445, 297952652, 303282738, 307889938, 306242943, 301893005, 295620918, 290204525, 289319267, 291049957, 295441151, 300288677, 303079834, 304782391, 305751076, 305311680, 302041283, 298538685, 297079563, 297209740]
3942B97209740L284931K654552k614250l759632k152691j073341P42416J518250J623401
3951B97433376J355172J34944k1457R61551P63169m71840j002312j407127j114388
3960B96631088J27335P38373J229763J136779K04335q3924P3891j4057k47250l37829
3970B99458504l28293l37372l73115k84691n3864R3460L34015J85738n04742o45161
3980B97544479m76112j30901O53743R57261J075248P42684k86103p64846j049767r62963
3990B97302723l73840J4305N09014N81512J65215N1994L3379J48773N22366O16550
4000B99571991
$$ y = [297209740, 300494671, 303149223, 300534973, 296775341, 294622650, 293549309, 294291725, 295809975, 297433376, 298788548, 298923492, 298902035, 299863586, 300626755, 300154915, 299152603, 297745476, 296631088, 296758423, 297496796, 298726559, 299863338, 300067673, 299983749, 300057640, 300043583, 299796333, 299458504, 299130211, 298792839, 298419724, 298135033, 298081169, 298174629, 298508644, 298694382, 298189640, 297544479, 297068367, 296937466, 297591209, 298548470, 299623718, 300366402, 300080299, 299315453, 298265686, 297302723, 296928883, 296943188, 297452202, 298033714, 298198929, 298250923, 298284302, 298433075, 298955441, 299571991]
##END=$$ End of the data block
