##TITLE=$$ Begin of the data block
##JCAMP-DX=5.00 $$ ACD/SpecManager v 10.08
##SPECTROMETER/DATA SYSTEM=16PC
##DATE=09 Jul 2013 09:53:40
##DATA TYPE=INFRARED SPECTRUM
##DATA CLASS=XYDATA
##ORIGIN=
##OWNER=
##NPOINTS=3601
##FIRSTX=400.00000000
##LASTX=4000.00000000
##MAXX=4000.00000000
##MINX=400.00000000
##MAXY=344.02984619
##MINY=4.16664982
##XFACTOR=1.0000000000
##YFACTOR=0.000001000000000
##FIRSTY=209.99998474
##DELTAX=1.00000000
##XUNITS=1/CM
##YUNITS=TRANSMITTANCE
##XYDATA=(X++(Y..Y))
400B09999985J7554962n895981j7538040l9101944q9055557p1796775K4553202N6876851
408H5596703N8193779L9542846l1642135l6135643L1610633L0177536l7699020m1543442
416I8101257P490326K3542267L3513107J5659913n4387314n7405831J815941K3208763
424I1538429K9602906K9746223O359238J9811996R9136093O7834961r7124664j27113533
432A19791649n7296085j5644192N2008247N6968598j0096344k3161362n822464J0278961
440A27027008N5065582M0488037m7291351o4872627l2032776j3064026J9419098K0166710
448A04905655k7902702j1213494Q8341568Q4757858j7001632n0784607n2636986m4527458
456G3938202j0695385P785198K6968651K3711510j1377671j7589782k409745L392868
$$ y = [209999985, 227554947, 221658966, 204120926, 165018982, 75963425, 4166650, 28719852, 85596703, 143790482, 183333328, 151691193, 115555550, 147166183, 177343719, 139644699, 98101257, 105591583, 129133850, 162646957, 178306870, 123919556, 66513725, 68329666, 91538429, 121141335, 150887558, 157246796, 177058792, 276194885, 344029846, 246905182, 119791649, 62495564, 46851372, 98859619, 155828217, 145731873, 122570511, 116748047, 127027008, 182092590, 222580627, 175289276, 110416649, 78383873, 65319847, 84738945, 104905655, 77002953, 65789459, 154131027, 238888885, 221887253, 171102646, 118465660, 73938202, 63242817, 71028015, 97996666, 121708176, 110330505, 92740723, 90330978, 93723846]
464I3723846R781434P671928o539108r354088m633789m32846R038139Q676094k337997
473A05593613n625084n291703l290649K877617N167580O030746L706574m571511n976677
482I8620506r70695n33417l959030l091026K150535L289337J485924N74112j085663
491I6480583p68974K546837K046417k798721l059601R10850J595047Q9028m74098j048233
501I5519135r51027K57827J34636j516723j468064Q3710O97845J047234Q81027j64345
511I4521255l83850L9246J32843j40282L40912K065232J956176J03592p75627j381485
521I6478012j630814j549148j117539q605M49066N60066M34349k50793l14667J82609
531I3232536L00789L74367N646j314446j152138O07758J070786P94220M43290m05815
$$ y = [93723846, 103505280, 111177208, 104638100, 95284012, 90650223, 90217377, 99255516, 107931610, 105593613, 99968529, 94676826, 91386177, 94263794, 99431374, 105462120, 109168694, 104597183, 98620506, 97649811, 97116394, 93157364, 90066338, 92216873, 95506210, 96992134, 97566246, 96480583, 95711609, 98258446, 100304863, 97506142, 94446541, 95357391, 96952438, 97041466, 96567368, 95519135, 94568108, 94825935, 94960571, 93443848, 91975784, 92059494, 92757339, 93804573, 94685600, 94521255, 94137405, 94176651, 94309494, 94169212, 94510124, 96575356, 98531532, 98635124, 97859497, 96478012, 94847198, 93298050, 92180511, 92171906, 92620972, 93181038, 93615387, 93364594, 93049927, 93232536, 93533325, 93907692, 93913338, 92598892, 91446754, 92054512, 93125298, 93919518, 94362808, 93956993]
541I3956993p23144p13517n87845j77314N3741M23691J23360j098397j428123j175858
551H8653587r15123k71484j69281n60402p13081q18329q44170q33366o47209j40099
561H2741043l3379l86375k40684L88526O03341O44371M47082l33519k53227P45651
571H4322830R88007P17140O34789M99465N75425J027870R31572M18258j13800j247497
581H8754059j049614P51259J136017N97854J82984p10083p21642L19389L68714m44489
591H9184448n92941j27342l72383j426415j571609j193001m68605J162979J634094
600H6229225J116661R90555J043152P44842J8151k97623m24766l13492K72178L38242
610H9717125m5990j63887j58363j74736k53220q7791M85801N04303m4151j48872P3410
$$ y = [93956993, 93233849, 92520332, 91932487, 91755173, 91808914, 92232605, 92355965, 91257568, 89829445, 88653587, 87738464, 87466980, 87297699, 86737297, 86024216, 85205887, 84361717, 83528351, 82881142, 82741043, 82707664, 82321289, 82080605, 82469131, 83072472, 83716843, 84163925, 83830406, 83577179, 84322830, 85310837, 86027977, 86662766, 87162231, 87737656, 88765526, 89697098, 90115356, 90001556, 88754059, 87704445, 88455704, 89591721, 90189575, 90372559, 89662476, 88940834, 89260223, 89628937, 89184448, 88591507, 88464165, 88091782, 86665367, 85093758, 83900757, 83432152, 84595131, 86229225, 87345886, 88336441, 89379593, 90124435, 90142586, 89844963, 89420197, 89106705, 89378883, 89717125, 89671135, 89507248, 89348885, 89174149, 88920929, 88833138, 89318939, 89823242, 89779091, 89630219, 89703629]
621H9703629P8750m2129j08384j21215k56729n86915o47926m91852l74366k72942k2011
632H6857910M33762P07336J045517Q48145o0173l77632l49190k97043j44196J23406
642H8787842P25433P68829K37488Q8646J41976J61506J77697L04649O70669O48331
652I2713066L02055J481n74974n10621L62687M55612p4669k67433l91915l32138J694
663I1684845J34079J81488J53519m9591l8605K09312K13387l9177j6518L01743L01933
674I3036415j9264l5172K61307K14813j79908k46788p6767J7715J62933J66108k3178
685I3278214j0796K30385J97479q3183k14218l52005k68624J40549K28760J18354l3523
696I3231392l41370n04348n84771o34475p22367n21370Q156L80272Q68683Q64288K25853
$$ y = [89703629, 89782379, 89740250, 89631866, 89510651, 89253922, 88667007, 88019081, 87527229, 87152863, 86879921, 86857910, 87291672, 87999008, 89044525, 89892670, 89832497, 89454865, 89105675, 88808632, 88664436, 88787842, 89513275, 90282104, 90519592, 90608238, 90750214, 90911720, 91089417, 91394066, 92064735, 92713066, 93015121, 93016602, 92441628, 91931007, 92293694, 92749306, 92674637, 92407204, 92015289, 91683151, 91684845, 91818924, 92000412, 92153931, 92104340, 92065735, 92275047, 92488434, 92449257, 92432739, 92734482, 93036415, 93017151, 92981979, 93243286, 93458099, 93278191, 93031403, 92954636, 92972351, 93135284, 93301392, 93278214, 93267418, 93497803, 93695282, 93612099, 93397881, 93045876, 92777252, 92917801, 93146561, 93264915, 93231392, 92890022, 92385674, 91800903, 91166428, 90444061, 89922691, 89930847, 90311119, 91179802, 92044090, 92269943]
707I2269943J27266M70116M73976K92374R1674l38340l23487J53870L49022N03639
717I4070053L95485j45264k17270J19233K03651J69540J42983O5163M5227N6411R6367
728I5001579K27715K02225N409n6626j7089m9401j03378k06329m63959m26132j0468
739I4103546L220l58338m22409l52218j67511K97714L99162J59165J32423K00295K82447
750I4277496M99085M49707Q4183L410J71570J30722j16921j22215O3492J96220M75289
761I6112038L47374l02292m61502l03109j47987J54717L22052M91859L95508q2176
771I6526482k12120q85j51253o41083q56522q92211r83429j143647j084015p72712
781H9788605o26183o27136m28345q4327K75489Q46558R76250O24153O04561Q33725
$$ y = [92269943, 92397209, 92867325, 93341301, 93633675, 93725349, 93387009, 93063522, 93217392, 93566414, 94070053, 94465538, 94320274, 94103004, 94222237, 94425888, 94595428, 94738411, 94803574, 94848801, 94905212, 95001579, 95229294, 95431519, 95436928, 95380302, 95363213, 95313812, 95210434, 95004105, 94540146, 94114014, 94103546, 94106766, 93748428, 93326019, 92973801, 92806290, 93104004, 93503166, 93662331, 93794754, 93995049, 94277496, 94776581, 95226288, 95310471, 95313881, 95485451, 95616173, 95499252, 95377037, 95440529, 95636749, 96112038, 96459412, 96157120, 95695618, 95392509, 95244522, 95399239, 95721291, 96213150, 96608658, 96526482, 96314362, 96313477, 96162224, 95521141, 94664619, 93772408, 92788979, 91645332, 90561317, 89788605, 89162422, 88535286, 88106941, 88022614, 88298103, 89144661, 90120911, 90745064, 91349625, 92183350]
791I2183350Q31985O88126N26352K79098R2407r3002j86020k20985j51825J43219J31035
802I4223740j23696l46710o04225r05701j400284j482269j210167r55841n33554l14499
812H6346794k53845j59813m9637m6470l28614n9677Q97766J157547Q96958P92976O28166
823H9822151N95162P69828O55793J85234J25808M58405M91882L18199K60445K39540
833I3922447K48574L76464K74422r6321k31957k13485k20818j79603k07497l97583
843I3274643k59903L23723L90701L9864j61820m37881m61312k01133j08528m2702j15769
854I2239883m48204m46083p0213p1480l89267n15129o02554n46097k47719k05231m07623
865H8290283m01443k20085j83541l08990k08016J67084K37007K0149K2057J22017K97333
$$ y = [92183350, 93015335, 93703461, 94229813, 94508911, 94601318, 94508316, 94322296, 94101311, 93949486, 94092705, 94223740, 94100044, 93753334, 93149109, 92243408, 90843124, 89360855, 88150688, 87194847, 86661293, 86346794, 86092949, 85933136, 85883499, 85837029, 85508415, 85448738, 86346504, 87504051, 88401009, 89193985, 89822151, 90417313, 91187141, 91842934, 92028168, 92153976, 92612381, 93104263, 93422462, 93682907, 93922447, 94171021, 94547485, 94821907, 94725586, 94493629, 94280144, 94059326, 93879723, 93672226, 93274643, 93014740, 93338463, 93729164, 93769028, 93607208, 93169327, 92708015, 92506882, 92398354, 92355652, 92239883, 91791679, 91345596, 91275383, 91203903, 90814636, 90299507, 89696953, 89150856, 88903137, 88697906, 88290283, 87888840, 87668755, 87485214, 87176224, 86968208, 87135292, 87372299, 87392448, 87414505, 87536522, 87833855]
876H7833855P20741P23839L46969R6848k18224l38440k25944k91901m55040o29455
886H7563248j004097r09188l06366j9073J45103K39678J44821K86102O67046Q47793
896H7655067R64234R12529O22795M78149L71621L47900M51256M59694M00688L86116
906I3050049M05502L88886K99980L53859N97999O27350N00084L88336K19345J11771
916I6943161M5731j7952r9686p8774P2030J22879J22024J06072O7260l12j36567j75880
928I6969986j86829o0791L19359L76274J58501M9187n9891j19309j31225j36543j28029
939I7050690r4033j6166K0195J8074N0545J28028J35804R2010L8643o4636r8587j01090
951I7159477l9909J54022J71852M1817m0222j64650j66107l2280K2171N0232N4382
$$ y = [87833855, 88554596, 89278435, 89625404, 89722252, 89504028, 89165588, 88939644, 88647743, 88192703, 87563248, 86559151, 85649963, 85343597, 85324524, 85469627, 85709305, 85854126, 86140228, 86807274, 87655067, 88619301, 89531830, 90154625, 90632774, 91004395, 91352295, 91803551, 92263245, 92663933, 93050049, 93455551, 93844437, 94144417, 94498276, 95096275, 95723625, 96223709, 96612045, 96831390, 96943161, 96988892, 96970940, 96871254, 96792480, 96864510, 96987389, 97109413, 97215485, 97282745, 97282433, 97145866, 96969986, 96783157, 96722366, 97041725, 97417999, 97576500, 97625687, 97565796, 97446487, 97315262, 97178719, 97050690, 96956657, 96940491, 96960686, 96978760, 97029305, 97157333, 97293137, 97385147, 97423790, 97359154, 97260567, 97159477, 97119568, 97273590, 97445442, 97487259, 97447037, 97282387, 97116280, 97084000, 97106171, 97156403, 97210785]
962I7210785J6357O531K2415L456p8941n0140J31752J24290p6652j12366k457k7321
974I7167709k18444j69510J54632K07001N7762k7031j34567j82343j82914j68656o9214
985I6434425j33659l84972m82490m81461n01587n44571m83917l05534j92406j16585
995I2807243p103J32294K45316L73954M06388L59939K76947Q9333K6802P8461N7983
1006I4847557P057n5122j45508k15645k72278l36929m15779m62990n72555m14566P2052
1017I2035294L13110M33136N08263M86709M99222N63667M77600J90735J06430K36542
1027I5850708J30196k51412l02269k8038j2253k42538j84876J67183K53601J43486
1037I5523788J20491J10650J26106K01034J86348O7925N1094J46721J05812r5657j12938
$$ y = [97210785, 97227142, 97233673, 97256088, 97259544, 97180603, 97130463, 97262215, 97386505, 97309853, 97197487, 97195030, 97167709, 96949265, 96779755, 96934387, 97141388, 97199150, 97172119, 97037552, 96855209, 96672295, 96503639, 96434425, 96300766, 95915794, 95433304, 94951843, 94450256, 93905685, 93421768, 93116234, 92923828, 92807243, 92800140, 92932434, 93177750, 93551704, 93958092, 94318031, 94594978, 94684311, 94711113, 94789574, 94847557, 94854614, 94799492, 94653984, 94438339, 94166061, 93829132, 93413353, 92950363, 92377808, 91963242, 92035294, 92348404, 92781540, 93289803, 93776512, 94275734, 94839401, 95317001, 95507736, 95614166, 95850708, 95980904, 95729492, 95427223, 95399185, 95386932, 95144394, 94959518, 95126701, 95380302, 95523788, 95644279, 95754929, 95881035, 96082069, 96268417, 96336342, 96387436, 96534157, 96639969, 96544312, 96431374]
1048I6431374L2142Q2016J20545O9587j32698j60721o5277L1014K51488K25402p0480
1059I6814392j72493j50207j89377k20963l35548m98490p57789j115730j515503k208092
1069H9650200k246567j799705j139473M4014P83058J361847J611137J430679J390458
1078I1085648J395988J254990R45755P47276O24825M38095J63864L5240L3043N49o7566
1089I6657707O508L01025L25036J56234k5413m03740m23691p6439M7447J20736M2793
1100I6728203k96852l55912j97837j11229L3333O820k38800k82692j86035j24985l074
1111I4970940l0182k43904k84172k22107j33614P1549J08413j030n9814j74355j16302
1122I3885422J93092K10243j1734j41998l42804k96158Q7517J31706j25931j59599
$$ y = [96431374, 96463516, 96545532, 96666077, 96735664, 96602966, 96442245, 96376968, 96407982, 96659470, 96884872, 96814392, 96641899, 96491692, 96302315, 96081352, 95745804, 95247314, 94489525, 93373795, 91858292, 89650200, 87403633, 85603928, 84464455, 84508469, 85291527, 86653374, 88264511, 89695190, 91085648, 92481636, 93736626, 94682381, 95429657, 96054482, 96492577, 96656441, 96691681, 96724724, 96725273, 96657707, 96664215, 96965240, 97290276, 97446510, 97421097, 97017357, 96593666, 96517227, 96564674, 96685410, 96728203, 96431351, 96075439, 95877602, 95766373, 95799706, 95806526, 95567726, 95285034, 95098999, 94974014, 94970940, 94940758, 94696854, 94412682, 94190575, 94056961, 94128510, 94236923, 94235893, 94176079, 94001724, 93885422, 94078514, 94288757, 94277023, 94135025, 93792221, 93496063, 93583580, 93715286, 93589355, 93429756]
1132I3429756m9713m04K670J06071L52410M24476L73246L11760J85180R9442J3397
1143I5248291j4305M5250J7692q8333j33247j52664j43860q6502o5018q0292m4731
1154I4502281O1463P1601r803l4424k4559l9765p9681q6311p8675l8932P3379P8446
1166I4395020k8183m8974n5099M0581K89512L98568M47464M10316K33124J57669J37901
1177I6377899J16104J01883J14556J77070J78292J17065J08841J52321J37161Q8028
1187I7669220J6327j29646j54404p2266k1667L6812Q3877J63719J18637q8645j51467
1198I7470497j02470j17996j79383j84990j35734j29746j74286j42547l6003K4314
1208I6291656P5730Q9714N8319M1862J6808J7021K9953P1717J66366K01294K20299
$$ y = [93429756, 93380043, 93379639, 93382309, 93488380, 93840790, 94265266, 94638512, 94950272, 95135452, 95234894, 95248291, 95233986, 95279236, 95296928, 95208595, 95075348, 94922684, 94778824, 94692322, 94627304, 94547012, 94502281, 94563744, 94635345, 94625542, 94591118, 94566559, 94526794, 94447113, 94360802, 94282127, 94243195, 94316574, 94395020, 94366837, 94317863, 94262764, 94303345, 94592857, 94991425, 95438889, 95849205, 96082329, 96239998, 96377899, 96494003, 96595886, 96710442, 96887512, 97065804, 97182869, 97291710, 97444031, 97581192, 97669220, 97685547, 97555901, 97401497, 97329231, 97307564, 97344376, 97428253, 97591972, 97710609, 97621964, 97470497, 97368027, 97250031, 97070648, 96885658, 96749924, 96620178, 96445892, 96303345, 96267342, 96291656, 96367386, 96457100, 96515419, 96557281, 96574089, 96591110, 96621063, 96692780, 96859146, 97060440, 97280739]
1219I7280739J60744m3251o5804Q0208J20064J32392P7324r6588j44005j16294n3650
1230I7331879J18065J42433J7311P362J07437P3212j20087j29249L3622P3525L6049
1241I7691559L3783N8746L0090p8559q1131Q583N9318J41930J03927r4253j41975o9428
1253I7662590o6803j05331j10222q8959q6639r1645j05766j37642j50986j36039j68373
1264I6414185k85721k61879j37566K3720L40866M01688K22465J50162J03256O0776
1274I7031952M8614j6121j58020j95884j41793j28913j29006j22024j14556j00494
1284I5973755q3328n5359k7207L5813J67701J97625J16897J30844K38869K37801J77551
1295I7110962O1539k39640k12120J87874K71179J21666R2720J09955J17188J58264
$$ y = [97280739, 97441483, 97398232, 97332428, 97412636, 97532700, 97665092, 97742416, 97645828, 97501823, 97385529, 97331879, 97449944, 97592377, 97609688, 97617050, 97724487, 97797699, 97677612, 97548363, 97581985, 97655510, 97691559, 97725342, 97784088, 97814178, 97735619, 97654488, 97663071, 97722389, 97864319, 97968246, 97873993, 97732018, 97662590, 97595787, 97490456, 97380234, 97291275, 97204636, 97112991, 97007225, 96869583, 96718597, 96582558, 96414185, 96128464, 95866585, 95729019, 95752739, 96093605, 96495293, 96717758, 96867920, 96971176, 97031952, 97080566, 97064445, 96906425, 96710541, 96568748, 96439835, 96310829, 96188805, 96074249, 95973755, 95890427, 95835068, 95807861, 95843674, 96011375, 96209000, 96325897, 96456741, 96695610, 96933411, 97110962, 97172501, 96932861, 96720741, 96908615, 97179794, 97301460, 97394180, 97504135, 97621323, 97779587]
1305I7779587J13601m9514q0757P583J4427n6320j9287J48682J69227O7040K1507p530
1317I8108246l8864o7398r4681j56548j08261Q1825J42121J32271Q4930n3810j01334
1328I7928497q5968p7255n7816k7771K9488M7615L4187K5033O011k502r064r1L4996
1341I7845360L9917K0622R323K121j7670p7293n1262R8633R4086p7919q7258P5386
1353I7874046M2290k15836k14195K2026J08719J64276R9060j77002k13882k6947n127
1364I7457428j03920j12442n6953m3305m5395o1722q7616j43486k38746l15384l87810
1375I5860649m56337n42518n59975n54588m29436j38642L7026J52092K68936L98582
1385I4035789M34403L70430L36792L09921K53723J31226J26190K60788K62474J81580
$$ y = [97779587, 97893188, 97843674, 97762917, 97770500, 97784927, 97728607, 97709320, 97858002, 98027229, 98094269, 98115776, 98108246, 98069382, 98001984, 97907303, 97750755, 97642494, 97724319, 97866440, 97998711, 98083641, 98029831, 97928497, 97842529, 97765274, 97707458, 97679687, 97709175, 97756790, 97790977, 97816010, 97822021, 97819519, 97810455, 97810364, 97845360, 97885277, 97905899, 97915222, 97917343, 97899673, 97822380, 97771118, 97869751, 97963837, 97885918, 97798660, 97874046, 97916336, 97700500, 97486305, 97508331, 97617050, 97781326, 97880386, 97703384, 97489502, 97462555, 97457428, 97353508, 97241066, 97184113, 97140808, 97095413, 97033691, 96946075, 96802589, 96563843, 96248459, 95860649, 95404312, 94861794, 94301819, 93747231, 93317795, 93179153, 93216179, 93368271, 93637207, 94035789, 94470192, 94840622, 95177414, 95487335, 95741058, 95872284, 95998474, 96259262, 96521736, 96703316]
1395I6703316Q9073r2011j25000j0589J7074J236K648l456K1003J02311R7221M936
1407I6807762k8206j9424m6402j15532j23787p0786o1370q4954p9269l8933m7806j16226
1419I5975067j19232q6029k4910J23764J29555L410o8329j30897j89942k30766l06801
1430I5074890m50538m78913m24026l40752j25145j38283m36134m33899j89209n6290
1440I2001701Q9165J04050m1825q4632r7512n2101J04431J32180L3973L8124J07697
1451I2335251J62094J96411L10944O27090N58853M9210q7784M982Q4831K86484L13423
1462I4841789K02751J02379p6988j26358o8001k2125M4136J19179K83554K26402p4959
1473I5451759k19246l27354l17215j35635p7629r0073r0454j08505j07911p5744j00159
$$ y = [96703316, 96792389, 96700378, 96575378, 96564789, 96581863, 96583099, 96585747, 96582291, 96603294, 96705605, 96802826, 96807762, 96779556, 96760132, 96713730, 96598198, 96474411, 96403625, 96342255, 96257301, 96178032, 96139099, 96091293, 95975067, 95855835, 95769806, 95744896, 95868660, 95998215, 96001625, 95933296, 95802399, 95612457, 95381691, 95074890, 94624352, 94145439, 93721413, 93380661, 93255516, 93117233, 92681099, 92247200, 92057991, 92001701, 92090866, 92194916, 92153091, 92068459, 91970947, 91918846, 92023277, 92155457, 92189430, 92227554, 92335251, 92497345, 92693756, 93004700, 93631790, 94190643, 94239853, 94152069, 94157051, 94241882, 94528366, 94841789, 95044540, 95146919, 95069931, 94943573, 94875572, 94853447, 94897583, 95016762, 95300316, 95526718, 95451759, 95232513, 94905159, 94587944, 94452309, 94374680, 94284607, 94194153, 94085648, 93977737, 93901993, 93801834]
1484I3801834j76048k35916l18627l36410k74132k80357l47466l57536l24990l10249
1494I0840103k91160k96257l56202l19931j87133j10199n8556k266M6158J06811K83959
1505H9655327J40259m11606n85152m84085m80125m77051m88045n30907n21209l96271
1515H5421135m91264q83103r29046o61324n93903o33071o39702p42295n66269q4655
1525G9196503K19818M45961O81259Q96599J120804J428581J492096J398659J126594
1534H8006874M30206L13713P60933Q32253P49939N64384J28228j9555K9778J02280
1544I1899033L17314L71269K94563K68791K57134K24998J79909J26053L6072J4854
1554I3989990P1816O4132J00991j11740p02553q63625o81923o17576m91692n59807
$$ y = [93801834, 93625786, 93389870, 93071243, 92734833, 92460701, 92180344, 91832878, 91475342, 91150352, 90840103, 90548943, 90252686, 89896484, 89576553, 89389420, 89279221, 89220665, 89218399, 89264557, 89371368, 89655327, 89795586, 89383980, 88798828, 88314743, 87834618, 87357567, 86869522, 86338615, 85817406, 85421135, 84929871, 84046768, 83117722, 82456398, 81862495, 81229424, 80589722, 79847427, 79281158, 79196503, 79416321, 79862282, 80543541, 81440140, 82560944, 83989525, 85481621, 86880280, 88006874, 88437080, 88750793, 89511726, 90343979, 91093918, 91658302, 91786530, 91766975, 91796753, 91899033, 92216347, 92587616, 92882179, 93150970, 93408104, 93633102, 93813011, 93939064, 93975136, 93989990, 94061806, 94125938, 94226929, 94115189, 93412636, 92549011, 91867088, 91249512, 90757820, 90198013]
1564I0198013q81118r63501q29957q80767j079056j172165j278206j177528q88848
1573H1046867n57159L2921J64581k42447j50581L16215O16211R29070J077705J115555
1583H4348938J005768O47262M81011M51011L40134J97907M3106j64505k82959l76915
1593H6690758l29949j02951L1235J57928K08573J91208J42074N2597p9444k92397m30794
1604H6238838n18059o16073o81427q26096j066185j225380j379417j401924j399231
1613G7125046j072479k81998J14342J71302N27550J104958J577018K147576K327774
1622H3741089K175667J947548J448700J201370J135971J008415Q90106P39342N26520
1631I4814728M11300L72879L34435L54576K75276N3788J9050J47720K03995K68913
$$ y = [90198013, 89316895, 88353394, 87523437, 86642670, 85563614, 84391449, 83113243, 81935715, 81046867, 80489708, 80522629, 80687210, 80444763, 80294182, 80610397, 81226608, 82155678, 83233383, 84348938, 85354706, 86001968, 86482979, 86933990, 87274124, 87472031, 87515137, 87350632, 87067673, 86690758, 86360809, 86257858, 86289093, 86447021, 86655594, 86846802, 86988876, 87041473, 86962029, 86669632, 86238838, 85720779, 85104706, 84423279, 83597183, 82530998, 81305618, 79926201, 78524277, 77125046, 76052567, 75770569, 75884911, 76056213, 76583763, 77688721, 79265739, 81413315, 83741089, 85916756, 87864304, 89313004, 90514374, 91650345, 92658760, 93548866, 94288208, 94814728, 95226028, 95598907, 95933342, 96287918, 96563194, 96616982, 96636032, 96783752, 96987747, 97256660]
1641I7256660K54059J34850R7870J20331J06689O7284N6335O8237P1099R6512M9804
1652I8379730r3818j40786j14486j15281j43287r7679M0008R4742J15044Q1848p0290
1663I7935745o0486J05904J69113K09572J65009o058p5699q3656r9205j05889j00273
1674I8054077q5594n2712k746N9250J70822J86806J00349Q3733J45317P9101j41212
1685I8597191k04659j61789j21429m4991K1744J17066J33369N5557N1613J27625R1224
1696I8662521q0825j03402J5732K2438n1857p8918j02043p6554L3142L9696o4445o1776
1708I8153709K6108O7833J00609J06766R4528M8309p5966q6494M4205J4228j97197
1719I8296638k05108j6739J1757q2138r2552r1126K648K76397K98813P4478J6358Q1489
$$ y = [97256660, 97510719, 97645569, 97743439, 97863770, 97970459, 98037743, 98094078, 98162315, 98233414, 98329926, 98379730, 98285912, 98145126, 98030640, 97915359, 97772072, 97674393, 97714401, 97809143, 97924187, 98006035, 97935745, 97875259, 97981163, 98150276, 98359848, 98524857, 98518799, 98443100, 98359444, 98260239, 98154350, 98054077, 97968483, 97915771, 97913025, 97972275, 98143097, 98329903, 98430252, 98513985, 98659302, 98738403, 98597191, 98392532, 98230743, 98109314, 98064323, 98086067, 98203133, 98336502, 98392059, 98443672, 98571297, 98662521, 98581696, 98478294, 98494026, 98516464, 98464607, 98385689, 98283646, 98207092, 98240234, 98279930, 98215485, 98153709, 98179817, 98247650, 98348259, 98455025, 98549553, 98597862, 98521896, 98435402, 98479607, 98493835, 98296638, 98091530, 98074791, 98086548, 98004410, 97911858, 97820732, 97823380, 98099777, 98398590, 98473068, 98489426, 98570915]
1731I8570915K8588j49010j83632j05736o1271N508J7517k1194m9874j11442r4986
1742I7845383O080N4192R3079Q5334J4542j6335l6476l2135K1576J1376q0758o9664
1754I7896194M6875P4524M7211K3338l3493l6003J7502L2944K4414K9617L2540N9150
1766I8214813J49468J17065o3614j04088l5072k2415l8147k8565j0917K9899J33225
1777I8341652J26457J8288n3551j59805j55449j2810J2138o5704n0239K8755R4124
1788I8123856K20161J86798l4164j10123j23360p7537J04049J17898k4773o5613n7335
1799I8259857m7470j7219N676L5003M3198K6230K7847N6168L4836m3778p2929o8955
1811I8238464p3547q0994p2715n7602j8738N4931J02257J50368J51802J16638N1949
$$ y = [98570915, 98599503, 98450493, 98266861, 98161125, 98099854, 98105362, 98122879, 98101685, 98051811, 97940369, 97845383, 97851463, 97905655, 97998734, 98084068, 98098610, 98082275, 98045799, 98013664, 98035240, 98046616, 97965858, 97896194, 97943069, 98017593, 98064804, 98088142, 98054649, 98018646, 98036148, 98069092, 98093506, 98123123, 98155663, 98214813, 98364281, 98481346, 98417732, 98313644, 98278572, 98256157, 98218010, 98189445, 98178528, 98208427, 98341652, 98468109, 98486397, 98432846, 98273041, 98117592, 98104782, 98116920, 98051216, 98000977, 98029732, 98123856, 98344017, 98530815, 98496651, 98386528, 98263168, 98185631, 98289680, 98407578, 98382805, 98317192, 98259857, 98212387, 98195168, 98200844, 98235847, 98279045, 98305275, 98333122, 98389290, 98424126, 98380348, 98307419, 98238464, 98164917, 98083923, 98011208, 97953606, 97934868, 97989799, 98092056, 98242424, 98394226, 98510864, 98562813]
1822I8562813j00617j14936J121N2834J17462Q0520q7097j54686k00081j42982R1988
1833I8106339J22879m2366n3841N1361P1670K9534L6575J07315P1663p8651j40473
1844I8282005j78054j37757K6299P6843N5695L2539m5921l6477P2007R1789P0480N432
1856I8314880j71302j85540n2047J3755P4440R4956O3972O1844Q7761O4468n455n5267
1868I8306465j22337j23902n0857k2431j0894q347j7883l5240p7340q0734m4433l5836
1880I7676231n7441l1899N4505O9145J2390J5335P0000P6957N0164L2974J5762o294
1892I7977829n0499m2892M5372K4627j30417j29173p912Q7571K69104K35031o5064
1903I8213577j27983j8074J8524O3088L6339r7351j16303n1399r77R9205R0431o2179
$$ y = [98562813, 98462196, 98347260, 98348381, 98401215, 98518677, 98599197, 98512100, 98357414, 98157333, 98014351, 98106339, 98229218, 98186852, 98133011, 98184372, 98256042, 98285576, 98322151, 98429466, 98501129, 98422478, 98282005, 98103951, 97966194, 97992493, 98069336, 98125031, 98157570, 98111649, 98075172, 98147179, 98238968, 98309448, 98314880, 98143578, 97958038, 97905991, 97919746, 97994186, 98089142, 98153114, 98214958, 98302719, 98367187, 98361732, 98306465, 98184128, 98060226, 98009369, 97986938, 97976044, 97967697, 97949814, 97914574, 97837234, 97756500, 97712067, 97676231, 97618790, 97586891, 97641396, 97710541, 97722931, 97738266, 97808266, 97885223, 97935387, 97968361, 97984123, 97977829, 97927330, 97884438, 97929810, 97954437, 97824020, 97694847, 97686935, 97774506, 98043610, 98278641, 98213577, 98085594, 98067520, 98086044, 98149132, 98185471, 98088120, 97971817, 97920418, 97919441, 98018646, 98109077, 98046898]
1915I8046898o0608R3369J08787Q247p606L4241M0939M2313J1665p8369r1912k5894
1927I8122070k8801j07048q6639K9488P8750J13152Q6929l4668o6925m4052j4191O0730
1939I8108795P6622M5830K3025k6054j9173N2361P1526P1640L6148p2792q7502j7616
1951I8262810P393K8061J1611o3827p8011n5076j9020O6589P9895L1754L35o2774m2343
1964I8167397R2529J03020J3801l4996r9090r5917m738Q583k7733o1012j47102j15487
1976I7799255N6885J07048P1648O6871O3210O2294P0358O0868L3477J5999P172j6022
1988I8399063o6490o9717k4125j0589j3275j4786l2807j3992O7948N4145o4186r3147
2000I8118042o4423m5227j312k808q1138m0695J45645J73431P6554K3719l8116o5567
$$ y = [98046898, 97986290, 98079659, 98188446, 98196693, 98189087, 98223328, 98264267, 98306580, 98318245, 98239876, 98147964, 98122070, 98093269, 97986221, 97899582, 97929070, 98007820, 98120972, 98207901, 98173233, 98106308, 98062256, 98048065, 98108795, 98185417, 98231247, 98254272, 98228218, 98209045, 98261406, 98332932, 98404572, 98440720, 98367928, 98280426, 98262810, 98270203, 98298264, 98309875, 98246048, 98168037, 98112961, 98093941, 98160530, 98240425, 98272179, 98272514, 98209740, 98167397, 98259926, 98362946, 98376747, 98341751, 98242661, 98146744, 98142006, 98150589, 98122856, 98061844, 97914742, 97799255, 97856140, 97963188, 98034836, 98101707, 98164917, 98227211, 98297569, 98358437, 98391914, 98407913, 98415085, 98399063, 98332573, 98262856, 98238731, 98228142, 98214867, 98200081, 98167274, 98153282, 98221230, 98275375, 98211189, 98118042, 98053619, 98008392, 98007080, 98004272, 97923134, 97882439, 98028084, 98201515, 98278069, 98301788, 98263672, 98198105]
2012I8198105o9695m9659K2056L4210o767j5526M6j3870o2966p0770n1498k4742L9528
2025I7928452M0603k7443m0313k0981k053L4455M8874N0926M1290K0813j4801j01356
2037I7958466r1553L3501N0613j5472m0482n9654n6526j1895j9386q6861q9500k8702
2049I7542549k4055o7261p1953n8769l1738L0044M6944J4160L0426J20735Q6182j06880
2061I7510384j25077K9236L1922j03379j07383k411L1379L4859K4651k3293k9449J6502
2073I7287941o393j17272j18759l1853K9778J32606J24245r31o8405j45195j38000
2084I6947762l2616K0653P7980O4636l6926q2093j11938j06926m6158l3020n1453o2606
2096I6547295q2138q6594q1680o8238l0372l0831p5050p8468l3951n4878j59485j61667
$$ y = [98198105, 98128410, 98078751, 98100807, 98135017, 98128250, 98112724, 98112770, 98098900, 98035934, 97965164, 97913666, 97888924, 97928452, 97969055, 97941612, 97901299, 97880318, 97878265, 97912720, 97961594, 98012520, 98053810, 98074623, 98059822, 97958466, 97866913, 97900414, 97951027, 97935555, 97895073, 97835419, 97778893, 97766998, 97747612, 97660751, 97571251, 97542549, 97518494, 97451233, 97379280, 97320511, 97288773, 97318817, 97365761, 97379921, 97410347, 97531082, 97617264, 97510384, 97385307, 97414543, 97446465, 97343086, 97235703, 97233292, 97264671, 97299530, 97324181, 97300888, 97271439, 97287941, 97281548, 97164276, 97045517, 97013664, 97043442, 97176048, 97300293, 97299362, 97230957, 97085762, 96947762, 96915146, 96935799, 97013779, 97078415, 97041489, 96959396, 96847458, 96740532, 96694374, 96661354, 96609901, 96547295, 96465157, 96378563, 96296883, 96228645, 96198273, 96167442, 96092392, 96013924, 95979973, 95925095, 95765610, 95603943]
2108I5603943o6902l9574l4286o8497j88187j91971n4672p8606k69554l02101k04613
2119I4104980j89117k19528k28409k49268k15530r1125q6899j90834k40563k94281
2129I2099426k81715j73882j57303k16178k27402k14501k06520j97624j82175j58096
2139I0084030j39381j31111r9297k7512j5640p2388o3369M532K4292J0963J1208K1820
2151H9608147Q934m0482m0604K625K7016O7993M5799n0735r7443j33896j26099o1607
2163H9209648k4292M5563p080k26288k80785k18963j78910r7297q9600j43211j93024
2174H7795761k84126l01216k42859k30194k46590k37465k05261j94878k01324k00035
2184H5451813j93405j96404j96365k29309l15712l37983l03916l00118l07106l16406
$$ y = [95603943, 95537041, 95497467, 95463181, 95394684, 95206497, 95014526, 94959854, 94881248, 94611694, 94309593, 94104980, 93915863, 93696335, 93467926, 93218658, 93003128, 92912003, 92825104, 92634270, 92393707, 92099426, 91817711, 91643829, 91486526, 91270348, 91042946, 90828445, 90621925, 90424301, 90242126, 90084030, 89944649, 89813538, 89714241, 89686729, 89671089, 89598701, 89535332, 89539864, 89564156, 89575119, 89586327, 89608147, 89617081, 89576599, 89535995, 89538620, 89565636, 89633629, 89679428, 89628693, 89531250, 89397354, 89271255, 89209648, 89185356, 89230919, 89223839, 88997551, 88716766, 88497803, 88318893, 88221596, 88131996, 87988785, 87795761, 87511635, 87210419, 86967560, 86737366, 86490776, 86253311, 86048050, 85853172, 85651848, 85451813, 85258408, 85062004, 84865639, 84636330, 84320618, 83982635, 83678719, 83378601, 83071495, 82755089]
2194H2755089l23967l54431m21860m45480m44603m22791l30162l62732n32722n95208
2204G8521133n89561o03272o16668o21056o10878o17317o28799o60470p18879p62680
2214G2091553q01155q38707q82035r00245q93616q92181q85872q85102q85803q93898
2224F3332939r39228q96667p16473p23099r22180r66740r03057q93043r11904q97003
2234E4563545q41045q36109q89447q80191q12245p91122q13366p87636p25746o72032
2244D6514606n91041n80597o58558o55746o00006n49244m71547m36874m46129m25937
2254D1098927m04595l42419k07183j67466k29026k00558j06693m0528L6309O3324K4486
2265C9524578M4060J20594J35563R7416R0767Q8455J14250J79481K14863K48623K36798
$$ y = [82755089, 82431122, 82076691, 81654831, 81209351, 80764748, 80341957, 80011795, 79649063, 79116341, 78521133, 77931572, 77328300, 76711632, 76090576, 75479698, 74862381, 74233582, 73573112, 72854233, 72091553, 71290398, 70451691, 69569656, 68669411, 67775795, 66883614, 65997742, 65112640, 64226837, 63332939, 62393711, 61497044, 60780571, 60057472, 59135292, 58168552, 57265495, 56372452, 55460548, 54563545, 53722500, 52886391, 51996944, 51116753, 50304508, 49513386, 48700020, 47912384, 47186638, 46514606, 45923565, 45342968, 44684410, 44028664, 43428658, 42879414, 42407867, 41970993, 41524864, 41098927, 40694332, 40351913, 40144730, 39977264, 39748238, 39547680, 39440987, 39400459, 39436768, 39500092, 39524578, 39568638, 39689232, 39824795, 39922211, 40012978, 40101433, 40215683, 40395164, 40610027, 40858650, 41095448]
2276D1095448J62029J37424J40118J48247J73118J91307K14028K19726K06066K03801
2286D2891312J95289K20009K91134L16216L02791L12878L35884L52024L67523L77083
2296D5962143L63899M00231N01373N33794N08808N14649N23212N58377O40010O64784
2306E1171280O34121O45328O71433P22671Q53157Q35919O72077N84126M77863N07500
2316E7775475P15110P77985P59552P28702O57010N89279M94575M51802M86755M17137
2326F3853382J54163K34932P48398Q01682M55147L59916L76511M11697N26955N69321
2336F8492104N54771N72037O32744O01432L93677M82369R58274R85100P32704L57705
2346G4762917m20426o36413m14589k23015J85203K90154J10153R1766J47316J80870
$$ y = [41095448, 41257477, 41394901, 41535019, 41683266, 41856384, 42047691, 42261719, 42481445, 42687511, 42891312, 43086601, 43306610, 43597744, 43913960, 44216751, 44529629, 44865513, 45217537, 45585060, 45962143, 46326042, 46726273, 47227646, 47761440, 48270248, 48784897, 49308109, 49866486, 50506496, 51171280, 51805401, 52450729, 53122162, 53844833, 54697990, 55533909, 56205986, 56790112, 57267975, 57775475, 58490585, 59268570, 60028122, 60756824, 61413834, 62003113, 62497688, 62949490, 63436245, 63853382, 64007545, 64242477, 64990875, 65792557, 66247704, 66607620, 66984131, 67395828, 67922783, 68492104, 69046875, 69618912, 70251656, 70853088, 71246765, 71729134, 72687408, 73672508, 74405212, 74762917, 74342491, 73706078, 73291489, 73068474, 73253677, 73543831, 73653984, 73745750, 73893066, 74073936]
2356G4073936K02248K67960L69407M84391O70051P19933O59103N93475M36715M28146
2366G8905365N62408O21674O61545O77368O82495O28044M82659M20379L95653M16351
2376H4453941N42923N25475L74893K97257K26356K21016L03627L25699L28972K94662
2386H7894821J82678J72066K66358K72201K10693J90667J82151J96213K34963K78740
2396I0081551L58528L69720L17192K85668K40760K35154K85553K72369J93878J76430
2406I2816803K13867K04178J43219J49460K29408K38495J91994J73309J64673J53519
2416I4678925J45797J29959J07933Q3397L0754M8470J67397J65344L8887K3788R9922
2427I5720573J12061Q1917P7560P7988R8968J64032J63079J06926O2065k8420l647
$$ y = [74073936, 74276184, 74544144, 74913551, 75397942, 76067993, 76787926, 77447029, 78040504, 78477219, 78905365, 79467773, 80089447, 80750992, 81428360, 82110855, 82738899, 83221558, 83641937, 84037590, 84453941, 84996864, 85522339, 85897232, 86194489, 86420845, 86641861, 86945488, 87271187, 87600159, 87894821, 88077499, 88249565, 88515923, 88788124, 88998817, 89189484, 89371635, 89567848, 89802811, 90081551, 90440079, 90809799, 91126991, 91412659, 91653419, 91888573, 92174126, 92446495, 92640373, 92816803, 93030670, 93234848, 93378067, 93527527, 93756935, 93995430, 94187424, 94360733, 94525406, 94678925, 94824722, 94954681, 95062614, 95146011, 95176765, 95225235, 95392632, 95557976, 95596863, 95620651, 95720573, 95832634, 95914551, 95992111, 96070099, 96169067, 96333099, 96496178, 96603104, 96665169, 96636749, 96633102]
2438I6633102J82290J84753J884j4404J08986J27457Q8569M6402m5944n5359K2072
2449I7279808L7483P653J4183M8568O3225O8573P0427O2820O3523P7194O7093K9922
2461I7890472J5381J8715Q911j0559k2865n3406j7670J08986J43334J25671P7988m2748
2473I8242210q6494q6456o0151K1218N9799Q3992P7774K6009M936o744k14K9938N3123
2486I8358940J09055O9374j09047j25435q797N6198J52703J32415m2938p2120K1957
2497I8542305K9686p820m5754j30226j21689k6680M1153J44387J46247M7562j8402
2508I8600769j25603j11816M6204R3009P1267O5635N0927M3129M8614K5673l2280n7388
2520I8718140p6218n0476M4182P1907N5168L9841l487l120M8469M9355M623m311K3980
$$ y = [96633102, 96815392, 97000145, 97002029, 96987625, 97096611, 97224068, 97312637, 97359039, 97313095, 97257736, 97279808, 97317291, 97324944, 97339127, 97387695, 97450920, 97519493, 97589920, 97652740, 97716263, 97793457, 97860550, 97890472, 97905853, 97924568, 97933479, 97922920, 97900055, 97846649, 97828979, 97937965, 98081299, 98206970, 98284958, 98242210, 98155716, 98069260, 98009109, 98030327, 98090126, 98174118, 98251892, 98277901, 98282837, 98276093, 98275879, 98305817, 98358940, 98467995, 98537369, 98428322, 98302887, 98294090, 98350288, 98502991, 98635406, 98592468, 98520348, 98542305, 98571991, 98564171, 98518417, 98388191, 98266502, 98239822, 98280975, 98425362, 98571609, 98619171, 98600769, 98475166, 98363350, 98409554, 98502563, 98573830, 98639465, 98690392, 98733521, 98782135, 98807808, 98775528, 98718140, 98641922, 98591446, 98635628, 98707535, 98762703, 98802544, 98799057, 98795937, 98844406, 98893761, 98898384, 98894073, 98918053]
2533I8918053K220q1230r2629m6722j8479J7357L4737M2152L1639k2483r682R9518
2545I8874451P6408r5390j21880l3974k265R422K6962N0995N2910M1725R773q6288
2557I8802849o5590R5726J21239L5286J6738M8371K0149p5317r8488p2121m5112J0994
2569I8794724L1066K9343J3832k7801n4360r6321p3288L3447O8573N3025N8075Q2901
2581I8913216N9440j7578n9029r7915r1530k8610K884K7061L5332K1194J9028K5177
2593I8808670J9577Q32n555j7883J1467J19759J10008k7206n7290q682k403j2207k2202
2606I8916885m6516m4823j6067n081k0668J7074J48605J32180l6125r9060j28891r4101
2618I8723412N3718Q9333M0390K1240k029q172K022J0300K8496K7244Q347o149l4737
$$ y = [98918053, 98920273, 98839043, 98746414, 98699692, 98681213, 98698570, 98733307, 98775459, 98807098, 98784615, 98774933, 98874451, 98950859, 98855469, 98733589, 98699615, 98697350, 98706772, 98733734, 98784729, 98837639, 98879364, 98889137, 98802849, 98737259, 98832985, 98954224, 98989510, 99006248, 99054619, 99074768, 98999451, 98900963, 98828842, 98783730, 98794724, 98825790, 98855133, 98868965, 98841164, 98786804, 98690483, 98617195, 98650642, 98719215, 98772240, 98830315, 98913216, 98972656, 98955078, 98896049, 98798134, 98706604, 98677994, 98680878, 98707939, 98743271, 98764465, 98783493, 98808670, 98828247, 98829079, 98823524, 98805641, 98817108, 98936867, 99046875, 99019669, 98962379, 98953697, 98951294, 98939087, 98916885, 98870369, 98825546, 98809479, 98804398, 98783730, 98800804, 98949409, 99081589, 99045464, 98946404, 98817513, 98723412, 98777130, 98866463, 98906853, 98928093, 98926064, 98917892, 98919914, 98930214, 98958710, 98985954, 98994301, 98988152, 98953415]
2631I8953415k5772K7489M6180N8937K9900p1365q7571l3187q011K8206J4068p2098
2643I8860191q2183m6853Q393J35971J51565P4578J1543r5589j21231p5058m4365Q32
2655I8777794K7779N9387L6552n7701r6535j24077r0835M2251O9092K335k594N0423
2667I8693871K1171j05217j29097p9254m0245K5436N2193M4609M9805N7388O1653P1549
2679I8723862N6816J4450j3306m2198n1735l7842l7597m9233m2915k7443K502O8528
2691I8563889P8842N2383N119j19590j11100M4251Q0894L9391K2766n600k388L8841
2703I8687698M9065L3188M0436R3246N2330j21567j32110J5472M5731J1184k2964j13197
2715I8638512r8946L5217O6895J3092K7969J24810R6344p6790j10222m9072K647J09695
$$ y = [98953415, 98927643, 98955132, 99001312, 99060249, 99090149, 99018784, 98931213, 98898026, 98890015, 98918221, 98932289, 98860191, 98778008, 98731155, 98739548, 98875519, 99027084, 99101662, 99113205, 99017616, 98896385, 98821327, 98776962, 98777794, 98805573, 98864960, 98901512, 98843811, 98747276, 98623199, 98532364, 98574615, 98643707, 98646042, 98643448, 98693871, 98715042, 98609825, 98480728, 98401474, 98361229, 98386665, 98438858, 98483467, 98533272, 98590660, 98652313, 98723862, 98780678, 98795128, 98781822, 98739624, 98687889, 98650047, 98612450, 98563217, 98520302, 98492859, 98495361, 98563889, 98642731, 98695114, 98700233, 98580643, 98469543, 98513794, 98594688, 98634079, 98656845, 98651245, 98648857, 98687698, 98736763, 98769951, 98810387, 98903633, 98955963, 98834396, 98702286, 98717758, 98763489, 98774673, 98751709, 98638512, 98539566, 98574783, 98641678, 98654770, 98682739, 98807549, 98903893, 98827103, 98716881, 98667809, 98670456, 98780151]
2727I8780151J16997L3257k1576r5055j17111r6993o7756j1132L2830Q9714R7153N0453
2739I8790932L0586K1248O408p720l0091n6526r4749j91735j52092L9482J26244J80031
2751I8662018J70181P3288J3474o1394o7085J7974K2866n9349l0297J39397J33659
2762I9014732n4382q1299K5368L2188l5240m6135k9350n04P7134P2074k2865m7447
2774I8904274k8923j8547M219Q087q224q347L029Q125J5335Q652k0096k2369L387K503
2788I8851105k6322k3193M50L0327J00426Q9042j0055n0377p8850n4382N9273P5698
2800I8963142Q156j0162k0714R224J28487J08909o6116j02257l4523j7425j2589j9363
2812I8934769m3015o3202j04187q9554n409J6022k8130N768J30798J50986R0286M8882
$$ y = [98780151, 98897148, 98930405, 98908829, 98813774, 98696663, 98599670, 98531914, 98520782, 98553612, 98643326, 98740479, 98790932, 98821518, 98842766, 98849174, 98841454, 98811363, 98754837, 98660088, 98468353, 98316261, 98355743, 98481987, 98662018, 98832199, 98905487, 98918961, 98857567, 98790482, 98808456, 98831322, 98771973, 98741676, 98881073, 99014732, 98960350, 98879051, 98904419, 98936607, 98901367, 98855232, 98825882, 98825378, 98902512, 98974586, 98951721, 98904274, 98875351, 98856804, 98861023, 98869110, 98860886, 98852539, 98855568, 98863693, 98879028, 98887680, 98867584, 98845215, 98848602, 98851105, 98824783, 98801590, 98802040, 98832367, 98932793, 99021835, 99011780, 98961403, 98882553, 98828171, 98887444, 98963142, 98971298, 98961136, 98940422, 98949646, 99078133, 99187042, 99120926, 99018669, 98984146, 98966721, 98954132, 98934769, 98891754, 98828552, 98724365, 98634811, 98629402, 98645424, 98617294, 98623062, 98753860, 98904846, 98995132, 99044014]
2824I9044014n104m4418p9537r5985j06003p5272K0249M9759M1626J3160p9277p8674
2836I8604538J5396M4083M9926K1225o9694j00441j02264p2739R109N6740J16562Q9508
2848I8661949m5349j05263j46507j27075R99L647j15494j37130j14472n4359J12510
2859I7933456J15418m4823j00868j22147r8419Q850L5233j4542N104J00418J00685
2870I7918365R77q629N7076O6902M5898K4796j602m3274j28433j34423p0930k1836
2882I7704887N6885P2624L2853J44o3850o8329j5999J2871N2811M5875j1352m7417
2894I7772003j01448q8791R781L2539j258p012n867K220K5772L0396K4055R232j8410
2907I7683212m4250p8751r4955r0988j01708j25954j33918j28388j28151j24405j33567
$$ y = [99044014, 99038910, 98994492, 98914955, 98818970, 98712967, 98637695, 98657944, 98707703, 98749329, 98762489, 98683212, 98604538, 98619934, 98664017, 98713943, 98735168, 98665474, 98565033, 98462769, 98390030, 98399139, 98455879, 98572441, 98661949, 98616600, 98511337, 98364830, 98237755, 98238754, 98242401, 98126907, 97989777, 97875305, 97820946, 97933456, 98048874, 98004051, 97903183, 97781036, 97682617, 97691467, 97726700, 97712158, 97717262, 97817680, 97918365, 97919342, 97910713, 97967789, 98034691, 98080589, 98105385, 98103783, 98060509, 97932076, 97797653, 97726723, 97704887, 97761772, 97834396, 97867249, 97867393, 97803543, 97735214, 97719215, 97732086, 97784897, 97830772, 97819420, 97772003, 97670555, 97581764, 97591545, 97624084, 97622826, 97615814, 97609947, 97612167, 97637939, 97668335, 97692390, 97701622, 97683212, 97638962, 97560211, 97465256, 97374268, 97272560, 97146606, 97012688, 96884300, 96756149, 96631744, 96498177]
2918I6498177j59287j70830k10807j39565Q9500J50032O8665O4972J03996J05667P1839
2929I6472359P5149J21498J14342M0794M8737J50917J48369P2143l242j43051j61095
2940I6936920n1239k4490m2504m7615p5912m0817P7697J12801R7771O6261j1780m9972
2952I6947121p9628o1966J3229O6139J49651J31988j3778m8348j3092J8028R6459R0103
2964I7295906l174m2915p4677n7075L6316N8121K5085J7693K2384J2612j3375k2217
2976I7254684j5403k0554m7020l0105M9400M9538k9778m6204l8742O295J36520J47552
2988I7416183N3742K029o4613o5331P897M2152O8306P5745O0104M9118K9778K6153
3000I7701263L5737M4441P6889M8614o3110q3107l6507J862P2288Q8356N5268L8482
$$ y = [96498177, 96338890, 96168060, 95957253, 95817688, 95907188, 96057220, 96125885, 96190857, 96294853, 96400520, 96472359, 96547508, 96669006, 96783348, 96824142, 96872879, 97023796, 97172165, 97244308, 97241066, 97098015, 96936920, 96885681, 96861191, 96818687, 96771072, 96695160, 96654343, 96732040, 96844841, 96942612, 97008873, 96997093, 96947121, 96867493, 96805527, 96818756, 96884895, 97034546, 97166534, 97152756, 97104408, 97091316, 97109344, 97205803, 97295906, 97292732, 97249817, 97175140, 97118065, 97154381, 97212502, 97237587, 97255280, 97277664, 97290276, 97276901, 97254684, 97239281, 97218727, 97171707, 97141602, 97191002, 97240540, 97210762, 97164558, 97125816, 97132111, 97268631, 97416183, 97469925, 97471954, 97407341, 97342010, 97349907, 97392059, 97460365, 97536110, 97596214, 97645332, 97675110, 97701263, 97737000, 97781441, 97858330, 97906944, 97843834, 97760727, 97724220, 97726082, 97798370, 97886726, 97941994, 97980476]
3012I7980476J9379O989L768r300k1385n7075j55785j35254R415P5981J11320J29914
3024I7958443J29821J04187N4932j9073j83197j74836J0918R1652J76620J11031k07115
3035I8053383k15027Q3138J40899L3997N867J5526j6838j06545j12579l7964j1826
3046I7832031j6090N722N1948P2747R6939N8960p6599j02837m4197r705N0614M5944
3058I7965477m7234m4151M1412P9705J19308R5337p912o2728j22429j01471L0113O6826
3070I8012253L7056L2516L6148K4414p515j6922k1820O798J11939R2239p6218r6565
3082I8134323P820L3524O866K5849J11747Q1200r5436j16158p347L4409O5803N6527
3094I8339127j4420l2738j7357o866P339K9374P9300P2715L578j9859k5223j0376N1835
$$ y = [97980476, 97999855, 98006844, 98010612, 98001312, 97979927, 97922852, 97767067, 97631813, 97641228, 97717209, 97828529, 97958443, 98088264, 98192451, 98247383, 98228310, 98045113, 97870277, 97881195, 97972847, 98149467, 98260498, 98053383, 97838356, 97921494, 98062393, 98096390, 98102257, 98117783, 98100945, 97994400, 97881821, 97843857, 97832031, 97815941, 97821663, 97873611, 97946358, 98043297, 98102257, 98025658, 97922821, 97878624, 97868919, 97919533, 97965477, 97918243, 97874092, 97915504, 97995209, 98114517, 98209854, 98201942, 98139214, 98016785, 97915314, 97945427, 98012253, 98049309, 98081825, 98117973, 98142387, 98134872, 98117950, 98096130, 98102928, 98214867, 98307106, 98230888, 98134323, 98142143, 98175667, 98182533, 98208382, 98320129, 98401329, 98305893, 98189735, 98182388, 98216797, 98282600, 98339127, 98324707, 98291969, 98274612, 98267746, 98275085, 98304459, 98383759, 98456474, 98460052, 98440193, 98414970, 98404594, 98456429]
3107I8456429N0453j5404l1548j5823j1261L510j3947r5726p1266P9155J06003L6026
3119I8476601J1444k14j1330j5708k5963n3551m0146K5078M0245K8900j411p9842r7374
3132I8256729q1016l1754R7916J18950L6743J8615N6962J4923j35567j45622k8519
3143I8178360J9600N9196M4396m7753p9803r3674n9387O4995Q1581O989k7398o3629
3155I8083473o4972k6054n203J7860K0363r323k197M3632N1544K8992K2819L0304J5496
3168I8206734k2957m3678o2561n7656k8198N19N4550N4954o767j7807N860J5281J7739
3181I8116013L2928Q3992N8586p1716q1070J5457N2063Q1307N8815o2302n0186J02905
3193I8336792J33987O6521O9573J43432J17706j1016n8701p0999m9591L6888O4369
$$ y = [98456429, 98506882, 98491478, 98459930, 98444107, 98432846, 98436356, 98422409, 98326683, 98255417, 98334572, 98440575, 98476601, 98488045, 98487831, 98476501, 98460793, 98434830, 98381279, 98341133, 98366211, 98406456, 98435356, 98433945, 98354103, 98256729, 98175713, 98143959, 98241875, 98360825, 98397568, 98416183, 98473145, 98488068, 98352501, 98206879, 98178360, 98197960, 98257156, 98301552, 98253799, 98173996, 98080322, 98020935, 98085930, 98167511, 98174500, 98147102, 98083473, 98018501, 97992447, 97987244, 98005104, 98025467, 98016144, 98013947, 98057579, 98109123, 98138115, 98160934, 98191238, 98206734, 98183777, 98140099, 98077538, 98019882, 97991684, 97992203, 98046753, 98101707, 98094940, 98077133, 98082993, 98098274, 98116013, 98148941, 98232933, 98291519, 98219803, 98138733, 98154190, 98206253, 98287560, 98346375, 98284073, 98233887, 98336792, 98470779, 98537300, 98606873, 98750305, 98868011, 98856995, 98798294, 98727295, 98677704, 98714592, 98778961]
3204I8778961N2239M6798L7461J9981k9518j1444R3910J07933N6145J4976o4300o3561
3216I9039581M1741L5148q5525r5390k4651K2530R3483J02874N9250J3565p7293r2102
3228I9033211k8511j7121m1893l6598O94m028m7302o9313j08620p0953O9526J14937
3240I8794029J19255O4331j30752j24260R2529J42883J05072M2534j33445j31417P3555
3251I8914314R0050n6625p6249J23O271m4586l9414K1363K6397k6321j7647O0967N6030
3264I8914673l4477m9256j6121J4878Q1443Q2734J3374m509K0653L05n9555r4513j51390
3277I8718239j07598Q6640J09505j7785n8441q7593m1748J29273J61125Q5754L9505
3288I9016876j2443o7421j60622j54068l9390J1993K6062P0259J74767J51245k0218
$$ y = [98778961, 98831200, 98877998, 98915459, 98935440, 98905922, 98894478, 98988388, 99096321, 99152466, 99167442, 99103142, 99039581, 99081322, 99116470, 99030945, 98935555, 98910904, 98933434, 99026917, 99129791, 99189041, 99202606, 99125313, 99033211, 99004700, 98987579, 98945686, 98909088, 98909782, 98905754, 98858452, 98789139, 98680519, 98609566, 98679092, 98794029, 98913284, 98977615, 98846863, 98722603, 98815132, 98958015, 99063087, 99105621, 98972176, 98840759, 98914314, 99004364, 98947739, 98871490, 98871613, 98877884, 98833298, 98793884, 98815247, 98841644, 98815323, 98797676, 98858643, 98914673, 98880196, 98830940, 98814819, 98829697, 98911140, 98993874, 99007248, 99002739, 99023392, 99023697, 98964142, 98869629, 98718239, 98610641, 98697281, 98806786, 98789001, 98730560, 98642967, 98601219, 98730492, 98891617, 98977371, 99016876, 99004433, 98937012, 98776390, 98622322, 98582932, 98594925, 98620987, 98691246, 98866013, 99017258, 98997040]
3299I8997040p1572m7157l7697j8997K670O2035K6390j41067j60675o1913o416O7207
3311I8609848P4936J1276j7853n4290l6667O5254O8809k3414l9246l975J1177M1054
3323I8706909J7456p3532j08452j21544r9708k0241J2940J7768K6368L3500K7848K1644
3335I8440956k3056j43837j52634n0926k0935l3546k3148q278J9242P6728Q6495M7203
3347I8214264M1634P2479M5891m1336q2757j19667r3551K1866O2797O3919N0354l837
3359I8232056k0081r247o653J358m501l6049k6924L8773L0945o7994n7602O7467Q5045
3372I8226593K4704r827n4886o8779n9394l7217K3270L0472q156l1090o8687o1318
3384I7905685M51J9073J5472L457l3806m2824l4111j9173L9170L555j57593j80725
$$ y = [98997040, 98925468, 98878311, 98840614, 98821617, 98824287, 98886322, 98912712, 98771645, 98610970, 98549057, 98542641, 98609848, 98684784, 98696060, 98678207, 98623917, 98587250, 98652504, 98721313, 98697899, 98658653, 98654678, 98665855, 98706909, 98724365, 98650833, 98542381, 98420837, 98321129, 98300888, 98313828, 98331596, 98357964, 98391464, 98419312, 98440956, 98417900, 98274063, 98121429, 98070503, 98049568, 98016022, 97992874, 97984596, 98003838, 98080566, 98167061, 98214264, 98255898, 98328377, 98374268, 98332932, 98250175, 98130508, 98036957, 98058823, 98121620, 98185539, 98235893, 98232056, 98211975, 98202728, 98196075, 98197433, 98192932, 98156883, 98129959, 98168732, 98199677, 98131683, 98074081, 98141548, 98226593, 98251297, 98241470, 98186584, 98117805, 98058411, 98021194, 98044464, 98074936, 98066780, 98035690, 97967003, 97905685, 97906136, 97925209, 97940681, 97944138, 97910332, 97867508, 97833397, 97814224, 97853394, 97856949, 97699356, 97518631]
3396I7518631q9478n2879m6661R31J16111J22193J2085r415L3302L2761Q537j0254
3408I7635864l6308m8164n5550m0985O630K5390M7966N295j57501j52206J1924Q3420
3420I7325775J33110J29173M4495J9020L9032J9219l5622n9654q2917n1239O0318R7893
3432I7638603R5535P0809r628l0205M501k762o3110l5049J02638J23359N4406J2901
3444I7961998o7162l9032J34591J57493O9649P194j09809r7969P4409R7130m265k1935
3456I8162292J3993J5884l5667K4170K71446K36938j00662j86943j19041o2851O6208
3467I8285767R5512K9541K2743P4867L2494j42075j44622K2957O3728L2425O866n3283
3479I8326920o4705m0100j2047M0848O5612Q8692N7198o9481p6058L3478N9555N1163
$$ y = [97518631, 97429153, 97376274, 97329613, 97330544, 97446655, 97568848, 97580933, 97571518, 97604820, 97637581, 97646118, 97635864, 97599556, 97551392, 97495842, 97454857, 97461487, 97486877, 97534843, 97540138, 97382637, 97230431, 97242355, 97325775, 97458885, 97588058, 97632553, 97651573, 97690605, 97709824, 97674202, 97614548, 97531631, 97480392, 97540710, 97638603, 97734138, 97804947, 97795319, 97765114, 97769615, 97766853, 97703743, 97668694, 97771332, 97894691, 97949097, 97961998, 97894836, 97855804, 97990395, 98147888, 98217537, 98224731, 98114922, 98016953, 98091362, 98188492, 98184227, 98162292, 98176285, 98192169, 98156502, 98180672, 98452118, 98689056, 98588394, 98401451, 98282410, 98219559, 98285767, 98381279, 98410820, 98433563, 98508430, 98540924, 98398849, 98254227, 98277184, 98340912, 98373337, 98380203, 98326920, 98262215, 98222115, 98210068, 98250916, 98316528, 98405220, 98462418, 98392937, 98316879, 98350357, 98409912, 98461075]
3491I8461075J1757j10985j11244j0018P0626J99836K22947J74263P0999j89614k13691
3502I8575951N241M7401k0889m5296p4768o7947j3977K266k7512J4687J63223J62674
3514I8721054K2530l9818r5535p7507N4664P2075r346k4582L220J602k5513k1652J3756
3527I8594948K1889Q224R422L212M1992J66626J60866M5014m6280j98151k04727m0985
3539I8562050j3184j03019p7538N0499R8946J16539R0194o134n5191r2865r3055n4337
3551I8422905q820P1221J06834J20323J01311L6759j0987r0980o9428Q7738J10245
3562I8877121K8343q720k7275p1671j76170j59500P942K6298j13655p5393J63391J76719
3574I8647430o439p6248j12793j05911l0586K693N058M2412J29555J41380R8015M3823
$$ y = [98461075, 98472832, 98361847, 98250603, 98240585, 98311211, 98511047, 98733994, 98908257, 98979256, 98789642, 98575951, 98581192, 98628593, 98607704, 98562408, 98487640, 98419693, 98405716, 98407982, 98380470, 98395157, 98558380, 98721054, 98743584, 98703766, 98608231, 98530724, 98585388, 98657463, 98648117, 98623535, 98626755, 98628357, 98602844, 98581192, 98594948, 98616837, 98625061, 98634483, 98637695, 98679687, 98846313, 99007179, 99052193, 99005913, 98807762, 98603035, 98562050, 98548866, 98445847, 98368309, 98418808, 98517754, 98634293, 98724487, 98718353, 98663162, 98570297, 98477242, 98422905, 98414085, 98485306, 98592140, 98712463, 98813774, 98850533, 98839546, 98748566, 98679138, 98766876, 98877121, 98905464, 98896744, 98869469, 98797798, 98621628, 98462128, 98470070, 98496368, 98382713, 98307320, 98470711, 98647430, 98640991, 98564743, 98451950, 98346039, 98315453, 98318146, 98323204, 98365616, 98495171, 98636551, 98734566, 98778389]
3586I8778389o8329r4322m3007k3224n623J282J4687k5673j64704j62697l0036L5049
3598I8211792J00777R2384j8097m4250l2540J6258J51703J76361J07933P2739N2529
3609I8887589o012j34156j53595n4573Tj42021j45943q5350n5076o5323J9409K67410
3621I8277786K70027L6477o1722j10054j38161j40717j09527K853j854j55761j32302
3632I7737045O6353J21979Q9287O7474L548R918Q3687J23672J86394J46599k2385q8882
3644I8524689r9472r9747o2279n1544o1539n1994j3832k3773q6922j06125j11526p9758
3656I7676178J6861M4319p63K8992J46583J52466N7533J7594N49k1080o5849l2257
3668I8021126J15318J32538O6948k7626k49130k59949n5115P767k144m005l5859k6512
$$ y = [98778389, 98710060, 98615738, 98572731, 98549507, 98543884, 98545166, 98559853, 98534180, 98369476, 98206779, 98176743, 98211792, 98312569, 98404953, 98386856, 98342606, 98310066, 98326324, 98478027, 98654388, 98762321, 98835060, 98887589, 98881577, 98747421, 98593826, 98539253, 98484680, 98342659, 98196716, 98111366, 98056290, 97990967, 98010376, 98277786, 98547813, 98584290, 98522568, 98412514, 98274353, 98133636, 98024109, 98026962, 98025108, 97869347, 97737045, 97803398, 97925377, 98014664, 98082138, 98085686, 98095604, 98179291, 98302963, 98489357, 98635956, 98613571, 98524689, 98425217, 98325470, 98263191, 98211647, 98150108, 98098114, 98084282, 98060509, 97973587, 97867462, 97755936, 97676178, 97693039, 97737358, 97736595, 97765587, 97912170, 98064636, 98122169, 98139763, 98140312, 98119232, 98053383, 98021126, 98136444, 98268982, 98335930, 98308304, 98059174, 97799225, 97744110, 97751877, 97749733, 97745728, 97709869, 97683357]
3680I7683357L1708L6835J0849l2471j38138j40121l6194j427K289k548l3715m2633
3692I7337791l4187l7742n5047m9858l3760L342P1335J20445K06757J55548o7955j50086
3704I7466583j84845j10031J54640K25548J61217J10939J8883m1130j11725r6512N5008
3715I7648575M4418j34041j59218r2407r872J63864K02866J18805R0652O6254P5218
3726I8015114J66443J14486j15699j58577n6954n249P4791O4423p9895o5445J19423
3737I8072861J35086m982j5022J11465O2462k24899j87088K30407K45857r5367j93092
3748I8137688j72257j33323k1080M3968J03569J11007O6712J5327r1194j05385k6390
3759I7928642n386N577l4264j90849j59698P1502J48873J55021J13343l8338p5035
$$ y = [97683357, 97715065, 97751900, 97762749, 97730278, 97592140, 97452019, 97415825, 97414398, 97416687, 97414139, 97380424, 97337791, 97303604, 97265862, 97210815, 97160957, 97127197, 97130539, 97201874, 97322319, 97529076, 97684624, 97616669, 97466583, 97281738, 97171707, 97326347, 97551895, 97713112, 97824051, 97842934, 97801804, 97690079, 97593567, 97648575, 97692993, 97558952, 97399734, 97307327, 97297455, 97461319, 97664185, 97782990, 97873642, 97939896, 98015114, 98181557, 98296043, 98180344, 98021767, 97964813, 97959564, 98034355, 98098778, 98018883, 97953438, 98072861, 98207947, 98202965, 98187943, 98299408, 98361870, 98136971, 97949883, 98180290, 98426147, 98330780, 98137688, 97965431, 97832108, 97811028, 97854996, 97958565, 98069572, 98136284, 98151611, 98060417, 97955032, 97928642, 97923256, 97928833, 97894569, 97703720, 97544022, 97615524, 97764397, 97919418, 98032761, 97994423, 97919388]
3770I7919388k0500m769l433J5663P6416N0781q3015j10054p0099j9073J02638J12343
3782I7966286J7814k9472o9641r3605j37993o5422J79649K37725J42906J18278J29036
3793I8395561R1004m837l8414m1268p438J09863J17325K5299j4641k7657o4727j71692
3805I8368378j14487J55785K09259R9067M2458l9696m8279K1668N1094Q1497O5590
3816I8892334L2394q7112m08173m00978o9259P1884J53663J66176M7943N4673J60240
3827I8613785K13287K86392K40372O0226n4786j96243j97175K572m715k06734k45026
3838I8511955k02156j06621J05126K07298K66625K41851Q4710K9396N8654O989r7756
3849I9106071k01606m10057l55454j7219J54327L19107K87575l2807q2443J10054R9182
$$ y = [97919388, 97898888, 97894119, 97890686, 97906349, 97982765, 98033546, 97950531, 97840477, 97770378, 97751305, 97853943, 97966286, 97984100, 97954628, 97884987, 97791382, 97653389, 97587967, 97767616, 98005341, 98148247, 98266525, 98395561, 98486565, 98481728, 98443314, 98402046, 98394608, 98504471, 98621796, 98647095, 98632454, 98604797, 98540070, 98368378, 98253891, 98409676, 98618935, 98718002, 98760460, 98720764, 98672485, 98694153, 98745247, 98826744, 98892334, 98924728, 98837616, 98429443, 98028465, 97959206, 98031090, 98184753, 98350929, 98398872, 98453545, 98613785, 98827072, 99113464, 99353836, 99414062, 99359276, 99163033, 98965858, 98968430, 98963715, 98756981, 98511955, 98309799, 98203178, 98308304, 98515602, 98782227, 99024078, 99108788, 99138184, 99196838, 99203827, 99106071, 98904465, 98494408, 98138954, 98121735, 98276062, 98595169, 98882744, 98849937, 98767494, 98877548, 98976730]
3860I8976730p2288j30150j53999r9655R0667J41381R3536N8411m319m4677q9264q1917
3872I8684456j8791K8488J02211J04622L2257l288l3951m3801r079m0771j84731j46629
3884I8470993J02882J51848M3633J6449J6166K0813N5458M1527k8778m5677k7824j0559
3896I8806931J8165M5250J05217P2739o4156j32202k02255j64147J6068R2247J11290
3907I8705147J31561J57402J12991m776j07711k85271k68127l8811O3156J26938J35322
3918I8727821O1158L0113K7626j3924j14174j27296o6345k4918L7598N2093K4796r2
3930I8614456m7302o2492o5041l2021P3197Q0986l5996J023K41111K09168j05072j85562
3942I8686455j38260n5527J50993K20032K22809J35445j24359k03637j70967j05262
$$ y = [98976730, 98904442, 98774292, 98620293, 98520638, 98611305, 98752686, 98846222, 98904633, 98900314, 98855637, 98766373, 98684456, 98665665, 98694153, 98796364, 98900986, 98933243, 98929955, 98896004, 98852203, 98843124, 98802353, 98617622, 98470993, 98573875, 98725723, 98769356, 98785805, 98801971, 98822784, 98878242, 98919769, 98890991, 98845314, 98817490, 98806931, 98825096, 98870346, 98975563, 99048302, 98984146, 98851944, 98649689, 98485542, 98501610, 98593857, 98705147, 98836708, 98994110, 99107101, 99102325, 98994614, 98709343, 98441216, 98402405, 98465561, 98592499, 98727821, 98788979, 98819092, 98846718, 98832794, 98718620, 98591324, 98524979, 98500061, 98537659, 98589752, 98614548, 98614456, 98567154, 98504662, 98439621, 98407600, 98480797, 98561783, 98525787, 98526810, 98767921, 98977089, 98872017, 98686455, 98548195, 98492668, 98643661, 98863693, 99086502, 99221947, 99097588, 98893951, 98722984, 98617722]
3952I8617722R7656R9991j10176j47553q1039k0722J22788J01852j17706j51680m8424
3963I8362709J259N1002P6867Q0825P8965N4191N8747J32583O3469j98845k41402j12724
3975I8407646l1776Q3992J23314Q9813Q0055P2121N6915L8529R605l6240o6421j16921
3987I8710632p6675Q3397J35826J40594Q4900r3742j32729o1485k4940K1217M4395
3998I8831390O0128L8696
4000I8930214
$$ y = [98617722, 98715378, 98815369, 98705193, 98557640, 98476601, 98455879, 98578667, 98680519, 98562813, 98411133, 98362709, 98363968, 98414970, 98491837, 98572662, 98651627, 98705818, 98764565, 98897148, 98960617, 98761772, 98520370, 98407646, 98375870, 98459862, 98583176, 98672989, 98753044, 98825165, 98882080, 98920609, 98930214, 98893974, 98827553, 98710632, 98633957, 98717354, 98853180, 98993774, 99078674, 98984932, 98852203, 98790718, 98765778, 98786995, 98831390, 98891518, 98930214]
##END=$$ End of the data block
