##TITLE=$$ Begin of the data block
##JCAMP-DX=5.00 $$ ACD/SpecManager v 10.08
##SPECTROMETER/DATA SYSTEM=Alpha
##DATE=26 Dec 2014 10:25:20
##DATA TYPE=INFRARED SPECTRUM
##DATA CLASS=XYDATA
##ORIGIN=
##OWNER=
##NPOINTS=1765
##FIRSTX=399.76428223
##LASTX=3997.64306641
##MAXX=3997.64306641
##MINX=399.76428223
##MAXY=0.77189994
##MINY=0.14801720
##XFACTOR=1.0000000000
##YFACTOR=1.000000000000000e-9
##FIRSTY=0.41483963
##DELTAX=2.03961372
##XUNITS=1/CM
##YUNITS=ARBITRARY UNITS
##XYDATA=(X++(Y..Y))
399.8 414839625 409462720 406415313 405176491 405227423 406155080 407466352 409114778 410922706 411993176
418.1 411993176 411463171 409623086 406902075 404151767 402038723 399755865 396347195 392580330 390455693
436.5 390455693 391276062 394697785 399297595 403874338 408224344 412410527 416135728 418574035 418952107
454.8 418952107 417550594 415724993 414491028 413042605 410304725 406148285 401668161 398102015
471.2 398102015 395558357 393305331 390752196 388384283 387126356 387072027 387549609 387680411 386975288
489.5 386975288 385664493 384509265 383688658 382348627 379903436 376708120 373813808 371629655 369233847
507.9 369233847 365819842 361496449 356923580 352484286 348232478 344336718 340792090 337773710
524.2 337773710 336103857 336306214 337478995 338665009 340274304 343596309 349308580 356324613 362380326
542.5 362380326 365918696 367103457 367179662 366929591 366061091 363878548 360241294 355923653 351565808
560.9 351565808 346822619 341028810 333866805 326142818 319891751 316669464 316540062 318655968 322400063
579.3 322400063 327960193 335421801 343776584 351267517 356498867 359397024 360923558 362026423
595.6 362026423 362846971 362912178 362085789 361053228 360824466 361734480 363134563 364302248 365294129
613.9 365294129 366848379 369795591 374055564 378478497 382209420 385459870 388888747 392619252
630.2 392619252 396072477 398440540 399595678 400466472 401962906 403951347 405605495 406435698 406826317
648.6 406826317 407606989 409182549 411126673 412497431 412896723 413099378 414130211 415850997 417383820
667 417383820 418251395 419118524 420529455 422651738 425238788 427456379 428686559 429367810 430436999
685.3 430436999 431995392 433182687 433176249 431935251 430010140 427874714 425536871 422588885 418916970
703.7 418916970 415407419 413503528 413926750 416158587 419211179 422739357 427198350 433170229 440482408
722 440482408 448024601 454639673 460128158 465432137 471150249 476465136 480213642 482208908 483162701
740.4 483162701 483783871 484097660 483168632 479951918 474696696 468930304 463811100 459113806 454106718
758.7 454106718 448949426 444849283 443122566 444417745 448473573 454384923 461483866 470042467
775.1 470042467 480539203 492116779 502608597 510676503 516967058 522814214 528817773 534528315
791.4 534528315 539233923 542995572 546893239 552113831 558446229 564142585 567777157 569794118
807.7 569794118 571736991 574321091 576739907 577811003 577277780 576030910 574985325 573909163 571554661
826 571554661 566954136 560568273 553839564 547742903 541924357 535472989 528360844 521643698 516232729
844.4 516232729 511951268 507786632 502806962 496902734 490700155 484865725 480024636 477621913
860.7 477621913 479610294 486816078 498533070 513324857 529213369 543685555 554816306 562210143
877 562210143 566283166 567062676 564134836 557755709 549425066 540944457 533244193 526100934 518887103
895.4 518887103 511471212 504209936 497346014 490486801 482709914 473314166 462429017 450772226
911.7 450772226 438907981 427098066 415806502 406001002 398733020 394440293 392673671 392463386
928 392463386 393095076 394500852 396992654 400759906 405622900 411153555 416581452 420488805 421102762
946.4 421102762 417252243 408899724 396807790 382073790 365864068 349041522 331876636 314255297
962.7 314255297 296142429 277773440 259505033 241672844 224532455 208307520 193338484
977 193338484 180103108 169138536 160767347 154881671 151082009 148906082 148017198 148144528 148992643
995.3 148992643 150281876 151754618 153174520 154373467 155269086 155830175 156065121 156073272 156080708 156395867
1015.7 156395867 157299429 158801347 160718665 162952840 165500984 168354675 171413362 174404219
1032 174404219 176934779 178728491 179779083 180357218 180771276 181197137 181742474 182598650 184179947
1050.4 184179947 186970428 191119105 196357980 202423185 209377289 217449278 226146296 233436242
1066.7 233436242 236224920 232653230 224350870 215402573 209004864 205843166 205179691 206275135
1083 206275135 208750069 212315828 216681778 221603468 226753399 231716022 236021370 239185736 240974009
1101.4 240974009 241688222 242129073 243259549 245628685 249043778 252846748 256365299 259242505 261509269
1119.8 261509269 263369620 265038520 266893268 269486964 273145556 277492940 281386703 283379644
1136.1 283379644 282479256 278676152 272802234 265962720 259008199 252445996 246628791 241912052
1152.4 241912052 238602266 236736476 236103028 236543000 238165796 241338447 246493161 253797174 263016522
1170.7 263016522 273699075 285468996 298098385 311443180 325206667 338774383 351545274
1185 351545274 363164246 373418629 382086039 388890445 393691570 396816969 399036825 401107490
1201.3 401107490 403405875 405982316 408917576 412534446 417209297 422969162 429260731 435145795
1217.7 435145795 439838171 443083853 445040643 445865929 445549995 444137752 441979080 439690024 437729180
1236 437729180 436106414 434633136 433397233 432859540 433451951 435144186 437435061 439754963 441803426
1254.4 441803426 443576574 445162773 446534306 447652042 448729664 450206041 452401102 455136716
1270.7 455136716 457699627 459332854 459803313 459474176 458903521 458378345 457812548 457002938 455911249
1289 455911249 454679817 453356028 451717496 449522913 446871966 444133908 441622734 439370900 437176436
1307.4 437176436 434978396 432959318 431291342 429990143 428815156 427386433 425335914 422276467
1323.7 422276467 418010890 412753314 406962842 401167989 395938009 391711652 388674885 386972368
1340 386972368 386535913 386769295 387143463 387452394 387581497 387449205 386945665 386066884 384980828 383773416
1360.4 383773416 382520825 381654263 381174326 380792707 380796164 381318688 382223338 383375674 384519726
1378.8 384519726 385601729 387076437 389567465 393388331 397828907 401534289 403890967 404844075
1395.1 404844075 404784054 403991073 402837932 401326329 399150699 396861851 394681036 392362475 390198618
1413.5 390198618 388464987 386712700 385055959 384613097 385007590 385709196 386690766 387879908 389505625
1431.8 389505625 391444713 393282682 395238876 397412956 399522752 401333362 402510613 402680457
1448.1 402680457 402064770 401141882 399942428 397380918 394266844 393838525 394948572 396908164 400464296
1466.5 400464296 405641198 412442565 421953797 432676882 442555428 451745480 460546076 469017833
1482.8 469017833 476668030 483728051 490854770 498133928 504459143 509875357 515122235 520241857
1499.1 520241857 525145948 529597163 533393383 536901355 540510654 544005632 547372758 550455213
1515.4 550455213 553318381 555819750 558108032 560699880 563360870 565901041 568173051 569923520
1531.8 569923520 571402252 573347032 575159013 575776815 575721145 576238573 577095509 577804685 577999413
1550.1 577999413 577770472 577262342 576418161 573737860 570345461 569342315 568026304 565813899 562885940
1568.5 562885940 559512734 557237625 554654241 550241649 546743035 544517517 542096496 539441049
1584.8 539441049 536624491 533708513 530913234 528371215 525894105 523338616 520675182 517882228
1601.1 517882228 515169501 512653112 510043442 507054865 504083395 501481473 498288125 494257241
1617.4 494257241 491689414 489597172 486489505 483570904 481110930 478928626 477589190 476245850
1633.7 476245850 473847032 472485602 472747862 473440111 474122524 474469006 475533903 477738857 479707122
1652.1 479707122 481887311 485191554 488652557 492165267 496068925 500553846 504972458 509342134
1668.4 509342134 514385819 519684732 525283635 531428754 537324071 542815089 548338950 555104494
1684.7 555104494 561861157 567626476 573186636 578143775 582773924 587523937 591709912 595556796
1701.1 595556796 599000812 601827264 604580462 607409894 610096276 612453520 614310265 616117954
1717.4 616117954 618788660 621765077 624374270 626732647 628961384 631238878 633440912 635281980
1733.7 635281980 637409329 639662027 641695917 643993080 646790743 649863601 652988553 656375825
1750 656375825 660497069 664794564 668824017 672633886 675979733 679093003 682230473 685116231 687641978
1768.4 687641978 689678371 691322565 693268538 695462584 697440743 699121475 700617909 701991260
1784.7 701991260 703478873 705095470 706382692 707443297 708749354 710116506 711309254 712493837
1801 712493837 713874459 715254188 716414869 717374086 718374491 719573796 720746636 721685112 722552478
1819.4 722552478 723470449 724325776 725182176 726003230 726504743 727070868 727978826 728828013 729545534 730226040
1839.8 730226040 730629623 730595469 730812371 731540024 732246399 732715130 733000278 733300984 733703792 734150112
1860.2 734150112 734533489 734819591 734916687 734860420 735203266 735985875 736637115 736984551 737298310 737777650
1880.5 737777650 738399148 739035010 739512861 739727736 740022540 740614235 741173565 741582036 741865933 742035508
1900.9 742035508 742223978 742544949 742854774 742974460 743025064 743198395 743454933 743655801 743887126 744068265
1921.3 744068265 744101048 744291604 744708359 745121837 745365679 745411038 745406449 745567262 745869219 746061146
1941.7 746061146 746156394 746312082 746520698 746844947 747289598 747689724 747913361 748022974 748233795 748651922
1962.1 748651922 749090910 749278963 749304831 749443054 749747217 750134945 750455797 750592530 750606179 750676632
1982.5 750676632 750867903 751102805 751255751 751199543 751075447 751157641 751393139 751586854 751596928 751414418
2002.9 751414418 751194835 751041114 750942886 750773787 750403166 749844611 749265194 748830557 748441339 747860074
2023.3 747860074 747102678 746467710 746075809 745774567 745405436 744895458 744278967 743678570 743229449 742924631
2043.7 742924631 742628336 742264569 741880119 741607428 741538227 741592169 741617858 741551280 741447270 741428494
2064.1 741428494 741577804 741803527 741903484 741853476 741802454 741864443 742025673 742171586 742208123 742160738 742178679
2086.6 742178679 742354095 742604673 742774189 742819488 742872119 743069470 743393421 743705034 743886769 743946075
2106.9 743946075 744017601 744220018 744506836 744726598 744774878 744687974 744654834 744784117 744941592 744961083
2127.3 744961083 744853497 744751394 744778812 744945943 745104969 745109737 744974852 744861245 744912863 745108068
2147.7 745108068 745301008 745383024 745381713 745451212 745738924 746165633 746538043 746808350 747075379 747506320
2168.1 747506320 748175740 748917341 749514639 749985099 750508368 751204967 752002120 752703011 753229737 753683805
2188.5 753683805 754199207 754818678 755445898 755948424 756313562 756657004 757139921 757790148 758433819 758916557
2208.9 758916557 759292006 759722173 760302246 760973990 761541307 761891544 762150824 762518525 763040662 763560534
2229.3 763560534 763890266 764050364 764231384 764573574 765036762 765423000 765616357 765708864 765874445 766172171
2249.7 766172171 766524792 766823649 766980171 767081380 767342627 767768979 768131256 768302321 768383563 768534064
2270.1 768534064 768846035 769268692 769603729 769731522 769782245 769974768 770360649 770742178 770891368 770814061
2290.5 770814061 770728171 770828366 771104395 771352291 771366119 771221220 771205783 771429896 771692812 771765530
2310.9 771765530 771667898 771586061 771627963 771779537 771899939 771786630 771543264 771446705 771477163 771393955 771146715
2333.3 771146715 770850599 770521998 770170748 769867182 769489288 769003272 768826962 768998086 769241452 769378483
2353.7 769378483 769245803 768827558 768290937 767785192 767398298 767095506 766610503 765878141 765268803 764963329
2374.1 764963329 764772654 764533639 764261067 764048755 763940215 763864994 763721049 763430774 762974441 762482166
2394.5 762482166 762128890 761907279 761632085 761186540 760656476 760170639 759748995 759311140 758745193 758012593
2414.9 758012593 757217884 756516695 755918562 755281568 754504442 753631234 752786160 752027690 751306951 750515461
2435.3 750515461 749573708 748556316 747645795 746877909 746114850 745252728 744303584 743374586 742566109
2453.7 742566109 741850138 741075397 740155756 739215970 738433301 737770736 737059891 736242533 735370874 734529376
2474.1 734529376 733790100 733152807 732475102 731659591 730837345 730146348 729561329 729005873 728448749 727870703
2494.5 727870703 727288663 726785243 726370096 725919902 725364387 724796534 724328578 723913908 723435223 722868741
2514.9 722868741 722250164 721627057 721056163 720536351 719944596 719168663 718266845 717400730 716614783 715810359
2535.3 715810359 714947581 714048266 713127375 712233722 711402953 710563540 709618151 708618522 707704067 706868768
2555.6 706868768 705999494 705111682 704244912 703331351 702376306 701504290 700757563 699983120 699059486 698104739
2576 698104739 697253108 696457088 695630729 694790363 694001734 693288386 692636788 692021728 691404581 690756261
2596.4 690756261 690095603 689451873 688806355 688117206 687359273 686532497 685661614 684753895 683773458 682690322
2616.8 682690322 681486249 680179536 678880930 677628517 676309466 674850523 673310757 671790481
2633.2 671790481 670285523 668741405 667185426 665640712 664064825 662461042 660893679 659370840
2649.5 659370840 657854736 656336486 654833317 653373539 651942551 650509238 649110675 647733271
2665.8 647733271 646323383 644950092 643639982 642312229 640986681 639766753 638663113 637583554
2682.1 637583554 636435568 635209918 633991420 632809579 631597638 630331337 629029453 627723157
2698.4 627723157 626413941 625043809 623615444 622181118 620749831 619314253 617893219 616515398
2714.7 616515398 615177631 613852203 612550974 611318409 610152364 609037101 607966304 606921256
2731.1 606921256 605882108 604855120 603885174 602951229 601986110 600993335 599999368 599047005 598186493
2749.4 598186493 597381473 596574068 595751882 594914615 594099700 593363822 592656732 591872811 591043413 590248585
2769.8 590248585 589427590 588492095 587463796 586377800 585262537 584136963 582922757 581551492 580081761
2788.2 580081761 578584254 577044308 575428307 573704720 571878672 569999516 568074703 566070497
2804.5 566070497 563953459 561691344 559304833 556879938 554477930 552082181 549590349 546936750
2820.8 546936750 544171453 541351914 538478076 535527408 532487094 529331744 526054084 522678792
2837.1 522678792 519160092 515383124 511290252 506899118 502297759 497659266 493236572 489312708
2853.4 489312708 486004680 483193874 480586737 477789462 474487275 470561296 466022670 460971981
2869.7 460971981 455621839 450162351 444692194 439367175 434454739 430207223 426731229 423965961
2886.1 423965961 421819925 420270771 419237554 418528199 417913228 417216271 416380733 415362298 414071172
2904.4 414071172 412452638 410500377 408140600 405229390 401766747 397936165 393928975 389924139
2920.7 389924139 386223048 383178025 381008595 379847169 379795074 380871654 383046597 386294395 390503347
2939.1 390503347 395425588 400829881 406548649 412399948 418266177 424169213 430125982 436064392
2955.4 436064392 441913337 447664082 453279823 458603680 463513255 468028069 472241133 476254612
2971.7 476254612 480139583 483935833 487665504 491272569 494597256 497573972 500274956 502705097
2988 502705097 504815102 506580949 507987142 509115219 510046005 510685503 510921001 510760963 510319769
3006.4 510319769 509709895 508899152 507766902 506274164 504517913 502633452 500674546 498591363 496300817
3024.7 496300817 493817270 491274506 488761812 486251622 483620673 480831951 478040993 475290298
3041.1 475290298 472484618 469607949 466653943 463670224 460749447 457862109 454953521 451989114
3057.4 451989114 448969036 445974737 443071932 440272063 437458277 434491366 431462944 428543359
3073.7 428543359 425796956 423164785 420430064 417503655 414556652 411699265 408922553 406186700
3090 406186700 403379381 400497109 397719413 395142108 392621785 389973819 387252569 384642571 382143855
3108.4 382143855 379608750 377088994 374703676 372346193 369903386 367351979 364758074 362250835
3124.7 362250835 359854013 357507676 355141729 352778405 350557864 348492533 346379220 344090521
3141 344090521 341780186 339605629 337522775 335518897 333594769 331602871 329504371 327446699 325471640
3159.4 325471640 323544562 321663320 319808155 317982882 316210806 314478546 312770844 311069220
3175.7 311069220 309343159 307672203 306120783 304606795 303082019 301590055 300129503 298654288
3192 298654288 297164768 295677215 294237405 292903930 291657329 290433258 289193034 287914902 286615491
3210.3 286615491 285362631 284200281 283102036 281994998 280857891 279717237 278608143 277581573
3226.7 277581573 276636809 275757402 274920642 273978263 272911876 271919787 271040887 270184427 269330591
3245 269330591 268467814 267577201 266752422 266075611 265436262 264685512 263850570 263079971 262412071 261775672
3265.4 261775672 261175781 260671288 260179758 259568214 258844495 258105189 257442117 256836861 256238669 255690396
3285.8 255690396 255199164 254748076 254318744 253830820 253247559 252594262 251947612 251428992 251069188 250686765
3306.2 250686765 250069886 249264672 248466715 247770056 247136414 246515751 245895565 245292410 244727477 244117513
3326.6 244117513 243416041 242728442 242101178 241539627 241046742 240498841 239831507 239110261 238353878 237672567
3347 237672567 237183169 236680850 235945731 235128701 234459147 233914763 233372152 232835859 232411057 232036382
3367.4 232036382 231484324 230683804 229869425 229275033 228818387 228340283 227787271 227255166 226900890 226769492
3387.8 226769492 226775751 226647750 226210162 225718960 225548074 225612298 225423321 224888027 224447504 224271998
3408.2 224271998 224208757 224142835 223927811 223588526 223351717 223263323 223257244 223340809 223511323 223734647 223900199
3430.6 223900199 224054903 224334523 224558070 224530011 224427477 224510729 224766180 225044012 225319237 225642204
3451 225642204 226000145 226404533 226920873 227530062 228035450 228500441 229222819 230089426 230707154 230943859
3471.4 230943859 231130749 231581166 232319817 233067036 233530417 233988136 234697536 235398754 236002013 236709356
3491.8 236709356 237529427 238367096 239173204 239939108 240597337 241122365 241708905 242418051 243215397 244172439
3512.2 244172439 245111465 245863825 246622011 247552454 248581991 249449775 250107884 250801712 251723826
3530.6 251723826 252861410 254050136 255117536 256151229 257413894 258754611 259789884 260625452
3546.9 260625452 261726916 262968123 264171362 265607178 267278761 269017160 270862073 272675961
3563.2 272675961 273996800 275230557 277354270 279881030 282179862 284465075 286906540 289513230
3579.5 289513230 292401373 295371681 297770739 299742430 302570701 305890858 308860332 311862856
3595.8 311862856 315252483 318660140 322111100 325749159 329074234 332100481 335447699 339104027
3612.1 339104027 342984498 346806407 350151271 353870571 358338892 362753749 366190732 368685335
3628.5 368685335 372443229 377150834 381498277 385635525 389695317 393773794 398109972 402365386
3644.8 402365386 405676275 408294141 412325710 417290002 421429306 425348699 429747671 433849871
3661.1 433849871 437649131 441658825 445228159 447885782 451268733 454719752 456784278 459686697
3677.4 459686697 463677824 467530906 471310854 474729478 477020651 478474230 480836034 484044820
3693.7 484044820 487117678 489721268 491647929 493249327 495603055 498423636 500561595 501472116
3710 501472116 502318919 504732549 507601559 509845138 511487305 512849092 514114857 515674710 517950892
3728.4 517950892 520139337 521295965 521524906 522384286 524842858 527434766 528158963 527905166 529628038
3746.7 529628038 531043828 530744076 531773210 534289598 536182702 537177324 538544238 540205002 541379571
3765.1 541379571 542292655 542993307 543983698 545665801 547299087 548302352 548912048 549857557 550831258
3783.5 550831258 551621377 552684426 553950250 555296540 556408584 557110727 557985783 558354676 558343947
3801.8 558343947 559566736 560450375 560918331 562511444 564361989 565100789 565178931 565866113 565838039
3820.2 565838039 565913439 567411542 568795204 569844425 570630729 571335077 572281361 572507083 572037816
3838.5 572037816 572405457 573416710 574668407 576375663 578146577 578489780 576017022 574807644 577072859
3856.9 577072859 579335392 580371559 580423117 580784500 581615865 581582665 581526697 582276702 583459854 584644020
3877.3 584644020 584904730 585170925 585833251 586002886 586633801 587228894 587108374 587773740 589118898
3895.6 589118898 589682460 589290380 588649511 588329375 588965893 590167761 591038644 591660738 592144787
3914 592144787 592142880 592042863 592431307 592794657 592809498 593115151 593689024 593788087 593648434 594024956 594692528
3936.4 594692528 595204771 595429182 595461965 595716238 596031368 596129596 596345782 596739292 597051978 597268522
3956.8 597268522 597500026 597718954 597980440 598330021 598591626 598746896 598946333 599183202 599403679 599636495
3977.2 599636495 599827349 600012004 600280583 600505948 600606740 600681126 600798011 600964665 601201057 601502836
3997.6 601502836
##END=$$ End of the data block
