##TITLE=$$ Begin of the data block
##JCAMP-DX=5.00 $$ ACD/SpecManager v 10.08
##SPECTROMETER/DATA SYSTEM=Alpha
##DATE=26 Dec 2014 10:25:20
##DATA TYPE=INFRARED SPECTRUM
##DATA CLASS=XYDATA
##ORIGIN=
##OWNER=
##NPOINTS=1765
##FIRSTX=399.76428223
##LASTX=3997.64306641
##MAXX=3997.64306641
##MINX=399.76428223
##MAXY=0.77391356
##MINY=0.14819114
##XFACTOR=1.0000000000
##YFACTOR=1.000000000000000e-9
##FIRSTY=0.41650456
##DELTAX=2.03961372
##XUNITS=1/CM
##YUNITS=ARBITRARY UNITS
##XYDATA=(X++(Y..Y))
399.8D16504562n400002l484339j560390P0393J047135J642942K086520J906664P37965
418.1D13551450j087219j983136k452969k516777k128481k586097l832668m050672
434.4C92913431k149373Q80181L519297N071044N047709M243493L829956L488034K160966
452.8D19004738J36882j257985j613051j194269j399934k786457m208178m439682l604769
471.2C98637295k649427k323776k642512k446145j164943J92403O14286L2216p74830
489.5C87474567j179993j082749q51035j225441k287835l135652k882808k190650k468556
507.9C70169848l698617m676819m654109m232347m091233l925890l461540k819240
524.2C38610053j737118j8477J203805J318842J548112L176361N698025P147968O175190
$$ plain form
399.8 416504562 411104560 407620221 406059831 406130224 407177359 408820301 410906821 412813485 413551450
418.1 413551450 412464231 410481095 408028126 405511349 403382868 400796771 396964103 392913431
434.4 392913431 390764058 391644239 395163536 400234580 405282289 409525782 413355738 416843772 419004738
452.8 419004738 419141620 417883635 416270584 415076315 413676381 410889924 406681746 402242064 398637295
471.2 398637295 395987868 393664092 391021580 388575435 387410492 387602895 388217181 388249397 387474567
489.5 387474567 386294574 385211825 384360790 383135349 380847514 377711862 374829054 372638404 370169848
507.9 370169848 366471231 361794412 357140303 352907956 348816723 344890833 341429293 338610053
524.2 338610053 336872935 336854458 338058263 339377105 340925217 344101578 349799603 356947571 363122761
542.5C63122761L543765J128703n037k50101p87943k199173l689289m360050m378349
560.9C52125287m681736n795330p205993p679969o191671l230959k09451K006024L676415
579.3C22812617N653620P677733Q469582P459462N132109K800047J552820J220167
595.6C62778157Q26180l2157q23229r83775l36647P31289J352281J221239J070202
613.9C65803540J671791L009111M222691M366606L659695L249377L549576L778488
630.2C93310875L375649K322465J172453Q96484J492500J951993J700491R75221M59373
648.6D07657504P47174J543909J938641J369060L77357J46985R33855J617551J511097
667D17843133J056075J094640J485914K072990K525270K180397J207054P01099J146108
$$ plain form
542.5 363122761 366666526 367795229 367790192 367540091 366752148 364552975 360863686 356503636 352125287
560.9 352125287 347443551 341648221 334442228 326762259 320570588 317339629 317130178 319136202 322812617
579.3 322812617 328466237 336143970 344613552 352073014 357205123 360005170 361557990 362778157
595.6 362778157 363604337 363572180 362748951 361765176 361428529 362159818 363512099 364733338 365803540
613.9 365803540 367475331 370484442 374707133 379073739 382733434 385982811 389532387 393310875
630.2 393310875 396686524 399008989 400181442 401077926 402570426 404522419 406222910 407198131 407657504
648.6 407657504 408404678 409948587 411887228 413256288 413633645 413780630 414714485 416332036 417843133
667 417843133 418899208 419993848 421479762 423552752 426078022 428258419 429465473 430166572 431312680
685.3D31312680J699716J295388r2507j464009k034932k091944k351582l035337l704012
703.7D19533461l503292j874865M85748K306045L133088L568441M456818O019920P371634
722D41496998P534534O642312N505025N172670N593747N327225L795921K023131J030892
740.4D84122455P11233K53766j071125l245443n248159n806416n105645m624844m971742
758.7D55014080n190522m124283j706332J310020M045815N887627P113099Q636445
775.1D70985949J0566235J1601716J0500520Q029104O207108N806685O019771N750239
791.4E35467327M710555L717243L894747N268275O430209N786836L521443J806140
807.7E70602775J917719K718807K520442J071930n99027j323760j071155j074671k408743
$$ plain form
685.3 431312680 433012396 434307784 434215277 432751268 430716336 428624392 426272810 423237473 419533461
703.7 419533461 416030169 414155304 414641052 416947097 420080185 423648626 428105444 434125364 441496998
722 441496998 449031532 455673844 461178869 466351539 471945286 477272511 481068432 483091563 484122455
740.4 484122455 484833688 485087454 484016329 480770886 475522727 469716311 464610666 459985822 455014080
758.7 455014080 449823558 445699275 443992943 445302963 449348778 455236405 462349504 470985949
775.1 470985949 481552184 493153900 503654420 511683524 517890632 523697317 529717088 535467327
791.4 535467327 540177882 543895125 547789872 553058147 559488356 565275192 568796635 570602775
807.7 570602775 572520494 575239301 577759743 578831673 578232646 576908886 575837731 574763060 572354317
826E72354317m713238o478309o744504o082773n846024o480157p108450o758392n482912
844.4E16659558m310250m181624m957437n795360o116092n828381m834860k396018
860.7D78239536J955003P205665J1781901J4824808J5838980J4386356J1079967P386565
877E62698781M035116P05003k934873o317198q312642q546412p824600p265389p272959
895.4E18964827p412434p222652o821215o843716p809043r441882j0916174j1690289
911.7D50807422j1868298j1752396j1233449r813279p288337m279047j750321j92046
928C92630249O48409J420886K483427L723622M854053N558163N424529L851622N45502
946.4D21140462l893792q393527j2144833j4754475j6165107j6754210j7155886j7659813
$$ plain form
826 572354317 567641079 561162770 554418266 548335493 542489469 536009312 528900862 522142470 516659558
844.4 516659558 512349308 508167684 503210247 497414887 491298795 485470414 480635554 478239536
860.7 478239536 480194539 487400204 499182105 514006913 529845893 544232249 555312216 562698781
877 562698781 566733897 567438900 564504027 558186829 549874187 541327775 533503175 526237786 518964827
895.4 518964827 511552393 504329741 497508526 490664810 482855767 473413885 462497711 450807422
911.7 450807422 438939124 427186728 415953279 406140000 398851663 394572616 392822295 392630249
928 392630249 393278658 394699544 397182971 400906593 405760646 411318809 416743338 420594960 421140462
946.4 421140462 417246670 408853143 396708310 381953835 365788728 349034518 331878632 314218819
962.7C14218819j8100977j8329710j8265158j7845779j7144010j6210034j4946401
977A93376750j3190672j0910288q350595n893618l816560k168536q55342J39952Q38190
995.3A49169281J283363J474484J425297J202151Q95291N63368K42919J267j7748L09751
1015.7A56549424R14484J506016J930997K254694K548084K846181L073037K999127
1032A74622044K486557J741916J069590O50406M59597M14699N14686Q40411J589849
1050.4A84389755K796739M152209N270347O093457O947622Q029580Q638144P238656
1066.7B33556509K759025l563270q267731q919477o398634l177374o53744J132831
1083B06468135K477914L541947M385247M949153N144209M924938M253432L165409J850784
$$ plain form
962.7 314218819 296117842 277788132 259522974 241677195 224533185 208323151 193376750
977 193376750 180186078 169275790 160925195 155031577 151215017 149046481 148191139 148331091 149169281
995.3 149169281 150452644 151927128 153352425 154554576 155449867 156013235 156256154 156257421 156239673 156549424
1015.7 156549424 157463908 158969924 160900921 163155615 165703699 168549880 171622917 174622044
1032 174622044 177108601 178850517 179920107 180570513 181030110 181444809 181959495 182799906 184389755
1050.4 184389755 187186494 191338703 196609050 202702507 209650129 217679709 226317853 233556509
1066.7 233556509 236315534 232752264 224484533 215565056 209166422 205989048 205335304 206468135
1083 206468135 208946049 212487996 216873243 221822396 226966605 231891543 236144975 239310384 241161168
1101.4B41161168P63580M51848J136183K380297L426015L793851L475875K846151K272338
1119.8B61707306J863450J668453J855165K552569L602743M329204L902316K018184
1136.1B83499390q90732l824145n878657o816387o911665o514400n789131m709810
1152.4B42164463l332019j883000o07118M78416J662046L199086N140140P261470R177745
1170.7B63261229J0678142J1802346J2658596J3340443J3740838J3560086J2744933
1185C51786613J1573017J0262758Q717090O827056M802495L124803K213628K080321
1201.3D01387781K337634K601177K912611L587842M682004N792052O303429N860687
1217.7D35465217M657805L215491J931996Q06182l19868j381338k105862k265304j964450
$$ plain form
1101.4 241161168 241924748 242376596 243512779 245893076 249319091 253112942 256588817 259434968 261707306
1119.8 261707306 263570756 265239209 267094374 269646943 273249686 277578890 281481206 283499390
1136.1 283499390 282608658 278784513 272905856 266089469 259177804 252663404 246874273 242164463
1152.4 242164463 238832444 236949444 236342326 236820742 238482788 241681874 246822014 254083484 263261229
1170.7 263261229 273939371 285741717 298400313 311740756 325481594 339041680 351786613
1185 351786613 363359630 373622388 382339478 389166534 393969029 397093832 399307460 401387781
1201.3 401387781 403725415 406326592 409239203 412827045 417509049 423301101 429604530 435465217
1217.7 435465217 440123022 443338513 445270509 446076691 445756823 444375485 442269623 440004319 438039869
1236D38039869j607358j443983j224249n43207N88953J711727K331555K329528K013385
1254.4D42196220J737327J563549J381248J148134J075298J465320K187610K695888
1270.7D55450594K527923J638144M93527l12955n73575n13137n36620q09103j086235
1289D56278563j202405j333415j665891k187788k653688k759666k489745k195388k160222
1307.4D37630355k199381k051860j705200j313478j197218j468212k062976l039867
1323.7D22592163m231900n221844n762726n785286n248278m244894l023535j708806
1340C87364894m77940K22653L95835L30895J40846j38343n26666q95560j081675j203627
1360.4C84131312j265347q71658m62770l75927j7941N20766R62347J207649J131505
$$ plain form
1236 438039869 436432511 434988528 433764279 433221072 433810025 435521752 437853307 440182835 442196220
1254.4 442196220 443933547 445497096 446878344 448026478 449101776 450567096 452754706 455450594
1270.7 455450594 457978517 459616661 460110188 459797233 459223658 458710521 458173901 457364798 456278563
1289 456278563 455076158 453742743 452076852 449889064 447235376 444475710 441985965 439790577 437630355
1307.4 437630355 435430974 433379114 431673914 430360436 429163218 427695006 425632030 422592163
1323.7 422592163 418360263 413138419 407375693 401590407 396342129 392097235 389073700 387364894
1340 387364894 386886954 387109607 387505442 387836337 387977183 387838840 387312174 386416614 385334939 384131312
1360.4 384131312 382865965 381994307 381531537 381155610 381137669 381658435 382620782 383828431 384959936
1378.8C84959936J061261J484871K468228L762394M401177L677726K337575R53049
1395.1D05106217n9098p88153j137048j499921k166777k286882k199769k323806k127081
1413.5C90517682j693428j749396j679570m31656M27067P18355R90152J177103J599967
1431.8C89876276J948893J865387J960397K177090K118766J829207J216054J83165
1448.1D03175235o51151r57966j219571k562761l085315m13358J101046J950145L563941
1466.5D00900245N187928O791711R479344J0715038R896427R200454Q816302Q491367
1482.8D69478816P639855P045209P176340P349372O335199N396306N240262N128860
1499.1E20790219M908264M472435L837823L494561L571749L509998L395319L096938
$$ plain form
1378.8 384959936 386021197 387506068 389974296 393736690 398137867 401815593 404153168 405106217
1395.1 405106217 405047119 404258966 403121918 401621997 399455220 397168338 394968569 392644763 390517682
1413.5 390517682 388824254 387074858 385395288 384963632 385390699 386109054 387099206 388276309 389876276
1431.8 389876276 391825169 393690556 395650953 397828043 399946809 401776016 402992070 403175235
1448.1 403175235 402524084 401566118 400346547 397783786 394698471 394285113 395386159 397336304 400900245
1466.5 400900245 406088173 412879884 422359228 433074266 442970693 452171147 460987449 469478816
1482.8 469478816 477118671 484163880 491340220 498689592 505024791 510421097 515661359 520790219
1499.1 520790219 525698483 530170918 534008741 537503302 541075051 544585049 547980368 551077306
1515.4E51077306K882004K546609K328455K585113K649069K557754K313674J792013
1531.8E70731997J485765J933814J824140O63161m5836M76003Q36730O96480J68085
1550.1E78770339k42352m94480q02100k650559l439784j029074j304567k202332k945363
1568.5E63659728l385663k235115k541781m456102l577590k248645k428234k680957
1584.8E40105641k827048k897501k782286k563893k497554k519608k609491k786458
1601.1E18621802k736509k526044k623678l005325k951026k564133l172338m038542
1617.4D95004207k576798k077788l107995k941489k452046k153754j325518j340628
1633.7D77028191k412975j376211K83926P52032P58141L82126J057565K234131K032340
$$ plain form
1515.4 551077306 553959310 556505919 558834374 561419487 564068556 566626310 568939984 570731997
1531.8 570731997 572217762 574151576 575975716 576638877 576593041 577069044 577905774 578602254 578770339
1550.1 578770339 578527987 578033507 577231407 574580848 571141064 570111990 568807423 566605091 563659728
1568.5 563659728 560274065 558038950 555497169 551041067 547463477 545214832 542786598 540105641
1584.8 540105641 537278593 534381092 531598806 529034913 526537359 524017751 521408260 518621802
1601.1 518621802 515885293 513359249 510735571 507730246 504779220 502215087 499042749 495004207
1617.4 495004207 492427409 490349621 487241626 484300137 481848091 479694337 478368819 477028191
1633.7 477028191 474615216 473239005 473522931 474274963 475033104 475415230 476472795 478706926 480739266
1652.1D80739266K187371L261656L447115L516018L931851M538804M449010M373014
1668.4E10444105N047440N294800N587757O198585N967319N491614N486429O742596
1684.7E56260645O764412N782068N568981M964471M619360M720390M165173L842532
1701.1E96688032L443599K817452K758920K838492K672911K342820J852453J793206
1717.4F17207885K654671K981246K625704K364218K217770K251923K175688J833976
1733.7F36313081K123892K251983K042889K307892K808452L077030L121734L388345
1750F57435298M124522M297793M045367L842473L363788L101528L126979K902031K548814
1768.4F88788593K057969J668573J956999K206028K000272J682341J465917J359582
$$ plain form
1652.1 480739266 482926637 486188293 489635408 493151426 497083277 501622081 506071091 510444105
1668.4 510444105 515491545 520786345 526374102 532572687 538540006 544031620 549518049 556260645
1684.7 556260645 563025057 568807125 574376106 579340577 583959937 588680327 592845500 596688032
1701.1 596688032 600131631 602949083 605708003 608546495 611219406 613562226 615414679 617207885
1717.4 617207885 619862556 622843802 625469506 627833724 630051494 632303417 634479105 636313081
1733.7 636313081 638436973 640688956 642731845 645039737 647848189 650925219 654046953 657435298
1750 657435298 661559820 665857613 669902980 673745453 677109241 680210769 683337748 686239779 688788593
1768.4 688788593 690846562 692515135 694472134 696678162 698678434 700360775 701826692 703186274
1784.7G03186274J497328J608848J276792J071631J310170J368642J210034J205027
1801G13734746J391649J369536J134694R35673R95279J224100J202643R43244Q51452
1819.4G23783016R03785Q46327Q53419Q28147N16892N83708R02831Q40724P30276O95884
1839.8G31485009M18127m232K45690P23064O79195M34935K69234L11256M04715M34101
1860.2G35401094L93808L11375R6678o8068L45170P72298O32166L59416L49820N04971
1880.5G39098728O33359O38544M88639K27034K81990N84304N73874M09186K61425J52290
1900.9G43349373K08855L65615L26216J05918K0504J46269K67208K19703K24471J84893
1921.3G45419025O1751K07305M01318L94821K53201O2704n96J58369K96235J96517
$$ plain form
1784.7 703186274 704683602 706292450 707569242 708640873 709951043 711319685 712529719 713734746
1801 713734746 715126395 716495931 717630625 718566298 719561577 720785677 721988320 722931564 723783016
1819.4 723783016 724686801 725533128 726386547 727214694 727731586 728315294 729218125 730058849 730789125 731485009
1839.8 731485009 731903136 731898904 732144594 732867658 733546853 733981788 734251022 734562278 734966993 735401094
1860.2 735401094 735794902 736106277 736202955 736134887 736480057 737252355 737884521 738243937 738593757 739098728
1880.5 739098728 739732087 740370631 740859270 741086304 741368294 741952598 742526472 742935658 743197083 743349373
1900.9 743349373 743558228 743923843 744250059 744355977 744376481 744522750 744789958 745009661 745234132 745419025
1921.3 745419025 745480776 745688081 746089399 746484220 746737421 746800125 746799529 746957898 747254133 747450650
1941.7G47450650J15096J67787J91808K94089M39167M17531K49147J31667J97351L76999
1962.1G50031292M24386K25305P9632J40309K67208L88324L47078J32441K39P5638
1982.5G52111852K13027K70307J67608o9797j39236Q3447K58982K15411O080k07007
2002.9G52910674k21968j23561r6917k01940l79145n45621n79775m37617l61323n43833
2023.3G49418974p67768o65783l88503k81156l64363n40614o68168o14345m01914k31147
2043.7G44495213k55525l88980m39346k98023m9472Q4221L1889p3075q6308J6153J60217
2066.2G43196964K20001J05143m5062n7935N6326J59979J46985M0770m1366J1385J54316
2088.6G43947506K61128K07007O0379M2320J65522K89321L23414K22445R0122Q9765
$$ plain form
1941.7 747450650 747565746 747733533 747925341 748219430 748658597 749076128 749325275 749456942 749654293 750031292
1962.1 750031292 750455678 750680983 750760615 750900924 751168132 751556456 751903534 752035975 752036214 752111852
1982.5 752111852 752324879 752595186 752762794 752692997 752553761 752637208 752896190 753111601 753117681 752910674
2002.9 752910674 752688706 752565145 752468228 752266288 751887143 751341522 750761747 750324130 749962807 749418974
2023.3 749418974 748651206 747985423 747596920 747315764 746951401 746410787 745742619 745128274 744726360 744495213
2043.7 744495213 744239688 743850708 743411362 743113339 743063867 743148088 743179977 743106902 743020594 743036747 743196964
2066.2 743196964 743416965 743522108 743477046 743419111 743475437 743635416 743782401 743823171 743781805 743793190 743947506
2088.6 743947506 744208634 744415641 744476020 744518340 744683862 744973183 745296597 745519042 745609164 745698929
2109G45698929J98960K79784J99497M709j08183l0756J29223J63973M7207q7560j15215
2131.4G46380568J2159J69277J63376J4723j07050p1287Q3029J88589J53899M5240
2151.8G47032523J1742J08660K81453L97265L73900K99930L19362M69863O42538O93322
2172.2G50630558N96523M95314N45919P13468P90536O95706N36084M41253M86374O09160
2192.6G56540895O50346N37991L79205L41833N02407O75142O37949M70638L58045L98695
2213G61493146N65648O71864N69701L51310K50757L86595N67437N35905L13699J33157
2233.4G65839219J74522L58701M51625L58998K06888J27077J87993L30925L73066K69830
2253.8G68678844J30117J04189K58446M22298L76940J86146R0003J64449L09229M06921
$$ plain form
2109 745698929 745897889 746177673 746377170 746381879 746273696 746242940 746372163 746536136 746583343 746495783 746380568
2131.4 746380568 746392727 746562004 746725380 746740103 746633053 746561766 746644795 746833384 746987283 747032523
2151.8 747032523 747044265 747152925 747434378 747831643 748205543 748505473 748824835 749294698 749937236 750630558
2172.2 750630558 751227081 751722395 752268314 752981782 753772318 754468024 755004108 755445361 755931735 756540895
2192.6 756540895 757191241 757729232 758108437 758450270 758952677 759627819 760265768 760736406 761094451 761493146
2213 761493146 762058794 762730658 763300359 763651669 763902426 764289021 764856458 765392363 765706062 765839219
2233.4 765839219 766013741 766372442 766824067 767183065 767389953 767517030 767705023 768035948 768409014 768678844
2253.8 768678844 768808961 768913150 769171596 769593894 769970834 770156980 770246983 770411432 770720661 771127582
2274.2G71127582L40104J27971K9623K10822M40598L75986R6261p5459l5167J29640
2294.6G72767961K69294K38299L4809j07526j5736J66058K05338P1884o4195l9935
2315G73526251R1076J88112J08123j69217k75553j05738r537j14620k19285k64704
2335.4G72754908l18826l31282k98202l88801m91798j62363K09868K64167Q6666k05219
2355.8G71119118l68834m63962o18101m95016k51830m49240p59423n87403k26439j39415
2376.2G66759455k38538k76267k16603j42157j07289j27017k55287m41194m75227l15249
2396.6G64164627j85728k96414n24700n87583m94063m17828m27246n41508p17342q19624
2417G59152591p39813n82039n88894p69555q94547q46088p41243p18773q11994r58025
$$ plain form
2274.2 771127582 771467686 771595657 771625280 771836102 772276700 772652686 772748947 772673488 772638321 772767961
2294.6 772767961 773037255 773275554 773310363 773202837 773187101 773353159 773558497 773630381 773566186 773526251
2315 773526251 773617327 773805439 773913562 773744345 773468792 773363054 773353517 773238897 773019612 772754908
2335.4 772754908 772436082 772104800 771806598 771417797 770925999 770763636 770973504 771237671 771324337 771119118
2355.8 771119118 770750284 770286322 769668221 769173205 768921375 768472135 767712712 767125309 766898870 766759455
2376.2 766759455 766520917 766244650 766028047 765885890 765778601 765651584 765396297 764955103 764479876 764164627
2396.6 764164627 763978899 763682485 763157785 762570202 762076139 761658311 761231065 760689557 759972215 759152591
2417 759152591 758412778 757830739 757241845 756472290 755577743 754731655 753990412 753271639 752459645 751501620
2437.4G51501620j007557q82626p44342p61152q60810r31025r32634q53419p69436
2455.7G43758619p99537q97288r02534p95483p00116o95408p71940q67486q61406p21455
2476.1G35745966o15119o92308q15511p92027o60717n74827n97716o22391n88239n56826
2496.5G29230285m99964m09722m32432n48959n74231m89652m15504m25756n10514o21498
2516.9G24302053o68883o15120n45740n97954p46488q29637q28863q13961q40962q95679
2537.3G16918766r17315r12487q86262q41737q58605r51409r71258q73029q29995r01460
2557.7G07975209r27449q69274q57651r10282q88526p81656p95662r32992r52005q34704
2578.1F99225008p89403q51453q58605p79509p14004o74725o34372o05404o08266o34253
$$ plain form
2437.4 751501620 750494063 749611437 748867095 748105943 747245133 746314108 745381474 744528055 743758619
2455.7 743758619 742959082 742061794 741159260 740363777 739663661 738968253 738196313 737328827 736467421 735745966
2476.1 735745966 735130847 734438539 733623028 732831001 732170284 731595457 730997741 730375350 729787111 729230285
2496.5 729230285 728730321 728320599 727888167 727339208 726764977 726275325 725859821 725434065 724923551 724302053
2516.9 724302053 723633170 723018050 722472310 721874356 721127868 720298231 719469368 718655407 717814445 716918766
2537.3 716918766 716001451 715088964 714202702 713360965 712502360 711550951 710579693 709706664 708876669 707975209
2557.7 707975209 707047760 706178486 705320835 704410553 703522027 702740371 701944709 701011717 700059712 699225008
2578.1 699225008 698435605 697584152 696725547 695946038 695232034 694557309 693922937 693317533 692709267 692075014
2598.5F92075014o33895o24180o78241p64907q29994q80421r34481j012385j103342
2616.8F84613168j194536j269222j285195j283348j347661j469969j544536j514196
2633.2F73704505j489759j537561j574337j577735j581848j564920j518011j496554
2649.5F61363780j524329j552045j535356j480758j423359j399458j406788j431466
2665.8F49610221j434505j375019j310349j281678j245380j184821j137853j138329
2682.1F39502287j185775j230299j227022j202225j193047j208067j255929j309693
2698.4F29690230j340091j377642j425744j460731j483380j474202j413882j341283
2714.7F18373275j328767j369595j337588j214802j127720j098037j090705j098991
$$ plain form
2598.5 692075014 691441119 690816939 690138698 689373791 688543797 687663376 686728895 685716510 684613168
2616.8 684613168 683418632 682149410 680864215 679580867 678233206 676763237 675218701 673704505
2633.2 673704505 672214746 670677185 669102848 667525113 665943265 664378345 662860334 661363780
2649.5 661363780 659839451 658287406 656752050 655271292 653847933 652448475 651041687 649610221
2665.8 649610221 648175716 646800697 645490348 644208670 642963290 641778469 640640616 639502287
2682.1 639502287 638316512 637086213 635859191 634656966 633463919 632255852 630999923 629690230
2698.4 629690230 628350139 626972497 625546753 624086022 622602642 621128440 619714558 618373275
2714.7 618373275 617044508 615674913 614337325 613122523 611994803 610896766 609806061 608707070
2731.1F08707070j080632j006961r19878q96991r37759r63450r65834r68635r31084
2749.4F00035846q73983q31723q03053q04127p88390p53820p59065p75874p73430p81357
2769.8E92091024q42035r52721j028239j057148j118601j194954j257777j356482j450122
2788.2E81832945j482308j521885j613021j718461j813829j922965k015829k052844
2804.5E67691803k111614k208709k281726k342522k396226k459407k562821k675831
2820.8E48652947k774835k850711k897978k934992l019869l152907l282607l406286
2837.1E24332762l543675l769934m102528m436374m656375m664093m398346l889650
2853.4D90871787l321767k888918k687663k831488l330887l987550m600108n068064
$$ plain form
2731.1 608707070 607626438 606619477 605699599 604802608 603864849 602901399 601935565 600966930 600035846
2749.4 600035846 599161863 598330140 597527087 596722960 595934570 595180750 594421685 593645811 592872381 592091024
2769.8 592091024 591248989 590296268 589268029 588210881 587092280 585897326 584639549 583283067 581832945
2788.2 581832945 580350637 578828752 577215731 575497270 573683441 571760476 569744647 567691803
2804.5 567691803 565580189 563371480 561089754 558747232 556351006 553891599 551328778 548652947
2820.8 548652947 545878112 543027401 540129423 537194431 534174562 531021655 527739048 524332762
2837.1 524332762 520789087 517019153 512916625 508480251 503823876 499159783 494761437 490871787
2853.4 490871787 487550020 484661102 481973439 479141951 475811064 471823514 467223406 462155342
2869.7D62155342n336970n450815n496412n390048m991800m316181l507465k739191
2886.1D24926460k094984j539886j062274p38472o08981o67780q61675j077324j281857
2904.4D14993227j549542j901150k341896k911836l476769l844559m028112m016101
2920.7C90923262l678114l039658k195239j199037j47968R68218K194196L366470M292160
2939.1C91484290M970998N439848N674719N787880N933433O011337N962581N936801
2955.4D37201887N914629N778372N584091N336344M948706M547477M275202M090637
2971.7D77677345L957689L856242L739506L594339L349513K997845K719611K483785
2988E04375875K162397J769245J392960J185417J011193O25968J55807j81437m15265
$$ plain form
2869.7 462155342 456818372 451367557 445871145 440481097 435489297 431173116 427665651 424926460
2886.1 424926460 422831476 421291590 420229316 419490844 418881863 418214083 417352408 416275084 414993227
2904.4 414993227 413443685 411542535 409200639 406288803 402812034 398967475 394939363 390923262
2920.7 390923262 387245148 384205490 382010251 380811214 380663246 381631464 383825660 387192130 391484290
2939.1 391484290 396455288 401895136 407569855 413357735 419291168 425302505 431265086 437201887
2955.4 437201887 443116516 448894888 454478979 459815323 464764029 469311506 473586708 477677345
2971.7 477677345 481635034 485491276 489230782 492825121 496174634 499172479 501892090 504375875
2988 504375875 506538272 508307517 509700477 510885894 511897087 512523055 512678862 512497425 512082160
3006.4E12082160o36518q32439j039684j378298j751542j926362j978398k077817k251447
3024.7D98209655k429038k508312k537996k564639k657294k822429k848983k763510
3041.1D77077454k746701k827167k976060l031701k957881k914667k918541k982021
3057.4D53722715l075689l036111k865553k730727k788812l003717l108322k983332
3073.7D30130452k743363k620131k766371k943575k940268k853840k752036k693832
3090D07817036k777398k899080k839715k641648k577751k675981k694726k586484k549320
3108.4C83574933k602488k496898k325833k378166k516865k605319k639562k545745
3124.7C63464057k399385k316147k352595k409816k283305k083629k093703k302795
$$ plain form
3006.4 512082160 511445642 510613203 509573519 508195221 506443679 504517317 502538919 500461102 498209655
3024.7 498209655 495780617 493272305 490734309 488169670 485512376 482689947 479840964 477077454
3041.1 477077454 474330753 471503586 468527526 465495825 462537944 459623277 456704736 453722715
3057.4 453722715 450647026 447610915 444745362 442014635 439225823 436222106 433113784 430130452
3073.7 430130452 427387089 424766958 422000587 419057012 416116744 413262904 410510868 407817036
3090 407817036 405039638 402140558 399300843 396659195 394081444 391405463 388710737 386124253 383574933
3108.4 383574933 380972445 378475547 376149714 373771548 371254683 368649364 366009802 363464057
3124.7 363464057 361064672 358748525 356395930 353986114 351702809 349619180 347525477 345222682
3141C45222682k367854k205640k056927j950264j907915k016723k149343k143920k023905
3159.4C26400191j884699j843304j890003j850844j741826j708120j739085j751423
3175.7C11990887j729250j651287j567900j544625j542747j523405j498729j466334
3192B99466610j426667j452476j498431j447528j317442j213759j227826j311302j296014
3210.3B87275165j194030j136780j131325j163930j165688j119226j101375j059145
3226.7B78203666r71734r09299q88079r67741j042426r67264r09329r05156q38607
3245B69804031p99299q62360q64297p45147p08997p88391p91818p06911o64860o72132
3265.4B62199819o11424m83692m97997o44326p32213p43866o83248n94557n56975n38945
$$ plain form
3141 345222682 342854828 340649188 338592261 336641997 334734082 332717359 330568016 328424096 326400191
3159.4 326400191 324515492 322672188 320782185 318931341 317189515 315481395 313742310 311990887
3175.7 311990887 310261637 308610350 307042450 305497825 303955078 302431673 300932944 299466610
3192 299466610 298039943 296587467 295089036 293641508 292324066 291110307 289882481 288571179 287275165
3210.3 287275165 286081135 284944355 283813030 282649100 281483412 280364186 279262811 278203666
3226.7 278203666 277231932 276322633 275434554 274466813 273424387 272457123 271547794 270642638 269804031
3245 269804031 269004732 268142372 267278075 266532928 265823931 265035540 264243722 263536811 262871951 262199819
3265.4 262199819 261588395 261104703 260606706 259962380 259230167 258486301 257803053 257208496 256651521 256112576
3285.8B56112576n07325m71712m71502n18590n62698o03616n96851m69476l30270m06682
3306.2B51173854o80119q52197q16465p14987o39648o05523o07044n69477n27561o54101
3326.6B44506732p81477p04467o17102n73233m79519m90829o37070p23570p45550o71029
3347B38082886m78789m84929p35313q49247p25239n77361n35428n15103m01691l86551
3367.4B32393235o08370q23989p77006n58600m49941m97907n88283n49764l69250j46732
3387.8B27023393Q628j45540m57406m30301q4027J2710l13028n50941m15906k11999
3408.2B24435583r9525o7443j94117k72483j37880o2272r5397j1877J36093K39446
3428.6B23870128K32608K14606K81543J79991r5591j26958J49071L49239L14459K58237
$$ plain form
3285.8 256112576 255605251 255133539 254662037 254143447 253580749 252977133 252380282 251910806 251580536 251173854
3306.2 251173854 250493735 249641538 248825073 248110086 247470438 246864915 246257871 245688394 245160833 244506732
3326.6 244506732 243725255 243020788 242403686 241830453 241350934 240860105 240223035 239499465 238753915 238082886
3347 238082886 237604097 237119168 236383855 235534608 234809369 234232008 233696580 233181477 232779786 232393235
3367.4 232393235 231784865 230960876 230183870 229625270 229175329 228677422 228089139 227539375 227170125 227023393
3387.8 227023393 227032021 226886481 226429075 225998774 225914747 225927457 225614429 225063488 224647582 224435583
3408.2 224435583 224336058 224268615 224074498 223802015 223664135 223601863 223506466 223494589 223630682 223870128
3428.6 223870128 224102736 224317342 224598885 224778876 224683285 224556327 224705398 225054637 225369096 225627333
3449B25627333L00005L31432L64110M72754N94392N39273N00038P16329Q47682O18145
3469.4B30911493K57582J97783M41030P31974P34836M45590M53204P31036P40915O34343
3489.8B36279786P31647Q13454P88495P77394P75873O90460N69672N79908O65605Q10787
3510.2B43483081J024321R73046P05779O97761R35108J089528R20281O30319O26326
3528.5B51085550R28789J183122J209587J100809J052141J243055J341283J065165
3544.8B60209501Q39352J057983J217425J248240J480520J656264J721174J856237
3561.1B71286696J801640J280040J240849K218783K642453K361327K257884K388596
3577.5B87478268K626270K956689L023266K414078J937747K809286L345788L013879
$$ plain form
3449 225627333 225927338 226258770 226622880 227095634 227690026 228229299 228729337 229445666 230293348 230911493
3469.4 230911493 231169075 231366858 231807888 232539862 233274698 233720288 234173492 234904528 235645443 236279786
3489.8 236279786 237011433 237824887 238613382 239390776 240166649 240857109 241426781 242006689 242672294 243483081
3510.2 243483081 244507402 245480448 246186227 246883988 247819096 248908624 249828905 250459224 251085550
3528.5 251085550 252014339 253197461 254407048 255507857 256559998 257803053 259144336 260209501
3544.8 260209501 261048853 262106836 263324261 264572501 266053021 267709285 269430459 271286696
3561.1 271286696 273088336 274368376 275609225 277828008 280470461 282831788 285089672 287478268
3577.5 287478268 290104538 293061227 296084493 298498571 300436318 303245604 306591392 309605271
3593.8C09605271L050923L400207L422051L524780L694773L312648L024250L382653
3610.1C36417556L628433L819406L814816L379107L807544M581690M487574L501952
3626.4C67438078K549142L711074M656643M397034M208535M069657M077673M355907
3642.7C99463743M292041L392428K680212L985852M931480M167408L924966M358142
3659D31196272M086256L827513M024833L558040K668202L417074L485978K091795K890855
3677.4D61246818L958434L847152L808618L473758K354682J474589K356678L186286
3693.7D85707015L013700K599686K038151J691521K306252K753944K162814R72450
3710E03245533Q52644K401650K861082K220750J615763J364350J320482J608789K290606
$$ plain form
3593.8 309605271 312656194 316056401 319478452 323003232 326698005 330010653 333034903 336417556
3610.1 336417556 340045989 343865395 347680211 351059318 354866862 359448552 363936126 367438078
3626.4 367438078 369987220 373698294 378354937 382751971 386960506 391030163 395107836 399463743
3642.7 399463743 403755784 407148212 409828424 413814276 418745756 422913164 426838130 431196272
3659 431196272 435282528 439110041 443134874 446692914 449361116 452778190 456264168 458355963 461246818
3677.4 461246818 465205252 469052404 472861022 476334780 478689462 480164051 482520729 485707015
3693.7 485707015 488720715 491320401 493358552 495050073 497356325 500110269 502273083 503245533
3710 503245533 504098177 506499827 509360909 511581659 513197422 514561772 515882254 517491043 519781649
3728.4E19781649K180696J109481J84178Q58664K486349K632260P40945l21388J674771
3746.7E31327605J526118j66417J059473K491653J824439R63866J386643J664221J192570
3765.1E43270171R30965O71684R42290J689315J703560J067877O37293R50873R85920
3783.5E52849948Q26955J091659J282573J360893J082123O06775P66635L01719j4186
3801.8E60155094J255095Q74757M57824J668215J950144P57873q940O27935M8101J91688
3822.2E67977786J531899J367152J059055Q49307P36594R26316K92480l19362L94285
3840.6E74815512R08553J147211J645148J756251L65316k432584j196087K216876K230763
3858.9E81456959J054704M7029K88903P87497K6285M7088P88272J131415J093089J93537
$$ plain form
3728.4 519781649 521962345 523071826 523256004 524114668 526601017 529233277 529974222 529652834 531327605
3746.7 531327605 532853723 532687306 533746779 536238432 538062871 539026737 540413380 542077601 543270171
3765.1 543270171 544201136 544872820 545815110 547504425 549207985 550275862 550913155 551864028 552849948
3783.5 552849948 553676903 554768562 556051135 557412028 558494151 559100926 559867561 560169280 560155094
3801.8 560155094 561410189 562284946 562742770 564410985 566361129 567119002 567110062 567737997 567786098 567977786
3822.2 567977786 569509685 570876837 571935892 572785199 573521793 574448109 574740589 574421227 574815512
3840.6 574815512 575724065 576871276 578516424 580272675 580637991 578205407 577009320 579226196 581456959
3858.9 581456959 582511663 582558692 582847595 583635092 583661377 583708465 584496737 585628152 586721241 586914778
3879.3E86914778K69830P19726K44737P01964O39736j01924O05822J233220N39780
3897.7E91767669k91705n50747k65062P00533J205623Q12531N48601L91245q8036j28985
3918.1E94101667M21942M63724J29819L36766N21839Q4936o6161L76403N90504N06878
3938.5E97468317K48253L3855K89083L32951O6221K00987L98338L19481K25603K22266
3958.9E99805355K23279L21984L73185J83821Q3923J80960K12431J86682K04205J63376
3979.3F01939201J98603L56674L40343J59383O2286J10150K01404K51651K58028
3997.6F03877723
$$ plain form
3879.3 586914778 587184608 587904334 588149071 588851035 589490771 589388847 589994669 591227889 591767669
3897.7 591767669 591475964 590925217 590660155 591360688 592566311 593378842 593927443 594318688 594230652 594101667
3918.1 594101667 594523609 594987333 595117152 595453918 595975757 596060693 595994532 596370935 596961439 597468317
3938.5 597468317 597716570 597750425 598039508 598372459 598438680 598639667 599038005 599357486 599583089 599805355
3958.9 599805355 600028634 600350618 600723803 600907624 600991547 601172507 601384938 601571620 601775825 601939201
3979.3 601939201 602137804 602494478 602834821 602994204 603056490 603166640 603368044 603619695 603877723
3997.6 603877723
##END=$$ End of the data block
