##TITLE=$$ Begin of the data block
##JCAMP-DX=5.00 $$ ACD/SpecManager v 10.08
##SPECTROMETER/DATA SYSTEM=Alpha
##DATE=26 Dec 2014 10:25:20
##DATA TYPE=INFRARED SPECTRUM
##DATA CLASS=XYDATA
##ORIGIN=
##OWNER=
##NPOINTS=1765
##FIRSTX=399.76428223
##LASTX=3997.64306641
##MAXX=3997.64306641
##MINX=399.76428223
##MAXY=0.77667105
##MINY=0.14826626
##XFACTOR=1.0000000000
##YFACTOR=1.000000000000000e-9
##FIRSTY=0.41511720
##DELTAX=2.03961372
##XUNITS=1/CM
##YUNITS=ARBITRARY UNITS
##XYDATA=(X++(Y..Y))
$$ plain form
399.8 415117204 410198450 407324910 406003386 406058699 407100111 408796400 410768479 412390053 413162649
418.1 413162649 412551165 410541385 407570004 404720545 402604640 400359660 397079945 393369079 391225725
436.5 391225725 392002583 395387232 400110960 404769450 408899248 412815362 416537642 419104159 419517279
454.8 419517279 418211520 416604072 415524542 414069653 411133409 406775743 402179062 398491204
471.2 398491204 395909339 393651932 390980273 388510823 387341946 387542635 388265550 388452828 387719631
489.5 387719631 386555344 385588855 384755164 383352220 380903691 377685249 374779105 372657567 370243847
507.9 370243847 366597831 362087607 357623190 353502870 349462450 345426887 341672480 338690966
524.2 338690966 337114125 337286592 338442773 339576781 340991229 344130307 349780560 356862992 363101572
$$ packed form
399.8D15117204m918754k873540j321524N5313J041412J696289J972079J621574P72596
418.1D13162649o11484k009780k971381k849459k115905k244980l279715l710866k143354
436.5C91225725P76858L384649M723728M658490M129798L916114L722280K566517M13120
454.8D19517279j305759j607448j079530j454889k936244m357666m596681l687858
471.2C98491204k581865k257407k671659k469450j168877K00689P22915J87278p33197
489.5C87719631j164287r66489q33691j402944k448529l218442k906144k121538k413720
507.9C70243847l646016m510224m464417m120320m040420m035563l754407k981514
524.2C38690966j576841J72467J156181J134008J414448L139078N650253P082432O238580
$$ plain form
542.5 363101572 366775900 367985398 368072957 367882758 367069751 364826262 361043811 356528014 351980120
560.9 351980120 347241014 341576189 334466785 326800674 320680410 317552835 317419440 319396257 322915345
579.3 322915345 328330368 335896194 344551444 352231562 357381284 360174090 361801088 362990856
595.6 362990856 363731235 363710284 362887681 361929327 361749440 362607628 363929510 365091473 366203338
613.9 366203338 367938489 370928258 375072867 379426062 383211315 386546999 390051425 393838048
630.2 393838048 397251010 399518043 400625676 401521116 403143108 405325860 407108396 407950789 408284187
648.6 408284187 409048945 410649300 412523717 413742334 414001554 414130390 415188521 416984349 418596447
667 418596447 419555873 420475572 421908319 424044102 426589429 428696573 429884344 430691540 431952775
$$ packed form
542.5C63101572L674328J209498Q7559j90199q13007k243489l782451m515797m547894
560.9C51980120m739106n664825p109404p666111o120264l127575j33395J976817L519088
579.3C22915345N415023P565826Q655250P680118N149722K792806J626998J189768
595.6C62990856P40379k0951q22603r58354j79887Q58188J321882J161963J111865
613.9C66203338J735151K989769M144609M353195L785253L335684L504426L786623
630.2C93838048L412962K267033J107633Q95440J621992K182752J782536Q42393L33398
648.6D08284187P64758J600355J874417J218617K59220J28836J058131J795828J612098
667D18596447R59426R19699J432747K135783K545327K107144J187771Q07196J261235
$$ plain form
685.3 431952775 433639169 434905648 434936613 433595359 431512684 429347813 427054346 424089462 420393854
703.7 420393854 416931719 415091246 415579200 417897016 421004683 424539953 429009140 435024768 442381322
722 442381322 449926168 456525177 462005138 467273802 472961754 478301853 482098043 484139502 485125989
740.4 485125989 485742390 485950828 484866560 481592804 476333320 470536292 465382099 460634708 455568522
758.7 455568522 450399965 446364045 444723874 446052164 450081915 455948412 463032931 471666098
775.1 471666098 482284129 493948370 504524946 512634397 518821299 524545312 530584991 536423266
791.4 536423266 541186035 544910669 548748314 553981423 560460627 566294074 569858789 571682990
807.7 571682990 573519170 576140046 578627110 579652846 578982830 577664614 576641381 575532258 573044002
$$ packed form
685.3D31952775J686394J266479L0965j341254k082675k164871k293467k964884l695608
703.7D20393854l462135j840473M87954K317816L107667L535270M469187O015628P356554
722D42381322P544846O599009N479961N268664N687952N340099L796190K041459R86487
740.4D85125989O16401K08438j084268l273756n259484n797028n154193m747391n066186
758.7D55568522n168557m035920j640171J328290M029751N866497P084519Q633167
775.1D71666098J0618031J1664241J0576576Q109451O186902N724013O039679N838275
791.4E36423266M762769L724634L837645N233109O479204N833447L564715J824201
807.7E71682990J836180K620876K487064J025736o70016j318216j023233j109123k488256
$$ plain form
826 573044002 568283856 561747253 554939687 548816323 542929888 536413491 529277325 522508919 517015576
844.4 517015576 512695312 508543909 503618896 497819215 491686851 485855818 481033802 478674024
860.7 478674024 480694234 487905920 499633551 514459252 530320466 544673800 555658996 562912047
877 562912047 566871464 567568839 564593434 558219731 549865901 541272879 533422232 526120484 518790543
895.4 518790543 511384249 504192710 497316301 490381181 482554048 473160893 462284744 450596780
911.7 450596780 438714862 426952749 415743887 405987054 398738980 394481748 392774075 392642707
928 392642707 393349111 394811898 397284716 400943190 405734181 411250830 416626245 420449138 421010613
946.4 421010613 417133301 408731192 396564871 381789893 365575373 348726720 331519037 313882649
$$ packed form
826E73044002m760146o536603o807566o123364n886435o516397p136166o768406n493343
844.4E17015576m320264m151403m925013n799681o132364n831033m822016k359778
860.7D78674024K020210P211686J1727631J4825701J5861214J4353334J0985196P253051
877E62912047L959417O97375k975405o373703q353830q593022p850647p301748p329941
895.4E18790543p406294p191539o876409o935120p827133r393155j0876149j1687964
911.7D50596780j1881918j1762113j1208862r756833p248074m257232j707673j31368
928C92642707P06404J462787K472818L658474M790991N516649N375415L822893N61475
946.4D21010613l877312q402109j2166321j4774978j6214520j6848653j7207683j7636388
$$ plain form
962.7 313882649 295775145 277426153 259235978 241496921 224384278 208150432 193200007
977 193200007 180037796 169174746 160879806 155024841 151246116 149115294 148266256 148396879 149243727
995.3 149243727 150551602 152011469 153360471 154509902 155436024 156059682 156304166 156257108 156240553
1013.7 156240553 156584635 157481521 158938468 160836294 163076833 165643662 168535441 171614870 174605981
1032 174605981 177148595 178950727 180001497 180579633 180981249 181382522 181923017 182829574 184501559
1050.4 184501559 187342733 191465601 196648315 202676043 209617361 217656508 226310268 233569205
1066.7 233569205 236306787 232704535 224455446 215612814 209277928 206086725 205364287 206460044
1083 206460044 208993971 212599233 216943726 221832678 226991221 231948942 236211613 239390388 241249442
$$ packed form
962.7C13882649j8107504j8348992j8190175j7739057j7112643j6233846j4950425
977A93200007j3162211j0863050q294940n854965l778725k130822q49038J30623Q46848
995.3A49243727J307875J459867J349002J149431R26122O23658K44484m7058j6555
1013.7A56240553L44082Q96886J456947J897826K240539K566829K891779L079429K991111
1032A74605981K542614J802132J050770N78136M01616M01273N40495R06557J671985
1050.4A84501559K841174M122868N182714O027728O941318Q039147Q653760P258937
1066.7B33569205K737582l602252q249089q842632o334886l191203p22438J095757
1083B06460044K533927L605262M344493M888952N158543M957721M262671L178775J859054
$$ plain form
1101.4 241249442 242005736 242446095 243578538 245971411 249372765 253096372 256555468 259454936 261763602
1119.8 261763602 263630629 265300393 267170459 269761145 273387492 277709097 281597346 283594757
1136.1 283594757 282690912 278871685 272991061 266162604 259234011 252718121 246966124 242317528
1152.4 242317528 239033818 237137169 236479327 236932784 238587677 241779760 246926785 254213125 263410628
1170.7 263410628 274077684 285862952 298542440 311914623 325649053 339168698 351906270
1185 351906270 363523394 373800993 382498890 389324814 394132257 397247940 399460763 401547283
1201.3 401547283 403867632 406466395 409414768 413022935 417695522 423474252 429776371 435629576
1217.7 435629576 440247685 443437725 445392549 446229428 445913523 444501221 442357630 440087467 438143045
$$ packed form
1101.4B41249442P56294M40359J132443K392873L401354L723607L459096K899468K308666
1119.8B61763602J867027J669764J870066K590686L626347M321605L888249J997411
1136.1B83594757r03845l819227n880624o828457o928593o515890n751997m648596
1152.4B42317528l283710j896649o57842M53457J654893L192083N147025P286340R197503
1170.7B63410628J0667056J1785268J2679488J3372183J3734430J3519645J2737572
1185C51906270J1617124J0277599Q697897O825924M807443L115683K212823K086520
1201.3D01547283K320349K598763K948373L608167M672587N778730O302119N853205
1217.7D35629576M618109L190040J954824Q36879l15905j412302k143591k270163j944422
$$ plain form
1236 438143045 436555743 435135394 433936328 433423042 434054285 435763478 438030005 440331310 442401826
1254.4 442401826 444214165 445803344 447158635 448273599 449337035 450804144 453016162 455742419
1270.7 455742419 458257079 459875703 460392475 460110784 459557205 459055454 458513975 457697868 456607163
1289 456607163 455397844 454074800 452435344 450254321 447588295 444830686 442357421 440158457 437964052
1307.4 437964052 435748607 433730930 432056993 430747986 429571897 428124011 426050961 423000187
1323.7 423000187 418762445 413518220 407732934 401950210 396728694 392529428 389541060 387844950
1340 387844950 387362421 387542754 387886345 388192296 388332546 388207555 387697160 386807323 385708809 384487182
1360.4 384487182 383228064 382354289 381875068 381505728 381494880 381992072 382921815 384115875 385250062
$$ packed form
1236D38143045j587302j420349j199066n13286O31243J709193K266527K301305K070516
1254.4D42401826J812339J589179J355291J114964J063436J467109K212018K726257
1270.7D55742419K514660J618624N16772k81691n53579n01751n41479q16107j090705
1289D56607163j209319j323044j639456k181023k666026k757609k473265k198964k194405
1307.4D37964052k215445k017677j673937j309007j176089j447886k073050l050774
1323.7D23000187m237742n244225n785286n782724n221516m199266k988368j696110
1340C87844950m82529J80333L43591L05951J40250j24991n10395q89837j098514j221627
1360.4C84487182j259118q73775m79221l69340j0848M97192R29743J194060J134187
$$ plain form
1378.8 385250062 386302292 387779802 390283674 394080341 398456335 402110308 404461324 405426294
1395.1 405426294 405344576 404510438 403339475 401832461 399672389 397389442 395198971 392895877 390789121
1413.5 390789121 389107108 387363195 385696560 385265857 385680318 386394620 387390524 388598382 390232712
1431.8 390232712 392179310 394037008 395999104 398159325 400257915 402075410 403275013 403447896
1448.1 403447896 402813435 401889205 400693893 398095906 394970536 394597262 395740867 397711307 401278347
1466.5 401278347 406457663 413263977 422775030 433491647 443396002 452618420 461435407 469929218
1482.8 469929218 477612644 484702140 491865546 499201149 505561352 510961175 516168952 521293819
1499.1 521293819 526226103 530704021 534532487 538047731 541680396 545234442 548638046 551716745
$$ packed form
1378.8C85250062J052230J477510K503872L796667M375994L653973K351016R64970
1395.1D05426294q1718q34138j170963j507014k160072k282947k190471k303094k106756
1413.5C90789121j682013j743913j666635m30703M14461P14302R95904J207858J634330
1431.8C90232712J946598J857698J962096K160221K098590J817495J199603J72883
1448.1D03447896o34461r24230j195312k597987l125370l73274J143605J970440L567040
1466.5D01278347N179316O806314R511053J0716617R904355R222418Q816987Q493811
1482.8D69929218P683426P089496P163406P335603O360203N399823N207777N124867
1499.1E21293819M932284M477918L828466L515244L632665L554046L403604L078699
$$ plain form
1515.4 551716745 554567635 557108700 559485376 562118709 564788878 567366004 569686592 571469486
1531.8 571469486 572960794 574895918 576681614 577321231 577336550 577868521 578729510 579463542 579672635
1550.1 579672635 579440594 578955472 578143656 575408936 571945667 570979178 569716930 567524731 564572930
1568.5 564572930 561175644 558917165 556353152 551909328 548359036 546111643 543669224 540969729
1584.8 540969729 538120985 535206318 532403052 529805422 527285278 524777770 522199571 519434392
1601.1 519434392 516696274 514163554 511550725 508564353 505624175 503051400 499848366 495809019
1617.4 495809019 493276685 491227806 488131493 485206217 482765257 480622411 479320318 478010684
1633.7 478010684 475652426 474331588 474614233 475328058 476063281 476479292 477600455 479858905 481901467
$$ packed form
1515.4E51716745K850890K541065K376676K633333K670169K577126K320588J782894
1531.8E71469486J491308J935124J785696O39617J5319N31971Q60989P34032K09093
1550.1E79672635k32041m85122q11816k734720l463269r66489j262248k192199k951801
1568.5E64572930l397286k258479k564013m443824l550292k247393k442419k699495
1584.8E40969729k848744k914667k803266k597630k520144k507508k578199k765179
1601.1E19434392k738118k532720k612829k986372k940178k572775l203034m039347
1617.4D95809019k532334k048879l096313k925276k440960k142846j302093j309634
1633.7D78010684k358258j320838K82645P13825P35223M16011J121163K258450K042562
$$ plain form
1652.1 481901467 484145254 487457454 490927130 494475543 498431981 502968311 507428169 511811137
1668.4 511811137 516854584 522183657 527835011 534051716 539995968 545490444 551024377 557823479
1684.7 557823479 564606488 570390463 575948238 580884516 585481107 590209961 594398499 598212123
1701.1 598212123 601566017 604307294 607041836 609889805 612581074 614930630 616787910 618610978
1717.4 618610978 621264279 624214530 626832962 629201233 631410897 633655488 635825515 637660623
1733.7 637660623 639818668 642105699 644158244 646467090 649269462 652315617 655403793 658785582
1750 658785582 662928164 667251766 671320617 675171077 678531468 681648970 684804618 687716007 690258980
1768.4 690258980 692311406 693965614 695919633 698150218 700182438 701890886 703368843 704728067
$$ packed form
1652.1D81901467K243787L312200L469676L548413L956438M536330M459858M382968
1668.4E11811137N043447N329073N651354O216705N944252N494476N533933O799102
1684.7E57823479O783009N783975N557775M936278M596591M728854M188538L813624
1701.1E98212123L353894K741277K734542K847969K691269K349556J857280J823068
1717.4F18610978K653301K950251K618432K368271K209664K244591K170027J835108
1733.7F37660623K158045K287031K052545K308846K802372L046155L088176L381789
1750F58785582M142582M323602M068851L850460L360391L117502L155648K911389K542973
1768.4F90258980K052426J654208J954019K230585K032220J708448J477957J359224
$$ plain form
1784.7 704728067 706231773 707863390 709153295 710224211 711538970 712898374 714112282 715362608
1801 715362608 716790795 718159437 719273329 720206738 721225023 722439289 723609984 724550664 725414157
1819.4 725414157 726324141 727180779 728045285 728873193 729386270 729984164 730911911 731757164 732486427 733205199
1839.8 733205199 733642340 733620048 733853102 734603643 735293210 735704780 735957205 736268163 736680150 737134278
1860.2 737134278 737551451 737871945 737981856 737925768 738242209 738965929 739566267 739917934 740282714 740813375
1880.5 740813375 741474330 742138028 742631316 742858052 743149817 743732333 744301021 744712532 744979382 745157421
1900.9 745157421 745398402 745756447 746062636 746177793 746213734 746370375 746656001 746901929 747126520 747279525
1921.3 747279525 747318566 747522891 747935474 748339355 748587489 748665035 748703301 748886108 749187410 749376714
$$ packed form
1784.7G04728067J503706J631617J289905J070916J314759J359404J213908J250326
1801G15362608J428187J368642J113892R33409J018285J214266J170695R40680Q63493
1819.4G25414157R09984Q56638Q64506Q27908N13077N97894R27747Q45253P29263P18772
1839.8G33205199M37141k2292K33054P50541O89567M11570K52425L10958M11987M54128
1860.2G37134278M17173L20494J09911n6088L16441P23720O00338L51667L64780N30661
1880.5G40813375O60955O63698M93288K26736K91765N82516N68688M11511K66850J78039
1900.9G45157421K40981L58045L06189J15157L5941J56641K85626K45928K24591J53005
1921.3G47279525L9041K04325M12583M03881K48134P7546L8266J82807L01302J89304
$$ plain form
1941.7 749376714 749462306 749601007 749802589 750134468 750589848 750990272 751224518 751365244 751599371 752010584
1962.1 752010584 752439380 752665102 752750218 752889216 753148019 753521681 753860056 753990710 753975749 754043162
1982.5 754043162 754272461 754552841 754735291 754694343 754565418 754654050 754914165 755104363 755105972 754923403
2002.9 754923403 754711568 754594982 754511237 754313529 753916323 753346384 752775609 752364218 751996219 751424968
2023.3 751424968 750659704 750028551 749680340 749419332 749039650 748488605 747837484 747224748 746791482 746520162
2043.7 746520162 746241331 745858610 745445490 745183527 745173275 745264590 745258689 745151281 745056093 745084167 745283663
2066.2 745283663 745537996 745638788 745586753 745555818 745637298 745800197 745940447 745960057 745907247 745948613 746145725
2088.6 746145725 746423781 746625125 746675611 746729732 746939540 747269809 747604907 747845650 747952282 748014092
$$ packed form
1941.7G49376714Q5592J38701K01582L31879M55380M00424K34246J40726K34127M11213
1962.1G52010584M28796K25722Q5116J38998K58803L73662L38375J30654j4961O7413
1982.5G54043162K29299K80380J82450m0948j28925Q8632K60115J90198J609j82569
2002.9G54923403k11835j16586q3745j97708l97206n69939n70775m11391l67999n71251
2023.3G51424968p65264o31153l48211k61008l79682n51045o51121o12736m33266k71320
2043.7G46520162k78831l82721m13120k61963j0252R1315n901j07408r5188K8074J99496
2066.2G45283663K54333J00792n2035l0935Q1480J62899J40250J9610n2810M1366J97112
2088.6G46145725K78056K01344N0486N4121K09808L30269L35098K40743J06632O1810
$$ plain form
2109 748014092 748170972 748432577 748646319 748683035 748592436 748559237 748684287 748854399 748913884 748837829 748728693
2131.4 748728693 748744011 748912096 749069214 749080598 748979151 748920739 749010980 749194562 749342620 749370337
2151.8 749370337 749346912 749451876 749789000 750251770 750656784 750953138 751239061 751678705 752340198 753069937
2172.2 753069937 753671348 754168153 754726410 755445540 756249845 756965101 757502019 757930696 758416295 759032249
2192.6 759032249 759668767 760176837 760550380 760937035 761480570 762153924 762784243 763240099 763576925 763997138
2213 763997138 764611661 765302956 765857875 766201019 766473830 766869187 767418921 767963231 768305123 768447936
2233.4 768447936 768607318 768939376 769406140 769807458 770009160 770108342 770288944 770624340 771014750 771323740
2253.8 771323740 771490037 771587193 771816254 772229612 772616625 772825062 772936463 773115754 773447812 773854375
$$ packed form
2109G48014092J56880K61605K13742L6716r0599l3199J25050J70112N9485p6055j09136
2131.4G48728693J5318J68085J57118J1384j01447n8412R0241J83582J48058K7717
2151.8G49370337k3425J04964L37124M62770M05014K96354K85923M39644O61493P29739
2172.2G53069937O01411M96805N58257P19130Q04305P15256N36918M28677M85599O15954
2192.6G59032249O36518N08070L73543L86655N43535O73354O30319M55856L36826M20213
2213G63997138O14523O91295N54919L43144K72811L95357N49734N44310L41892J42813
2233.4G68447936J59382L32058M66764M01318K01702R9182J80602L35396L90410L08990
2253.8G71323740J66297R7156K29061M13358L87013K08437J11401J79291L32058M06563
$$ plain form
2274.2 773854375 774157524 774275601 774338305 774563670 774993539 775403619 775556386 775473118 775407791 775555909
2294.6 775555909 775853753 776078045 776075721 775956750 775970817 776187718 776421189 776468754 776353359 776264250
2315 776264250 776323080 776514828 776671052 776567638 776309013 776176333 776190758 776151776 775922656 775565267
2335.4 775565267 775198758 774836421 774468124 774035513 773570955 773476779 773739576 774017513 774109900 773915410
2355.8 773915410 773501217 773010612 772488832 772045910 771753550 771358907 770693243 770091653 769795358 769626975
2376.2 769626975 769407034 769125819 768865824 768708706 768622100 768501282 768228710 767761707 767270029 766961694
2396.6 766961694 766787708 766500235 765990734 765414000 764923275 764513195 764083564 763505936 762751102 761956573
2417 761956573 761286438 760713398 760071933 759286165 758401573 757540166 756784379 756073356 755268455 754313111
$$ packed form
2274.2G73854375L03149J18077O2704K25365M29869M10080J52767q3268o5327J48118
2294.6G75555909K97844K24292k324j18971J4067K16901K33471M7565j15395q9109
2315G76264250N8830J91748J56224j03414k58625j32680J4425l8982k29120l57389
2335.4G75565267l66509l62337l68297m32611m64558r4176K62797K77937R2387j94490
2355.8G73915410m14193m90605n21780m42922k92360l94643o65664o01590k96295j68383
2376.2G69626975k19941k81215k59995j57118q6606j20818k72572m67003m91678l08335
2396.6G66961694j73986k87473n09501n76734m90725m10080m29631n77628p54834p94529
2417G61956573o70135n73040o41465p85768q84592q61407p55787p11023q04901r55344
$$ plain form
2437.4 754313111 753320098 752443790 751676440 750901818 750052154 749123752 748198271 747368395 746604919 745802820
2457.8 745802820 744914293 744015932 743224382 742529690 741815865 741004527 740118563 739277005 738580108 737962842
2478.1 737962842 737257600 736445129 735662162 734994650 734419346 733859420 733258486 732630610 732046008 731581450
2498.5 731581450 731210053 730772197 730207086 729628921 729129732 728682697 728220582 727701485 727106810 726474345
2518.9 726474345 725872874 725311160 724695802 723940909 723101020 722294748 721523941 720696986 719790936 718837261
2539.3 718837261 717873037 716975987 716178656 715362787 714421570 713439107 712554872 711710811 710771322 709816396
2559.7 709816396 708952487 708107471 707215130 706344485 705553412 704739630 703821898 702906072 702083290 701285303
2580.1 701285303 700442195 699602664 698837817 698127747 697431624 696765900 696129262 695484698 694846988 694244921
$$ packed form
2437.4G54313111r93013q76308p67350p74622q49664r28402r25481q29876p63476q02099
2457.8G45802820q88527q98361p91550o94692p13825q11338q85964q41558o96897o17266
2478.1G37962842p05242q12471p82967o67512n75304n59926o00934o27876n84602m64558
2498.5G31581450l71397m37856n65111n78165m99189m47035m62115n19097n94675o32465
2518.9G26474345o01471n61714o15358p54893q39889q06272p70807q26955r06050r53675
2539.3G18837261r64224q97050p97331q15869r41217r82463q84235q44061r39489r54926
2559.7G09816396q63909q45016q92341q70645p91073q13782r17732r15826q22782p97987
2580.1G01285303q43108q39531p64847p10070o96123o65724o36638o44564o37710o02067
$$ plain form
2600.5 694244921 693630695 692946851 692193806 691385567 690510333 689544857 688501418 687395096 686200917
2618.9 686200917 684915364 683600664 682311893 680993676 679549336 678031564 676542521 675023079
2635.2 675023079 673416793 671822071 670297921 668760478 667181373 665629566 664096117 662539482
2651.5 662539482 661000490 659517884 658070803 656638026 655209482 653779566 652347922 650926113
2667.8 650926113 649566650 648293376 647045434 645765245 644486547 643288493 642156243 640995204
2684.1 640995204 639792502 638595641 637405396 636194170 634940863 633655012 632361650 631033659
2700.5 631033659 629641771 628221393 626792490 625331819 623863637 622447491 621088028 619750917
2716.8 619750917 618415356 617113531 615869164 614661932 613505542 612395346 611306727 610244274
$$ packed form
2600.5F94244921o14226o83844p53045q08239q75234r65476j043439j106322j194179
2618.9F86200917j285553j314700j288771j318217j444340j517772j489043j519442
2635.2F75023079j606286j594722j524150j537443j579105j551807j533449j556635
2651.5F62539482j538992j482606j447081j432777j428544j429916j431644j421809
2667.8F50926113j359463j273274j247942j280189j278698j198054j132250j161039
2684.1F40995204j202702j196861j190245j211226j253307j285851j293362j327991
2700.5F31033659j391888j420378j428903j460671j468182j416146j359463j337111
2716.8F19750917j335561j301825j244367j207232j156390j110196j088619j062453
$$ plain form
2733.1 610244274 609243274 608331382 607442439 606494784 605504453 604530811 603592038 602690637 601824820
2751.4 601824820 600982487 600153744 599343896 598583281 597858131 597102642 596294999 595482111 594689250 593861282
2771.8 593861282 592931807 591903210 590819359 589693844 588512838 587271631 585943997 584495604
2788.2 584495604 582959712 581393301 579787850 578087747 576270521 574351966 572355807 570301831
2804.5 570301831 568168700 565946817 563670278 561333239 558920860 556434512 553858340 551173031
2820.8 551173031 548369288 545492589 542595208 539666474 536631644 533454478 530169666 526761174
2837.1 526761174 523183525 519376040 515259981 510792911 506075144 501373470 496941596 492996871
2853.4 492996871 489645064 486756235 484056264 481182665 477801919 473770499 469141483 464064360
$$ packed form
2733.1F10244274j001000r11892q88943r47655r90331r73642r38773r01401q65817
2751.4F01824820q42333q28743q09848p60615p25150p55489q07643q12888p92861q27968
2771.8E93861282r29475j028597j083851j125515j181006j241207j327634j448393
2788.2E84495604j535892j566411j605451j700103j817226j918555j996159k053976
2804.5E70301831k133131k221883k276539k337039k412379k486348k576172k685309
2820.8E51173031k803743k876699k897381k928734l034830l177166l284812l408492
2837.1E26761174l577649l807485m116059m467070m717767m701674m431874l944725
2853.4D92996871l351807k888829k699971k873599l380746m031420m629016n077123
$$ plain form
2869.7 464064360 458704412 453205615 447666317 442243338 437215894 432861209 429307252 426500976
2886.1 426500976 424355030 422828913 421802759 421078235 420454472 419749975 418879151 417819768 416543275
2904.4 416543275 414996624 413077354 410665721 407663137 404110342 400236040 396220654 392200679
2920.7 392200679 388499200 385455847 383251190 382021695 381892204 382925242 385133803 388485432
2937 388485432 392811388 397826701 403268009 408953995 414769441 420668185 426657736 432699442 438730717
2955.4 438730717 444695652 450532019 456218392 461650312 466653824 471218705 475493371 479624957
2971.7 479624957 483666301 487603366 491423815 495041788 498366892 501431227 504222095 506734729
2988 506734729 509007752 510895610 512343526 513566792 514593840 515237570 515477419 515400708 515051484
$$ packed form
2869.7D64064360n359948n498797n539298n422979n027444m354685l553957k806276
2886.1D26500976k145946j526117j026154p24524o23763p04497q70824j059383j276493
2904.4D16543275j546651j919270k411633l002584l552795l874302m015386m019975
2920.7C92200679l701479l043353k204657j229495j29491J033038K208561L351629
2937C88485432M325956N015313N441308N685986N815446N898744N989551O041706O031275
2955.4D38730717N964935N836367N686373N431920N003512M564881M274666M131586
2971.7D79624957M041344L937065L820449L617973L325104L064335K790868K512634
2988E06734729K273023J887858J447916J223266J027048O43730K39849p6711l49224
$$ plain form
3006.4 515051484 514435410 513548911 512394547 510940492 509217858 507341027 505365431 503262222 500977099
3024.7 500977099 498515040 495968491 493421942 490896404 488281816 485479474 482632190 479862124 477081925
3043.1 477081925 474170446 471120834 468100220 465197891 462303072 459375948 456386775 453291744
3059.4 453291744 450223058 447282434 444438249 441602319 438664168 435649991 432697147 429897040
3075.7 429897040 427190930 424402446 421472102 418505758 415592551 412778020 410037369 407213688
3092.1 407213688 404282212 401447326 398822457 396224797 393476665 390726507 388127834 385571927
3108.4 385571927 382952690 380409449 378045470 375687778 373184502 370529503 367826462 365253985
3124.7 365253985 362870514 360570669 358197182 355744600 353394747 351253957 349146098 346824676
$$ packed form
3006.4E15051484o16074q86499j154364j454055j722634j876831j975596k103209k285123
3024.7E00977099k462059k546549Tk525538k614588k802342k847284k770066k780199
3043.1D77081925k911479l049612l020614k902329k894819k927124k989173l095031
3059.4D53291744l068686k940624k844185k835930k938151l014177k952844k800107
3075.7D29897040k706110k788484k930344k966344k913207k814531k740651k823681
3092.1D07213688k931476k834886k624869k597660k748132k750158k598673k555907
3108.4C85571927k619237k543241k363979k357692k503276k654999k703041k572477
3124.7C65253985k383471k299845k373487k452582k349853k140790k107859k321422
$$ plain form
3141 346824676 344440043 342259675 340217471 338216990 336243242 334167182 331963181 329844683 327888489
3159.4 327888489 325972319 324024081 322089523 320278734 318578243 316850394 315060258 313274622
3175.7 313274622 311532915 309883446 308313280 306739211 305146307 303573549 302049547 300583959
3192 300583959 299125135 297606975 296091527 294676244 293359458 292086780 290809274 289489985 288194507
3210.3 288194507 287007153 285890251 284790277 283647805 282459766 281288952 280163139 279114962
3226.7 279114962 278160989 277282000 276412547 275399059 274269938 273245096 272321522 271415323 270557046
3245 270557046 269704312 268813699 267977983 267253399 266535819 265739948 264949083 264255106 263607681 262933016
3265.4 262933016 262286633 261756480 261236966 260602772 259906948 259210408 258542746 257923603 257326514 256739467
$$ packed form
3141C46824676k384633k180368k042204k000481j973748k076060k204001k118498j956194
3159.4C27888489j916170j948238j934558j810789j700491j727849j790136j785636
3175.7C13274622j741707j649469j570166j574069j592904j572758j524002j465588
3192C00583959j458824j518160j515448j415283j316786j272678j277506j319289j295478
3210.3B88194507j187354j116902j099974j142472j188039j170814j125813j048177
3226.7B79114962r53973q78989q69453j013488j129121j024842r23574r06199q58277
3245B70557046q52734q90613q35716p24584p17580p95871p90865o93977o47425o74665
3265.4B62933016o46383n30153n19514o34194o95824o96540o67662o19143n97089n87047
$$ plain form
3285.8 256739467 256178707 255678952 255244523 254785866 254219443 253561944 252908647 252383262 252028286 251640499
3306.2 251640499 251007259 250207126 249387860 248627916 247962534 247367665 246795610 246239692 245691538 245031059
3326.6 245031059 244273886 243577793 242918774 242277235 241740316 241220117 240597248 239932448 239233851 238550961
3347 238550961 238019139 237487137 236745879 235912681 235219344 234698310 234174445 233575255 233076990 232693613
3367.4 232693613 232158214 231375679 230593562 230003953 229502678 228994086 228444889 227880791 227447897 227264181
3387.8 227264181 227264568 227129772 226699129 226258710 226108700 226138696 225929722 225408539 224980265 224786147
3408.2 224786147 224678606 224580616 224417061 224190667 223993719 223842382 223755792 223813042 224009678 224251941
3428.6 224251941 224431127 224643156 224985510 225196064 225075528 224901721 225010023 225327387 225649536 225950807
$$ packed form
3285.8B56739467n60760m99755m34429m58657n66423o57499o53297n25385l54976l87787
3306.2B51640499o33240q00133q19266p59944o65382n94869n72055n55918n48154o60479
3326.6B45031059p57173o96093o59019o41539n36919n20199o22869o64800o98597o82890
3347B38550961n31822n32002p41258q33198o93337n21034n23865n99190m98265l83377
3367.4B32693613n35399p82535p82117n89609n01275n08592n49197n64098m32894j83716
3387.8B27264181L87j34796m30643m40419j50010K9996k08974n21183m28274j94118
3408.2B24786147j07541r7990j63555k26394j96948j51337q6590N7250J96636K42263
3428.6B24251941J79186K12029L42354K10554j20536j73807J08302L17364L22149L01271
$$ plain form
3449 225950807 226283103 226629481 226996765 227493495 228110805 228632927 229136452 229891807 230736375 231288046
3469.4 231288046 231486648 231679320 232164443 232975081 233779252 234251916 234690800 235358372 236038551 236669511
3489.8 236669511 237386644 238150969 238910392 239703596 240529776 241247237 241814360 242410198 243078873 243851840
3510.2 243851840 244871274 245917469 246703133 247410938 248286039 249310508 250217974 250887036 251580536
3528.5 251580536 252555281 253771812 255047739 256175697 257186979 258411139 259752631 260789961
3544.8 260789961 261642873 262827933 264189810 265454620 266894609 268568426 270293057 272100478
3561.1 272100478 273876548 275191247 276487917 278745949 281384796 283722579 285999268 288429916
3577.5 288429916 291073710 294041753 297113240 299587429 301566601 304429024 307832569 310873210
$$ packed form
3449B25950807L32296L46378L67284M96730O17310N22122N03525P55355Q44568N51671
3469.4B31288046J98602J92672M85123Q10638Q04171M72664M38884O67572O80179O30960
3489.8B36669511P17133P64325P59423P93204Q26180P17461N67123N95838O68675P72967
3510.2B43851840J019434J046195P85664P07805Q75101J024469R07466O69062O93500
3528.5B51580536R74745J216531J275927J127958J011282J224160J341492J037330
3544.8B60789961Q52912J185060J361877J264810J439989J673817J724631J807421
3561.1B72100478J776070J314699J296670K258032K638847K337783K276689K430648
3577.5B88429916K643794K968043L071487K474189J979172K862423L403545L040641
$$ plain form
3593.8 310873210 313932061 317355752 320805103 324369073 328116328 331452906 334432781 337755233
3610.1 337755233 341438413 345395893 349286377 352652371 356420636 360993713 365522176 369055808
3626.4 369055808 371547252 375239521 380032152 384554237 388790011 392861187 396936059 401292443
3642.7 401292443 405615211 409062386 411806732 415867507 420845538 424963355 428804010 433200657
3659 433200657 437391222 441271693 445316523 448854774 451461196 454884827 458453029 460626483 463563442
3677.4 463563442 467559457 471435875 475226462 478641152 480924129 482324958 484654963 487896174
3693.7 487896174 491028041 493738860 495800823 497481018 499829084 502602458 504687250 505586445
3710 505586445 506475091 508926034 511810064 514043868 515670955 517057896 518391132 519996226 522260487
$$ packed form
3593.8C10873210L058851L423691L449351L563970L747255L336578K979875L322452
3610.1C37755233L683180L957480L890484L365994L768265M573077M528463L533632
3626.4C69055808K491444L692269M792631M522085M235774M071176M074872M356384
3642.7D01292443M322768L447175K744346M060775M978031M117817L840655M396647
3659D33200657M190565L880471M044830L538251K606422L423631L568202K173454K936959
3677.4D63563442L996015L876418L790587L414690K282977J400829K330005L241211
3693.7D87896174L131867K710819K061963J680195K348066K773374K084792Q99195
3710E05586445Q88646K450943K884030K233804J627087J386941J333236J605094K264261
$$ plain form
3728.4 522260487 524433970 525611579 525873125 526776433 529306114 531932771 532588542 532208383 533936083
3746.7 533936083 535465896 535230398 536292255 538840115 540705502 541646183 542993665 544692636 545939386
3765.1 545939386 546896815 547587991 548539460 550221264 551955223 553077459 553669810 554548800 555547893
3783.5 555547893 556389868 557467639 558753550 560140312 561250627 561888576 562707961 563068271 563035965
3801.8 563035965 564202368 565049767 565557003 567231715 569120407 569863021 569960475 570705652 570748746
3820.2 570748746 570842147 572326660 573719501 574826181 575709105 576456428 577363968 577561021 577119529
3838.5 577119529 577464521 578386664 579619527 581361353 583173335 583595693 581181347 579931438 582117975
3856.9 582117975 584352136 585459232 585552216 585803449 586540997 586539805 586572409 587388098 588564575 589740694
$$ packed form
3728.4E22260487K173483J177609K61546R03308K529681K626657O55771l80159J727700
3746.7E33936083J529813k35498J061857K547860J865387R40681J347482J698971J246750
3765.1E45939386R57429O91176R51469J681804J733959J122236N92351Q78990R99093
3783.5E55547893Q41975J077771J285911J386762J110315O37949Q19385L60310l2306
3801.8E63035965J166403Q47399N07236J674712J888692P42614R7454P45177M3094
3820.2E70748746R3401J484513J392841J106680Q82924P47323R07540J97053m41492
3838.5E77119529L44992R22143J232863J741826J811982M22358k414346j249909K186537
3856.9E82117975K234161J107096R2984K51233P37548j192L2604Q15689J176477J176119
$$ plain form
3877.3 589740694 590057671 590353549 591017663 591228485 591858208 592415631 592299998 592944086 594238758
3895.6 594238758 594840288 594558954 593987346 593691409 594332576 595515251 596370280 596995831 597476840
3914 597476840 597460866 597310543 597605169 597968578 598109722 598507404 599092960 599217594 599115729 599477768
3934.4 599477768 600121677 600624979 600816131 600812197 601056695 601339102 601387084 601631701 602102041 602472246
3954.8 602472246 602731168 602980673 603224099 603525996 603872001 604094625 604182005 604279757 604485273 604754806
3975.2 604754806 605024338 605241895 605419219 605637729 605911076 606136799 606246114 606365860 606558740 606782794
3995.6 606782794 607076585
3997.6 607076585
$$ packed form
3877.3E89740694L16977K95878O64114K10822O29723N57423j15633O44088J294672
3895.6E94238758O01530k81334n71608k95937O41167J182675Q55029O25551M81009
3914E97476840j5974j50323K94626L63409J41144L97682N85556J24634j01865L62039
3934.4E99477768O43909N03302J91152l934K44498K82407M7982K44617M70340L70205
3954.8F02472246K58922K49505K43426L01897L46005K22624Q7380R7752K05516K69533
3975.2F04754806K69532K17557J77324K18510K73347K25723J09315J19746J92880K24054
3995.6F06782794K93791
3997.6F07076585
##END=$$ End of the data block
