##TITLE=$$ Begin of the data block
##JCAMP-DX=5.00 $$ ACD/SpecManager v 10.08
##SPECTROMETER/DATA SYSTEM=16PC
##DATE=09 Jul 2013 09:55:16
##DATA TYPE=INFRARED SPECTRUM
##DATA CLASS=XYDATA
##ORIGIN=
##OWNER=
##NPOINTS=3601
##FIRSTX=400.00000000
##LASTX=4000.00000000
##MAXX=4000.00000000
##MINX=400.00000000
##MAXY=227.51321411
##MINY=16.84155273
##XFACTOR=1.0000000000
##YFACTOR=0.000001000000000
##FIRSTY=192.72724915
##DELTAX=1.00000000
##XUNITS=1/CM
##YUNITS=TRANSMITTANCE
##XYDATA=(X++(Y..Y))
400A92727249l7526047n1514587m523514J0342598K2142342P745880n4952118n4400658
408C0041145Q864498K5435421J5316941P897522j0987877j4067673m809189L385136
416F1075924J2289287K8209588P4530746N1407669o3701721q0783989k2075199J1355373
424G2307678P0586975N2371613p9024193p7418564O2592865P3210472k5005569m6496277
432A03125000k0777298j5345215j9233513q811950J9151901K8097961K5766182J7756653
440A29729721j735588j5090919l5189248k8130653J7501549K2140716q496261j7710472
448F3018845k9156136m915356Q7272786Q0446502k9232971n9448891m3600631l0407334
456C3976814j745769J8610073M8809761M0028808k0156524l3226891j2551880l172592
$$ y = [192727249, 155201202, 103686615, 99163101, 109505699, 131648041, 139393921, 84441803, 30041145, 38905643, 64341064, 79658005, 87555527, 76567650, 62499977, 57690788, 61075924, 73365211, 101574799, 176105545, 227513214, 163811493, 83027504, 60952305, 72307678, 142894653, 195266266, 116242073, 38823509, 101416374, 174626846, 149621277, 103125000, 82347702, 67002487, 47768974, 38957024, 58108925, 86206886, 111973068, 129729721, 127994133, 112903214, 77713966, 49583313, 67084862, 89225578, 80729317, 63018845, 33862709, 28947353, 116220139, 196666641, 167433670, 107984779, 64384148, 33976814, 32231045, 50841118, 99650879, 139679687, 119523163, 86296272, 73744392, 70571800]
464G0571800Q532624J3118263J2088470Q872101p63580l316429m60625R98382M011582
473A13652588L580093o30592k283791l391555k242348L152946L125977l007912k841903
482A09113503L513168M093765L5454j240685j061149j541115k926567k118416J566238
491A09434196K296662R81384j83227k917580k536507J768708K077720j081039j901001
500A07939316j652954j060654R63852P92404j811401k273896j239685p04238r9877
509A00852867K98050M09340Q30078J876640J687195J30440m06624m42123k90535N73845
519A05519173L62419q40569j583885k528427k482056j409843o43967L91052P25342
528I7509239K83028L37364Q40904P10030j73523k53105M65011M49158o5185m88518
$$ y = [70571800, 79104424, 92222687, 104311157, 113183258, 112419678, 109103249, 108642624, 109641006, 113652588, 117232681, 116602089, 114318298, 110926743, 108684395, 111837341, 114963318, 111955406, 109113503, 112626671, 116720436, 116755890, 115515205, 114454056, 112912941, 109986374, 107867958, 109434196, 111730858, 112712242, 112529015, 109611435, 107074928, 108843636, 110921356, 109840317, 107939316, 106286362, 105225708, 106189560, 106981964, 105170563, 102896667, 101656982, 100952744, 100852867, 101150917, 101560257, 102390335, 104266975, 105954170, 106084610, 105677986, 105235863, 104945328, 105519173, 105881592, 105041023, 103457138, 100928711, 98446655, 97036812, 96392845, 96783897, 97509239, 97792267, 98129631, 98970535, 99680565, 99507042, 99253937, 99718948, 100168106, 100102921, 99614403]
538I9614403j200699j272156m92424o32980j746704j850678j149650q07785k33536
547I0227791o29090k395416k726745j753830j759507k477623k690261k619721k594925
556G0580673k716659k252869r30618n73853j000019j115440j419022j008842L16429
565E9879780Q49415Q67031R68693Q33847J145004K146599K178337J179199J053398
574G1101303J506836J811791K425689K246529J256744O28449k09519j44722J060105
583H1683205J343536J280335O32667j219490j558418n82222k16530L03001j55472j702476
593G9808136k764389m435852l911995j133705Q57452L432823M148552L103165K346207
602H1450394J166916L58505m58931n58975K25738M99321P23786M46678o40297q51891
$$ y = [99614403, 98413704, 97141548, 96649124, 96016144, 94269440, 92418762, 91269112, 90461327, 90227791, 89598701, 87203285, 84476540, 82722710, 80963203, 78485580, 75795319, 73175598, 70580673, 67864014, 65611145, 64680527, 64106674, 63106655, 61991215, 60572193, 59563351, 59879780, 60729195, 61596226, 62564919, 63398766, 64543770, 66690369, 68868706, 70047905, 71101303, 72608139, 74419930, 76845619, 79092148, 80348892, 80977341, 80767822, 80623100, 81683205, 83026741, 84307076, 84939743, 83720253, 82161835, 81579613, 81363083, 81666084, 81510612, 79808136, 77043747, 72607895, 68695900, 67562195, 68419647, 71852470, 76001022, 79104187, 81450394, 82617310, 82975815, 82516884, 81957909, 82183647, 82682968, 83406754, 83853432, 83213135, 82361244]
612H2361244k63717k58728p07818p44651m84230l32955j39046j03347j93505l38295
622G8794952p20878o79993k02774k220P9727J23528J03065M2221j75644j07902K00294
633G7454376M86901J012153R96803L61115K03079L42346M02260M92668N50652N94902
643H2897255O13380N83077O08085O87127P21000O74744P87453J143745J165672R32053
653I0813591P05284K51724K43355P91428P78915K39449J55136M67087M28527Q4305
663I4958801J602n3314K87155J419281J389985J98478j99219k32650j39809L90930
673I8021240L50769k68058m26125k99217k23847q8241l121P5600Q2252k3269j4992
684I7182991J16753J07170K7702j42692m87809o51550p82539o42533k1194J762m00070
$$ y = [82361244, 82097527, 81838799, 81130981, 80386330, 79902100, 79569145, 79430099, 79326752, 79133247, 78794952, 78074074, 77394081, 77191307, 77189087, 77268814, 77392342, 77495407, 77537628, 77361984, 77254082, 77454376, 77941277, 78953430, 79950233, 80311348, 80514427, 80856773, 81259033, 81751701, 82302353, 82897255, 83510635, 84093712, 84701797, 85388924, 86109924, 86784668, 87572121, 88715866, 89881538, 90813591, 91518875, 91770599, 92013954, 92805382, 93584297, 93823746, 93978882, 94445969, 94874496, 94958801, 94960403, 94907089, 95194244, 96613525, 98003510, 98201988, 98002769, 97770119, 97630310, 98021240, 98372009, 98103951, 97677826, 97378609, 97154762, 97066521, 97063400, 97139000, 97221252, 97197983, 97182991, 97299744, 97406914, 97434616, 97291924, 96804115, 96152565, 95370026, 94727493, 94706299, 94708061, 94307991]
695I4307991q41545j589584j961686k149887k068641j752045j149506j97555P99202
704H3396744K348518K724007J988312J617027J189827R12353P74124O11428M25125
713I5987465L75481M83894N04257N00252M63150L36029L55286N63171N54321M03267
723A00526573K17003j62476k10220J03737J34682l0754r4719j56716j16874J50917
733A00361153M2015m22287p22916j092743j119369p50115o08490o15745m63745k23252
743I4384506Q0460O03439P46491N78018M23431K838J10291R00535R60495L34496K58286
754I9383286O35742O15211J85112K43324Q18352Q98339O19003M49135L06106N1522
764A04205132m48678n19943j95671j7006K53273K07237j40975m40049p46231j185890
$$ y = [94307991, 93466446, 91876862, 89915176, 87765289, 85696648, 83944603, 82795097, 82597542, 83396744, 85745262, 88469269, 90457581, 92074608, 93264435, 94176788, 94950912, 95562340, 95987465, 96362946, 96846840, 97351097, 97851349, 98314499, 98650528, 99005814, 99568985, 100123306, 100526573, 100743576, 100581100, 100370880, 100474617, 100609299, 100578545, 100483826, 100327110, 100210236, 100361153, 100403168, 99980881, 99257965, 98165222, 97045853, 96295738, 95687248, 95071503, 94607758, 94384506, 94464966, 95068405, 95814896, 96392914, 96816345, 96819183, 96929474, 97830009, 98790504, 99125000, 99383286, 100019028, 100634239, 100819351, 101062675, 101881027, 102779366, 103398369, 103847504, 104153610, 104205132, 103756454, 103236511, 103040840, 103023834, 103277107, 103484344, 103343369, 102903320, 102157089, 100971199]
774A00971199j802612k296044k750778l129104l549691l575874l280640k808883k066559
783G5711014j285149l93989N55679J752357K493218K938553L150032L079368K857949
792I0859032K426841J890206J030823O13449N76568M01406L31543q8883r15764j469993
802I5655228j910187k281189k398064k955742m295852m357224l308769k536201j398491
811G0213509j074150j799485j450920r2415M08150J57097N96756J638634K194091K453736
821G3245003K743622L056121L095482K940445K571793J747421J455063J648094J525261
830I4028305J287338R32144L17078J4374k3438j78856l68263n43930q03520q04375
840I3856857n10307m08890m37591l59207k03324q8783Q6876L2425l09731m18373l23746
$$ y = [100971199, 99168587, 96872543, 94121765, 90992661, 87442970, 83867096, 80586456, 77777573, 75711014, 74425865, 74031876, 74587555, 76339912, 78833130, 81771683, 84921715, 88001083, 90859032, 93285873, 95176079, 96206902, 96820351, 97396919, 97798325, 98129868, 98040985, 97125221, 95655228, 93745041, 91463852, 89065788, 86110046, 81814194, 77456970, 74148201, 71612000, 70213509, 69139359, 67339874, 65888954, 65796539, 66204689, 66361786, 66958542, 68597176, 70791267, 73245003, 75988625, 79044746, 82140228, 85080673, 87652466, 89399887, 90854950, 92503044, 94028305, 95315643, 96247787, 96564865, 96579239, 96555801, 96376945, 96008682, 95464752, 94661232, 93856857, 93346550, 92937660, 92500069, 92140862, 91937538, 91848755, 91935631, 91968056, 91658325, 91239952, 90916206]
851I0916206m26124o70655q76754j150444j248482j099510j232384j656227j805946
860H0749680j839020j690796j201439j075218j288582j231766j026817p95464m80148
869G0120430j89545J68564L33954K80594L72810N31464P08481R88060J081581J167778
879G5564171Q20396o1966o47499j085495j610847k399636k512764k090049j511696
888F4464615m21829J35963K83577N76782Q14820J244926J993706K307251K308746K259186
898G5967743K040832J863434J654793J493790J330589J285362J335976J450760J745292
907I0168571J788758J589180J545074J619858J561050J462006J201370O68091M27559
916A02031517M27055L12020R0713Q4404L30399L58131K17438J79314K12951J70403
$$ y = [90916206, 90490082, 89819427, 88942673, 87792229, 86543747, 85444237, 84211853, 82555626, 80749680, 78910660, 77219864, 76018425, 74943207, 73654625, 72422859, 71396042, 70600578, 70120430, 69930885, 70099449, 70433403, 70713997, 71086807, 71618271, 72326752, 73314812, 74396393, 75564171, 76384567, 76322601, 75675102, 74589607, 72978760, 70579124, 68066360, 65976311, 64464615, 64042786, 64178749, 64462326, 65039108, 65853928, 67098854, 69092560, 71399811, 73708557, 75967743, 78008575, 79872009, 81526802, 83020592, 84351181, 85636543, 86972519, 88423279, 90168571, 91957329, 93546509, 95091583, 96711441, 98272491, 99734497, 100935867, 101603958, 102031517, 102458572, 102770592, 102861305, 102945709, 103276108, 103634239, 103851677, 104030991, 104243942, 104414345]
926A04414345L9650J6594P2593J26099K84531J99417j72714l09609l47282k64168O8329
937A04127785J14013j00135j46004r6565q8066j25458n3147J63918K29973K07741J42143
948A04376198m9233q1779K7016O2507Q9554O3301m5608p5104k6970n6191j88140j66703
960A03928848l097R1102J98151K00600R6252J1299j23688j57356o8596r3506k48909
971A03831100k31529j6212p126j96388k11480n8151q6136l07060l25035j05553j82647
982A02103783n66338o82594n41260o77010j045326j289894j481483j693413j999809
991I2126656k031159j923157j502678p23556N6335J153397J659592J729988J652069
1000I2197487J242378R47235O50429L70338J23406j74523n28648q34083j130127j364777
$$ y = [104414345, 104453995, 104470589, 104543182, 104669281, 104953812, 105153229, 104980515, 104670906, 104323624, 104059456, 104127785, 104241798, 104141663, 103995659, 103899094, 103811028, 103685570, 103632423, 103796341, 104026314, 104234055, 104376198, 104326965, 104245186, 104272202, 104334709, 104424263, 104487564, 104441956, 104366852, 104339882, 104283691, 104095551, 103928848, 103925751, 104016853, 104215004, 104415604, 104511856, 104523155, 104399467, 104242111, 104173515, 104080009, 103831100, 103599571, 103583359, 103576233, 103379845, 103168365, 103110214, 103024078, 102717018, 102391983, 102286430, 102103783, 101537445, 100854851, 100313591, 99636581, 98591255, 97301361, 95819878, 94126465, 92126656, 90095497, 88172340, 86669662, 85946106, 86002441, 87155838, 88815430, 90545418, 92197487, 93439865, 94387100, 95037529, 95407867, 95531273, 95356750, 94828102, 93994019, 92863892, 91499115]
1010I1499115j566391j673576j776406j576049j107117n30152L05893R57085J636505
1019H6168907J935433J848434J805855J745087J486015R70146O11519K77641Q4305
1028I6933342O1363k6436j40998j99891k83294j52916K47520M54430N85892O33049
1038I8112061N77758N01320L54408K53014J49483J18255J94794J62430k0165K8748
1048A00432106L35503M12780L46299K80189J45363P3868N4832o41o3133j61720k92854
1059A01562592m41712n87753q28339j101280j558136k114174k957016m159874n242493
1068H2571815o892990o839134n506039l465435J51776K440784M223084N117515M951737
1077G6753113M796196M316520L779747L024842K428840J915146J412964Q36609N99548
$$ y = [91499115, 89932724, 88259148, 86482742, 84906693, 83799576, 83269424, 83575317, 84532402, 86168907, 88104340, 89952774, 91758629, 93503716, 94989731, 95959877, 96571396, 96849037, 96933342, 96994705, 96968269, 96827271, 96627380, 96344086, 96191170, 96438690, 96893120, 97479012, 98112061, 98689819, 99191139, 99545547, 99798561, 99948044, 100066299, 100261093, 100423523, 100403358, 100432106, 100767609, 101180389, 101526688, 101806877, 101952240, 102026108, 102080940, 102080299, 102017166, 101855446, 101562592, 101120880, 100533127, 99704788, 98603508, 97045372, 94931198, 91974182, 87814308, 82571815, 75678825, 68839691, 63333652, 59868217, 60019993, 62460777, 66683861, 71801376, 76753113, 81549309, 85865829, 89645576, 92670418, 95099258, 97014404, 98427368, 99263977, 99863525]
1086I9863525P79679O51909K77542J36451J82053J20781J8837r5200k76588l33077
1096A01325912k55386k73018l21693m29062o60133p27204o65520o21887n19157n19180
1106I6333672o36147o51794o13091n50369m00925l85498n23613n16579m37713k92496
1116I1325447J7838J03614J0109n4382j92688k01920m3846p4409k63855l75443n14221
1127H9736244m96887k56393k44355m79248m35730j86996L4286K86934N67986R67933
1137H9493774J127602J107262J024673P92099O42609N26459M09339L30422J67396r2674
1147I5528961k75879m53132n14771m58221m03710k89444k42683k84027k03995N4024
1157I2457123N4077j81580l06274m46365m43123k65457j96740k37396j02760J87614
$$ y = [99863525, 100643204, 101295113, 101572655, 101709106, 101891159, 102011940, 102030777, 101935577, 101658989, 101325912, 101070526, 100797508, 100475815, 100046753, 99386620, 98659416, 97993896, 97372009, 96852852, 96333672, 95697525, 95045731, 94432640, 93882271, 93481346, 93095848, 92572235, 92055656, 91617943, 91325447, 91343285, 91446899, 91457008, 91402626, 91209938, 91008018, 90964172, 90889763, 90625908, 90250465, 89736244, 89239357, 88982964, 88738609, 88259361, 87823631, 87636635, 87670921, 87957855, 88525841, 89493774, 90621376, 91728638, 92753311, 93545410, 94188019, 94714478, 95123817, 95454239, 95621635, 95528961, 95253082, 94799950, 94285179, 93826958, 93423248, 93133804, 92891121, 92607094, 92403099, 92457123, 92511200, 92329620, 92023346, 91576981, 91133858, 90868401, 90671661, 90434265, 90331505, 90519119]
1167I0519119M27101O72844R02771J191666J262230J107742J032448R75128Q76312
1176I8967361P30515O18813M93171M64318N84938N33508L19412K26425J97602J76880
1186A03312943K13813J66130L8910m6180j62507j38588N0759J33079K15844J41426
1196A03925629j62125k49359j25954k14744m97727o24153o40610p11868q86391q05854
1206I9006844n06043k02133K71652M67278M49539M07097K28119J71089J50085K50077
1216A00693604N48675O50314O46614N66460L03597K54158M17900L99421K48101J61720
1226A04890564Q2130M4106N7770M7783J8188K7947Q8615R4917N2521M3678M7661O4781
1238A05560661J40068R2911j27075j37833O8878P7820p1258j22193j37687j23284m6325
$$ y = [90519119, 90946220, 91619064, 92521835, 93713501, 94975731, 96083473, 97115921, 98091049, 98967361, 99697876, 100316689, 100809860, 101274178, 101859116, 102392624, 102712036, 102938461, 103136063, 103312943, 103526756, 103692886, 103731796, 103685616, 103523109, 103384521, 103435280, 103568359, 103784203, 103925629, 103763504, 103514145, 103388191, 103173447, 102675720, 102051567, 101410957, 100699089, 99812698, 99006844, 98500801, 98298668, 98570320, 99037598, 99487137, 99894234, 100122353, 100293442, 100443527, 100693604, 101242279, 101892593, 102539207, 103105667, 103409264, 103663422, 104081322, 104480743, 104728844, 104890564, 104972694, 105016800, 105074570, 105122353, 105140541, 105168488, 105257103, 105352020, 105404541, 105448219, 105495880, 105560661, 105700729, 105793640, 105666565, 105528732, 105597610, 105675430, 105604172, 105481979, 105344292, 105221008, 105174683]
1249A05174683l2067n6244r0690j68663j85486j33400j48415k04513k69959l42560
1259A03542686m62890o49475p87689r42513r68887r65859o82235m2367L99613Q76144
1269I9316528J011368P99629O39229L74291K29644K12906O8642j86295l64166n43808
1279A01557968n97786m78218n04303o93848o56723m36950k48718r369J64535K89436
1289I8386024M15993N34676O32644P40479P48444O78634N52300K76779K01324L26943
1299A03494240L00239J28624J35735L44391L39630J38306Q7837J49681J30531O2493
1309A05311707J0414q9501m7020J91407K21183R5459O249j47156j54015k983M9500
1320A05445244N7030O1317L9940M0695P3006N1162l7719n6504k739k3536j25267j35369
$$ y = [105174683, 105142616, 105086372, 104995682, 104827019, 104641533, 104508133, 104359718, 104155205, 103885246, 103542686, 103079796, 102430321, 101642632, 100700119, 99731232, 98765373, 98083138, 98040771, 98440384, 99316528, 100327896, 101127525, 101766754, 102141045, 102370689, 102583595, 102652237, 102465942, 102101776, 101557968, 100960182, 100481964, 99977661, 99283813, 98627090, 98190140, 97941422, 97932053, 98096588, 98386024, 98802017, 99336693, 99969337, 100709816, 101458260, 102136894, 102689194, 102965973, 103167297, 103494240, 103794479, 103923103, 104058838, 104403229, 104742859, 104881165, 104969002, 105118683, 105249214, 105311707, 105322121, 105232620, 105185600, 105377007, 105598190, 105693649, 105699898, 105552742, 105398727, 105395744, 105445244, 105502274, 105563591, 105603531, 105644226, 105717232, 105768394, 105730675, 105674171, 105671432, 105647896, 105522629, 105387260]
1332A05387260p0526l6644K3842j3733k17796j90048P9132J52855J01562Q0162N2307
1343A05348373Q248o6498j04279j39099j02806O0059N9341j20163j27578K1507L8460
1354A04875565l9338p2982q3779j25412k20199k25235j35758j13769j16043j53565
1364A03589485k56248k93763k84408k85454k35557l22937n15343p53670j087494j377891
1374I8176720j689965j902336k100395k064232j898834j404244m27413K19375P68662
1383H7677338J102234J162193J297996J512215J445107J076293Q46741O20964M99962
1392I7241043N01869M53209L98567L32711K16156K11807L63472L32756J27846N4260
1402A00233696N1926N5603J26289Q5091q5427j36871n3505j46721m13444n54917o74583
$$ y = [105387260, 105316734, 105280090, 105303932, 105290199, 105072403, 104882355, 104961487, 105114342, 105215904, 105296066, 105348373, 105356621, 105290123, 105185844, 105046745, 104943939, 105003998, 105063339, 104943176, 104815598, 104837105, 104875565, 104836227, 104763245, 104679466, 104554054, 104333855, 104108620, 103972862, 103859093, 103743050, 103589485, 103333237, 103039474, 102755066, 102469612, 102234055, 101911118, 101395775, 100642105, 99554611, 98176720, 96486755, 94584419, 92484024, 90419792, 88520958, 87116714, 86689301, 86908676, 87677338, 88779572, 89941765, 91239761, 92751976, 94197083, 95273376, 96120117, 96741081, 97241043, 97742912, 98196121, 98594688, 98927399, 99143555, 99355362, 99718834, 100051590, 100179436, 100233696, 100285622, 100341225, 100467514, 100552605, 100467178, 100330307, 100276802, 100130081, 99716637, 99161720, 98487137]
1413I8487137o57700n06523l27110j5709J18469J52084Q7739j84868k27425k9091p1785
1424I6825218k85934m68086o89606q68775j021217j166321j330230j388955j367668
1433H8238426j289627j121475r73534q05641o68236n70320m25651k35894q0703J04927
1443H2172272J40312K144l5881k6062l2898j05499J6708L82568N35851M23019P14356
1454H4186890J537460J711304J383896J143814P93197N34745K64053J95808M03672
1463I2154839L78341J88278O8688m7562j27151k34223j45553K59262K75177m1245k11456
1474I2517395l96965m30557k69654k52128l13545l74031m55140n50605o65039p86454
1484H8023277r58152j018906r65332r72389r88083j045700j184464j214485j175735
$$ y = [98487137, 97829437, 97322914, 96995804, 96980095, 97098564, 97250648, 97338387, 97153519, 96926094, 96897003, 96825218, 96539284, 96071198, 95381592, 94512817, 93491600, 92325279, 90995049, 89606094, 88238426, 86948799, 85827324, 84853790, 84048149, 83379913, 82809593, 82383942, 82148048, 82067345, 82172272, 82312584, 82314728, 82278847, 82252785, 82219887, 82114388, 82131096, 82513664, 83049515, 83472534, 84186890, 85724350, 87435654, 88819550, 89963364, 90756561, 91291306, 91555359, 91751167, 92154839, 92533180, 92721458, 92790146, 92742584, 92615433, 92381210, 92235657, 92494919, 92770096, 92728851, 92517395, 92120430, 91689873, 91420219, 91168091, 90854546, 90480515, 90025375, 89474770, 88809731, 88023277, 87065125, 86046219, 85080887, 84108498, 83120415, 82074715, 80890251, 79675766, 78500031]
1493G8500031j098206r21654q57254r01489q57300p42889o82640o96183n80673l09341
1503G0852402j92215j29082k10693m82628o72005q65410r89372r88960j157662j540615
1513F3623760j663803j528881j603271j898503j901245j577663j576519j937893j852940
1522D8083042j497722r76944j64628N39734J286507J873611K300835K771065L370716
1531E7586216L551079L515194K999405J581382J213929J732658J842239J941155J730705
1540G7693962J039024Q52257J058937J118683J217552J151711Q92898P57859O96876
1549H6479759N92041M81369L30445J62124q0848m77646o54602n80857p53692j101372
1559H4396721j413849j781654k052781k197532k486778l029938l118706k727341k667072
$$ y = [78500031, 77401825, 76480171, 75622917, 74721428, 73864128, 73121239, 72438599, 71742416, 71161743, 70852402, 70660187, 70531105, 70320412, 69837784, 69165779, 68300369, 67310997, 66322037, 65164375, 63623760, 61959957, 60431076, 58827805, 56929302, 55028057, 53450394, 51873875, 49935982, 48083042, 46585320, 45608376, 45443748, 45983482, 47269989, 49143600, 51444435, 54215500, 57586216, 61137295, 64652489, 67651894, 69233276, 70447205, 72179863, 74022102, 75963257, 77693962, 78732986, 79585243, 80644180, 81762863, 82980415, 84132126, 85025024, 85782883, 86479759, 87071800, 87553169, 87883614, 88045738, 87964890, 87487244, 86832642, 86251785, 85498093, 84396721, 82982872, 81201218, 79148437, 76950905, 74464127, 71434189, 68315483, 65588142, 62921070]
1568F2921070k845074k821468k748943k456997j941181j390122o06064j91780k55325
1577D7664116K37968J273987J874401K265190K520634K673481K518368J969528J575134
1586F4572807J237610P98897K41089k06452o67190q76953r15360p28199k02869J55971
1596F3409351N49366O77536N80071L98445P8178l04435q58498j223946j407768j742409
1606F0155891k234745k524852k669072k802158k994942k829696k392411j757144p32281
1615C9218590j0418L97396J227714K397011L502632M893067N576824N783962N585411
1624F8572189M682396M198929L987076L514503K806237K294540J862076J545715J319046
1633I4782707J250626J525787J334404O22315M16000O35193N74371L25707K25731J83441
$$ y = [62921070, 60075996, 57254528, 54505585, 52048588, 50107407, 48717285, 48111221, 47919441, 47664116, 47902084, 49176071, 51050472, 53315662, 55836296, 58509777, 61028145, 62997673, 64572807, 65810417, 66609314, 66850403, 66643951, 65976761, 65099808, 64184448, 63456249, 63253380, 63409351, 63958717, 64636253, 65216324, 65614769, 65692947, 65388512, 64530014, 63306068, 61898300, 60155891, 57921146, 55396294, 52727222, 49925064, 46930122, 44100426, 41708015, 39950871, 39218590, 39208172, 39605568, 40833282, 43230293, 46732925, 51625992, 57202816, 62986778, 68572189, 73254585, 77453514, 81440590, 84955093, 87761330, 90055870, 91917946, 93463661, 94782707, 96033333, 97559120, 98893524, 99515839, 99931839, 100567032, 101141403, 101467110, 101692841, 101876282]
1643A01876282K26303M54285M39765K03515R0004p920o195R6680K10258M64653M29871
1654A04477501Q5663n7122j18232j29631p6386J3443K25594K44972Q4785P126p1571
1665A04686142p9208l0732O1562L20534K66952j63528k34245l3761N5382J54350J60744
1676A05164192O0341J2093n059o6230k62856j54182L73191M24820N3353n7602o7589
1687A05474472k2385J91208J66085r5894j95404k75040j63986K96234L00789j99608
1697A05476471k03011K45926L23510J60438N7579j22978j30486N9220R8564M7279J3733
1708A06026245n2933n7693J1536J1329n0712o1730o6086P86K21085K01340p7935j45630
1720A05959602o3797n5458q0993p5859m4800l3425k7183l8979p8727r4056j03973q4877
$$ y = [101876282, 102102585, 102556870, 102996635, 103200150, 103290154, 103282234, 103276039, 103372719, 103582977, 104047630, 104477501, 104563164, 104506042, 104387810, 104258179, 104181793, 104195236, 104420830, 104665802, 104750587, 104757713, 104686142, 104606934, 104576202, 104637764, 104958298, 105225250, 105061722, 104827477, 104793716, 104849098, 105003448, 105164192, 105224533, 105236626, 105231567, 105165337, 104902481, 104748299, 105121490, 105546310, 105599663, 105542061, 105474472, 105452087, 105643295, 105809380, 105713486, 105518082, 105243042, 105079056, 105375290, 105676079, 105476471, 105273460, 105519386, 105842896, 106003334, 106060913, 105937935, 105807449, 105866669, 105965233, 106012512, 106026245, 105973312, 105915619, 105927155, 105938484, 105887772, 105826042, 105759956, 105760742, 105981827, 106183167, 106105232, 105959602, 105895805, 105840347, 105759354, 105683495, 105638695, 105605270, 105578087, 105539108, 105460381, 105366325, 105262352, 105177475]
1732A05177475J3229l3310k73079k88246j17355k4246R0194R3293o9832m7157J74522
1743A04695488J90300L7170k8175o9908q8143q7669m9469P8079O9359j03592j03378
1754A04540062M8111J01067J28364Q8051q8791q4808J06979J41266Q1848J8547j16440
1765A04964256j42051n6839m7944j31271n6221K58659K36725j15753k47406k83172
1775A04378983k74987j79939j18088n9631l929M3442J03897J94313K25807J92573K06398
1786A04708839K67197K63237K16957J50185J0322j4351O5873J03637J80077J17973
1796A06069946j31752j95930j57166n8410K10380K51816J01112J4542j22208j08368
1806A05873962J05599J20712m1939o7756J6731L029r7748j21735j20620n1827J44097
$$ y = [105177475, 105190704, 105157394, 104884315, 104596069, 104478714, 104454468, 104544662, 104637955, 104568123, 104520966, 104695488, 104885788, 104922958, 104894783, 104824875, 104736732, 104649063, 104599594, 104677673, 104747032, 104643440, 104540062, 104588173, 104689240, 104817604, 104905655, 104816864, 104732056, 104839035, 104980301, 105062149, 105080696, 104964256, 104822205, 104765366, 104717422, 104586151, 104529930, 104788589, 105025314, 104909561, 104662155, 104378983, 104103996, 103924057, 103805969, 103746338, 103742409, 103785851, 103889748, 104084061, 104309868, 104502441, 104708839, 104976036, 105239273, 105456230, 105606415, 105616737, 105602386, 105668259, 105771896, 105951973, 106069946, 105938194, 105742264, 105585098, 105526688, 105737068, 105988884, 106089996, 106104538, 105982330, 105873962, 105979561, 106100273, 106058334, 105990578, 106007309, 106010338, 105912590, 105790855, 105670235, 105618408, 105762505]
1817A05762505J86706J05263O2988J4115k1622n8914n9014j3992N409J0590K6390O6543
1829A06086967N1072l3905n3025j3206k2148q6212p2480K7535M6852Q125j2588l6499
1841A05890488n4840o6994q4206j35566r3628O7138J16944J04332O4872o5109o6589
1852A05676842P4959Q2252j1993o1417j18919j19568o9046r796J12197J23024K3217
1863A05701752j5541m0627l4645L5118K0104q2901j12839r4368r0103p2403q9501j53541
1875A04970505j67923j57883j19064l144p843j58836j55952q629K0477l9024m2893
1886A04129791l0617J1567J20712J34636N5694L6644M3084N9814J28342R7755o4972
1897A04722450p7102L2684R6107J96793J68396m0840n7579J00250J31012Q7814N9533
$$ y = [105762505, 105949211, 106054474, 106117462, 106131577, 106109955, 106051041, 105992027, 105978035, 105983444, 105994034, 106020424, 106086967, 106138039, 106104134, 106051109, 106037903, 106015755, 105929543, 105857063, 105884598, 105931450, 105939575, 105926987, 105890488, 105835648, 105768654, 105684448, 105548882, 105455254, 105522392, 105639336, 105743668, 105808540, 105743431, 105676842, 105751801, 105834053, 105822060, 105760643, 105641724, 105522156, 105453110, 105443314, 105555511, 105678535, 105701752, 105686211, 105645584, 105610939, 105646057, 105666161, 105583260, 105470421, 105376053, 105285950, 105213547, 105124046, 104970505, 104802582, 104644699, 104525635, 104522491, 104514648, 104355812, 104199860, 104191231, 104211708, 104172684, 104129791, 104099174, 104110741, 104231453, 104366089, 104421783, 104458427, 104501511, 104561325, 104689667, 104787422, 104722450, 104645348, 104678032, 104774139, 104970932, 105139328, 105098488, 105040909, 105141159, 105272171, 105359985, 105419518]
1908A05419518m319R011J30272J23382j335m9423q2161m9111J06858J06743n6603p5890
1920A05576942O630N2521J23978J10603p103m1008j7235j9531m4701k1743O7756P9010
1932A05866119P271J6121J11817J05407K0355m8393j85631j47369J01067J77047J61026
1943A06184837J13755l2616o7665l388k243n2162l9032N4886M4563r9022p4928J47843
1955A06174828J43905p4577j30821r6512o1798L0136M2152l8116k4323Q5190R7511
1966A06147575L7148j099n5244o8115l6835l0419l5888l6209n1720j8211Q3183J12724
1978A06046890R5177P0953J0109q102J7853K411n8342o3492k0623o18K0333J7761j9524
1991A06110786k2575p683K1225J03615Q5373n4932p7598N836J572p6363r0339n6839
$$ y = [105419518, 105415199, 105424210, 105554482, 105677864, 105676529, 105627106, 105544945, 105495834, 105602692, 105709435, 105652832, 105576942, 105583572, 105636093, 105760071, 105870674, 105863571, 105822563, 105805328, 105785797, 105741096, 105719353, 105787109, 105866119, 105873390, 105889511, 106001328, 106106735, 106127090, 106078697, 105893066, 105745697, 105846764, 106023811, 106184837, 106298592, 106265976, 106198311, 106194923, 106192680, 106140518, 106101486, 106156372, 106200935, 106101913, 106026985, 106174828, 106318733, 106244156, 106113335, 106016823, 105955025, 105985161, 106027313, 105989197, 105964874, 106050064, 106147575, 106184723, 106183624, 106128380, 106060265, 106023430, 105993011, 105957123, 105920914, 105869194, 105850983, 105934166, 106046890, 106142067, 106213020, 106223129, 106215027, 106232880, 106235291, 106176949, 106113457, 106092834, 106092216, 106112549, 106130310, 106110786, 106088211, 106080528, 106101753, 106205368, 106290741, 106235809, 106158211, 106164047, 106165619, 106089256, 105998917, 105942078]
2003A05942078m7608o3751k9114Q2466R0004J1689m4610j12754j65360k49702k04178
2014A05209160n341R1339J66985J52306J7761m9355r4345j23283j34392j28891j01784
2025A05000160p2029k3292k190p629K502K6916K8656K1935j3351r4246j32462j63155
2037A04571815j34132k289P561r3224j25457j20468j32302j37306j76003k88650k74017
2048A03095528j27503o8954l9673n4909j44859j73783j80671j45554k9518q224n7152
2059A02064728r8969j90376j82060n4833l4759j09841j02333l5331N844O1485N5504
2070A01379059k2911n4695p0191o7253l4836j9645m486j1658m0528p1411j12793j50558
2082A00718094k17964j96289o5850k4276l5096m6562p4501j07506j52610j93047k53510
$$ y = [105942078, 105894470, 105830719, 105801605, 105884071, 105974075, 105985764, 105941154, 105828400, 105663040, 105413338, 105209160, 105203819, 105295158, 105462143, 105614449, 105632210, 105582855, 105488510, 105365227, 105230835, 105101944, 105000160, 104928131, 104904839, 104902649, 104895020, 104897522, 104924438, 104953094, 104975029, 104961678, 104867432, 104734970, 104571815, 104437683, 104435394, 104442955, 104349731, 104224274, 104103806, 103971504, 103834198, 103658195, 103369545, 103095528, 102968025, 102899071, 102859398, 102804489, 102659630, 102485847, 102305176, 102159622, 102130104, 102121880, 102064728, 101965759, 101775383, 101593323, 101538490, 101503731, 101393890, 101291557, 101256226, 101262070, 101323555, 101379059, 101356148, 101301453, 101231262, 101164009, 101129173, 101109528, 101105042, 101093384, 101052856, 100981445, 100868652, 100718094, 100500130, 100303841, 100237991, 100213715, 100178619, 100132057, 100057556, 99950050, 99797440, 99604393, 99350883]
2093I9350883k52273j77956j57860j58927j86325k57988k97188l14217l44780m15489
2103I6787880l84567j94168k17461m65820n20874m28063m24026m62982m91547n22690
2113I2675682n58037n90896o46782p37786p90191q27172q29864p77603p72072p94815
2123H5350464q17940q73947q60863p66945p41119p63298p65274p75292p48756o73935
2133G7563095o42441o46499o25779n93109n57785n24093m65577l90243k92709j23124
2143G2701736q6402j92238j96953j49941r7656j2901M1870R4459R5818L2761O843q270
2155G2229126q873K9137N478p0214j36276k33368k60757j97144k28722l39096m07821
2166G0381470m77982m97574m53972m49775m50447m91623n97260o35956o20124o31623
$$ y = [99350883, 99098610, 98920654, 98762794, 98603867, 98417542, 98159554, 97862366, 97548149, 97203369, 96787880, 96403313, 96209145, 95991684, 95525864, 95004990, 94576927, 94152901, 93689919, 93198372, 92675682, 92117645, 91526749, 90879967, 90142181, 89351990, 88524818, 87694954, 86917351, 86145279, 85350464, 84532524, 83658577, 82797714, 82030769, 81289650, 80526352, 79761078, 78985786, 78237030, 77563095, 76920654, 76274155, 75648376, 75055267, 74497482, 73973389, 73507812, 73117569, 72824860, 72701736, 72615334, 72423096, 72226143, 72076202, 71978546, 71965645, 72007515, 72101974, 72197792, 72230553, 72237396, 72229126, 72220253, 72249390, 72254868, 72184654, 72048378, 71815010, 71554253, 71357109, 71128387, 70789291, 70381470, 69903488, 69405914, 68951942, 68502167, 68051720, 67560097, 66962837, 66326881, 65706757, 65075134]
2176F5075134o58989o66355o81545o29353m70615m37283n05542n38994n76973n98503
2186E9310982n93159o23775o96064p24625p12990p32517p80609p96269p69996q00896
2196E2080082q82458r41753j020409j025032r43184r18365r20536r26400r31285r77372
2206D2593288j099491j116443j026154j018452j078346j076004j021435j004764j018192
2215C3134007j002812r65715r37605r19987q76259p93384p60460p76173p57004p23718
2225B4620890o76848n97858n60330n75567n25118m04094l50548l35573l36958l96347
2235A9861649l69500k51152k06947k12048k00439j91259j74141j44768j30892j33467
2245A7847036j21069r2720q3948r8253q6235m2034l8765o8308r0147j36828j18780
$$ y = [65075134, 64416145, 63749790, 63068245, 62438892, 61968277, 61530994, 61025452, 60486458, 59909485, 59310982, 58717823, 58094048, 57397984, 56673359, 55960369, 55227852, 54447243, 53650974, 52880978, 52080082, 51197624, 50255871, 49235462, 48210430, 47267246, 46348881, 45428345, 44501945, 43570660, 42593288, 41493797, 40377354, 39351200, 38332748, 37254402, 36178398, 35156963, 34152199, 33134007, 32131195, 31165480, 30227875, 29307888, 28431629, 27638245, 26877785, 26101612, 25344608, 24620890, 23944042, 23346184, 22785854, 22210287, 21685169, 21281075, 20930527, 20594954, 20257996, 19861649, 19492149, 19240997, 19034050, 18822002, 18621563, 18430304, 18256163, 18111395, 17980503, 17847036, 17725967, 17633247, 17549299, 17451046, 17364811, 17322777, 17284012, 17215704, 17125557, 16988729, 16869949]
2256A6869949k8396J4044M0626M2986O557k075J0897L649l1903k1862L7884N6912N4788
2269A7054056M3513J7475j2993q2422o3324O5301R1984M1889K5486J9314O676j7979
2281A7188976j5997J1826K9993M7565O3538R3365P6221r273j6928L9911O8402J01947
2293A7679546R9659N1333L8528M6038N2929O0226Q4519J40762J52254J23119J13417
2304A8642330R5127J20117J90711K45451L09612L43250L56125L48949L04032K91252
2314B1246956K70367L32500N23232N68939M73451M94814O17337O45401N98571N93926
2324B6365494O10447O14977O18101O10492N95524N68867M92453N22638P00640P04954
2334C2404587N02968N46363Q55397Q97266O67545P16427J028416J115253J166054R12384
$$ y = [16869949, 16841553, 16855597, 16896223, 16939209, 16945766, 16943691, 16954588, 16958237, 16926334, 16904472, 16942356, 16999268, 17054056, 17097569, 17115044, 17102051, 17019629, 16956305, 17021606, 17113590, 17155479, 17180965, 17200279, 17206955, 17188976, 17172979, 17184805, 17214798, 17262363, 17325901, 17419266, 17495487, 17486214, 17469286, 17509197, 17577599, 17679546, 17779205, 17830538, 17869066, 17915104, 17968033, 18028259, 18112778, 18253540, 18405794, 18528913, 18642330, 18737457, 18857574, 19048285, 19293736, 19603348, 19946598, 20302723, 20651672, 20955704, 21246956, 21517323, 21849823, 22373055, 22941994, 23415445, 23910259, 24527596, 25172997, 25771568, 26365494, 26975941, 27590918, 28209019, 28819511, 29415035, 29983902, 30476355, 30998993, 31699633, 32404587, 32907555, 33453918, 34309315, 35206581, 35874126, 36590553, 37618969, 38734222, 39900276, 40812660]
2344D0812660K38060j23810m56264l60344K71130O10351R26445R70745O56319N79502
2354D4124794O11019O71360Q65891Q52607N75711O00383R07544J008129J023220R57393
2364E2198051P22840O65973P75502P50160N75996O09925Q89873R06849O93367O28304
2374E9416840O47235O28808O06582N67509N02418M60770M12178M28391N29457N63194
2384F4763382N56702N53512N21164N45784O24107O82999P39220P98698Q69133R13788
2394G1568489R27353R67667J056648J048569R42558Q87443Q32772Q31176R13598R03411
2404H0879684Q13965P68471P48299P04620O23230O09779O72844O72173O41746N85770
2414H7720581M65538M31542M77790M77455M51706M42528M31519M50058N38398N03968
$$ y = [40812660, 41050720, 40926910, 40470646, 40110302, 40381432, 40991783, 41918228, 42888973, 43545292, 44124794, 44735813, 45407173, 46273064, 47125671, 47701382, 48301765, 49209309, 50217438, 51240658, 52198051, 52920891, 53586864, 54362366, 55112526, 55688522, 56298447, 57188320, 58095169, 58788536, 59416840, 60064075, 60692883, 61299465, 61866974, 62369392, 62830162, 63242340, 63670731, 64200188, 64763382, 65320084, 65873596, 66394760, 66940544, 67564651, 68247650, 68986870, 69785568, 70654701, 71568489, 72495842, 73463509, 74520157, 75568726, 76511284, 77398727, 78231499, 79062675, 79976273, 80879684, 81693649, 82462120, 83210419, 83915039, 84538269, 85148048, 85820892, 86493065, 87134811, 87720581, 88186119, 88617661, 89095451, 89572906, 90024612, 90467140, 90898659, 91348717, 91887115, 92391083]
2424I2391083L28064K77977L12706L28804L64830L69758L47977L32947L04939L09372
2434I5668457L59489L56698L01651K90367L33687K92015J31370J27152K73582L18123
2444I8452591L36334K78259P0000N6961K40303K69982J92260J72043J70975J77521
2454A00417229K04826K11815K02751K01630K22397J85272P3555L3851M1558M8233Q3496
2465A01926613P7103J029L7499K15218K37136J30219Q3359M1504L5812P8033Q9981
2476A02953506P3380R9182J93741J80603N4718J2566P034K9991J14418J36231J27197
2487A03982567Q4259k4391o8764r0309n3238P9986J23124J11862Q9599K7008k212r064
2499A04250427k3597n0927m0626K289M7203J33133J34567N2734P866n6618l4690J08619
$$ y = [92391083, 92719147, 92997124, 93309830, 93638634, 94003464, 94373222, 94721199, 95054146, 95359085, 95668457, 96027946, 96384644, 96686295, 96976662, 97310349, 97602364, 97733734, 97860886, 98134468, 98452591, 98788925, 99067184, 99137184, 99194145, 99434448, 99704430, 99896690, 100068733, 100239708, 100417229, 100622055, 100833870, 101036621, 101238251, 101460648, 101645920, 101719475, 101753326, 101794884, 101843117, 101926613, 102003716, 102004745, 102042244, 102257462, 102494598, 102624817, 102708176, 102749680, 102785492, 102863525, 102953506, 103026886, 103126068, 103319809, 103500412, 103555130, 103567696, 103574730, 103604721, 103719139, 103855370, 103982567, 104066826, 104042435, 103973671, 103883362, 103830124, 103910110, 104033234, 104145096, 104234695, 104261703, 104259491, 104250427, 104226830, 104175903, 104135277, 104137566, 104184769, 104317902, 104452469, 104505203, 104513069, 104456451, 104421761, 104530380]
2511A04530380J27220L8742J8624K6680M7897J29631R7412o5368j17714j15723p6179
2522A04641602M4464Q8813Q6472P6157M4151O340r0164m9996J74637J96915M9255j1612
2534A05257034n0071o5468n0354l5523r659J2612N1308M0916k6634n3833p6035m9423
2546A04944870O8069O4187o9909q6929j4664J0399P675L5691J17805J01708k6795n8700
2558A05093407k5246j0422J4183J8837J2520j0971o5445q9714j01044r1865n5451k6420
2570A04662369N272L4141P6866P1930j289J144Q1444Q6479K2072J7861P2357O1683
2582A05192329K121m7638j36901j27411n364L5622J8783M4564J15181J21162O1157
2593A05273605M9874Q0703O5377k693r133L8910N5504O5422N5267K2362r392p8537
$$ y = [104530380, 104657600, 104696342, 104714966, 104741646, 104789543, 104919174, 105016586, 104951218, 104833504, 104717781, 104641602, 104686066, 104774879, 104861351, 104937508, 104981659, 104987999, 104897835, 104847839, 105022476, 105219391, 105268646, 105257034, 105206963, 105141495, 105091141, 105055618, 105045959, 105058571, 105109879, 105150795, 105124161, 105070328, 104994293, 104944870, 105012939, 105077126, 105007217, 104920288, 104905624, 104916023, 104923698, 104959389, 105077194, 105178902, 105152107, 105093407, 105068161, 105057739, 105071922, 105090759, 105103279, 105092308, 105026863, 104937149, 104836105, 104744240, 104688789, 104662369, 104667641, 104701782, 104778648, 104850578, 104849289, 104850433, 104931877, 105018356, 105040428, 105058289, 105130646, 105192329, 105194450, 105146812, 105009911, 104882500, 104877136, 104912758, 104931541, 104976105, 105091286, 105212448, 105273605, 105323479, 105404182, 105469559, 105466866, 105457733, 105496643, 105552147, 105617569, 105672836, 105695198, 105685806, 105607269]
2605A05607269n5076R5062J05591N722n5214j53183j33728K9297P6774N1880M0985
2616A05615379N455J3161Q0826P3433k37m0458q4427q3115k1171r301m0168l2471j244
2629A05475662L2089R3491J00540O0150K6963j4634n6915j27220j23978m2244l601
2640A05420303K9419K8565k2339l0640j1657L242L5355L0616j3183l3287k8015o6826
2652A05341553j83960j73355j6434O271p9750r6054o9214p1571j12587q2375M7234
2663A04509758N3452n6221q9119p7416q5182j17470r0340J8601L5805l0014m0413j9860
2675A04011581r056M074J1658P248K4246Q2993O8504k2537o1989q5663p8697l5721
2687A03916641O699Q2519R2339L1471J8028L4569L2547J7426J5686K6466K6634K5696
$$ y = [105607269, 105552193, 105647255, 105752846, 105758568, 105703354, 105550171, 105416443, 105445740, 105522514, 105574394, 105615379, 105620834, 105633995, 105714821, 105788254, 105788017, 105747559, 105663132, 105580017, 105558846, 105549545, 105509377, 105476906, 105475662, 105507751, 105601242, 105701782, 105761932, 105788895, 105774261, 105717346, 105590126, 105466148, 105423904, 105420303, 105449722, 105478287, 105455948, 105425308, 105413651, 105416893, 105452248, 105482864, 105469681, 105436394, 105408379, 105341553, 105157593, 104984238, 104967804, 104974075, 104894325, 104798271, 104729057, 104657486, 104544899, 104462524, 104509758, 104563210, 104506989, 104417870, 104340454, 104255272, 104137802, 104047462, 104066063, 104101868, 104071854, 104031441, 104011581, 104002525, 104006599, 104018257, 104025505, 104049751, 104132744, 104201248, 104178711, 104116722, 104031059, 103952362, 103916641, 103923340, 104005859, 104098198, 104129669, 104147697, 104182266, 104214813, 104232239, 104247925, 104274391, 104301025, 104326721]
2699A04326721Q705n9791k3201J62552J64512m631o2797n7289q1139j56021j02326
2710A04115295J12816J77986J50460J12396J7929l1952o9046o7161j5931J6716P4532
2721A04594040N0232p6271j17325j17920q6067K6871L4233o0463q4809p1617o2111
2732A04028793l8093l1235n4123k4910O0722J03402J32728J29601P9513N9487O6421
2743A04512306L5530n6343n1994M7707Q8829J15234J05354L1945K5611Q2970Q6807
2754A05023956N8365K9877k1942l6454k8633O18Q5526Q9790K0119j4351m3869n6725
2766A05106277n7884l9146Q011M1176Q8592P9491%k3728j045k0836r9090q2993L3829
2779A05032654P2700P6241N2574k6802n6191o0180m6272L311K4772M3534K1629q1375
$$ y = [104326721, 104335426, 104275635, 104252434, 104414986, 104579498, 104574867, 104512070, 104454781, 104373642, 104217621, 104115295, 104228111, 104406097, 104556557, 104668953, 104686882, 104654930, 104585884, 104518723, 104502792, 104519508, 104594040, 104644272, 104568001, 104450676, 104332756, 104246689, 104273560, 104307793, 104247330, 104162521, 104090904, 104028793, 103990700, 103959465, 103905342, 103880432, 103941154, 104044556, 104177284, 104306885, 104386398, 104445885, 104512306, 104547836, 104491493, 104439499, 104487206, 104576035, 104691269, 104796623, 104828568, 104854179, 104937149, 105023956, 105082321, 105112198, 105090256, 105053802, 105025169, 105025787, 105111313, 105201103, 105221222, 105206871, 105163002, 105106277, 105048393, 105009247, 105017258, 105058434, 105147026, 105226517, 105226517, 105202789, 105201744, 105180908, 105081818, 104998825, 105032654, 105105354, 105181595, 105234169, 105207367, 105151176, 105090996, 105044724, 105048035, 105072807, 105116341, 105137970, 105056595]
2791A05056595o6086Q0322J06736N8029N722j15799j15891J1063N1758N5336L8246
2802A05166031k8755m5494j4084k6375r8129p4433N7671R1461P3334K4246r6176j47629
2814A04881668j73546j40663k243K1263q0368m6013J36536J57074N0041j2421q0604
2825A04710724j25580j71799j50612m1847N226L5500J8433p1076j02234j16058p9613
2836A03911064M9042O9191J5091m9782j89186k11784j22117r3437r0126q1611o4850
2847A03141495q2657j27197j87348k95021l33977l25729l00476k15195k11883l10280
2857A00751732k89467j29791j31134l06916l03550j56472p7796r659K8564Q461O2897
2868I9446869K15103K39128J53404J10100O2134M5723O5712O6276P0054M2053l4928
$$ y = [105056595, 104990509, 105070831, 105177567, 105235596, 105241318, 105125519, 105009628, 105020691, 105072449, 105127785, 105166031, 105137276, 105091782, 105077698, 105051323, 104953194, 104878761, 104936432, 105027893, 105101227, 105125473, 105029297, 104881668, 104708122, 104567459, 104565216, 104586479, 104506111, 104460098, 104596634, 104753708, 104803749, 104791328, 104710724, 104585144, 104413345, 104262733, 104220886, 104226112, 104261612, 104280045, 104208969, 104106735, 103990677, 103911064, 103960106, 104029297, 104044388, 103994606, 103805420, 103593636, 103471519, 103378082, 103287956, 103206345, 103141495, 103058838, 102931641, 102744293, 102449272, 102115295, 101789566, 101489090, 101273895, 101062012, 100751732, 100462265, 100332474, 100201340, 99894424, 99590874, 99434402, 99356606, 99346947, 99375511, 99383972, 99446869, 99661972, 99901100, 100054504, 100164604, 100226738, 100272461, 100338173, 100404449, 100474503, 100516556, 100481628]
2879A00481628n7029k2744m2228j06026j42067j86638j67061p3188j8387L7124M7585
2890I9750969o889j069O8085O2851k9846k0149J04187J04408P217n5862j36490j59836
2902I9687576j24000j11679q6830j11031j80557k48909l44918m00016m14566m55925
2912I7209145n16297n59715n85365o32546p47444p06268n07637l80898k85866j54205
2922I2132904j938J66443L99857N06942N16251N04684M37478L76770K99812K35512
2932I5574715J54014J45722K51342K17362O9359m1558k02652k15934m4327l4096j54350
2943I5719597j82556j77239j26938m165O9710J38999J47767P5462O0036P1861R1217
2954I5883751J30035J60027K04773J98196J20430J16944J83296J91475J63719J38855
$$ y = [100481628, 100424599, 100401855, 100359627, 100253601, 100111534, 99924896, 99757835, 99684647, 99666260, 99703384, 99750969, 99744080, 99743011, 99811096, 99873947, 99844101, 99823952, 99928139, 100032547, 100039764, 99983902, 99847412, 99687576, 99563576, 99451897, 99365067, 99254036, 99073479, 98824570, 98479652, 98079636, 97665070, 97209145, 96692848, 96133133, 95547768, 94915222, 94167778, 93461510, 92953873, 92572975, 92287109, 92132904, 92130966, 92297409, 92697266, 93204208, 93720459, 94225143, 94662621, 95039391, 95339203, 95574715, 95728729, 95874451, 96125793, 96343155, 96412514, 96370956, 96168304, 95952370, 95908043, 95873947, 95719597, 95537041, 95359802, 95232864, 95228699, 95298409, 95437408, 95585175, 95660637, 95720673, 95792534, 95883751, 96013786, 96173813, 96378586, 96576782, 96697212, 96814156, 96997452, 97188927, 97352646, 97491501]
2964I7491501J18088N7464o7550j15036j00632j03790j21254q6548L8292L4736j05575
2975I7039696j30890q5900m3609M5753N5954k9083j9096O8283J13319J38664J73142
2986I7326233K26089K31217J72569J80153K53365K64549K50145J91833K2606K8465
2996I9147224K24350K64382J94763J76529J78955J63506J46293J01380J1421k8420
3006A00580383n1094k0004J03615J27769Q3611L8345o0394p0648K5131J4786q1902
3017A00689598j31912k03110j57234K7054J25915K04415K25738J80550J42723R9083
3027A01202820K8305j28868j14350R1675J51703J34659J02402K960j7647L5858L6125
3038A01525642L59j3283k0172j6998M913P340p653j0345j022q515m1321l6789J6549
$$ y = [97491501, 97609589, 97667053, 97599503, 97484467, 97383835, 97280045, 97158791, 97072243, 97110535, 97145271, 97039696, 96908806, 96822906, 96779297, 96825050, 96881004, 96851921, 96832825, 96901108, 97014427, 97153091, 97326233, 97552322, 97783539, 97956108, 98136261, 98389626, 98654175, 98904320, 99096153, 99118759, 99147224, 99371574, 99635956, 99830719, 100007248, 100186203, 100349709, 100496002, 100597382, 100608803, 100580383, 100529289, 100509285, 100612900, 100740669, 100824280, 100862625, 100802231, 100731583, 100756714, 100771500, 100689598, 100557686, 100354576, 100197342, 100224396, 100350311, 100554726, 100780464, 100961014, 101103737, 101202820, 101231125, 101102257, 100987907, 101079582, 101231285, 101365944, 101468346, 101471306, 101453659, 101489517, 101525642, 101526001, 101512718, 101492546, 101475548, 101480461, 101487801, 101480148, 101469803, 101468781, 101460266, 101418945, 101382156, 101398705]
3051A01398705J0131n8365p1334o1058j5999J14464J16043j4405n0277m5945j0780
3062A01311180J03050J13556K7466k36l891j191J1422L7071Q9859J10084J12503R7489
3074A02008362M9354L0327K2080L5476R4918R1835K1675J0940K8275P2388J96312J88995
3086A02850937M5273l479j595l265j930L0136J24282J27221M0321J1246J8913k44o6780
3099A03171036l4882J24504J49254O1104L4996M3373K1263l2394m8645m2603k2789
3110A03424217L0945M6494L5804K2919r323j6670j122R54j595p774k0577k8991m2244
3123A03433037l4714J3947l388j17012r8801O4682R1317J7685k0691q3901o7329N7075
3135A03251907P2312j213k8275k7038o0173j45272j49322p3410m6440l9414l9741l8887
$$ y = [101398705, 101408836, 101350471, 101279137, 101218079, 101202080, 101316544, 101432587, 101418182, 101367905, 101321960, 101311180, 101414230, 101527786, 101555252, 101555016, 101551125, 101549934, 101561356, 101598427, 101688286, 101798370, 101910873, 102008362, 102057716, 102088043, 102110123, 102145599, 102240517, 102332352, 102354027, 102364967, 102393242, 102465630, 102661942, 102850937, 102896210, 102892731, 102891136, 102887871, 102885941, 102916077, 103040359, 103167580, 103207901, 103219147, 103238060, 103237816, 103171036, 103136154, 103260658, 103409912, 103471016, 103506012, 103549385, 103570648, 103538254, 103489609, 103447006, 103424217, 103455162, 103501656, 103537460, 103560379, 103551056, 103534386, 103533264, 103534218, 103532623, 103524849, 103504272, 103475281, 103433037, 103398323, 103412270, 103408882, 103291870, 103193069, 103257751, 103349068, 103366753, 103346062, 103262161, 103194832, 103251907, 103324219, 103323006, 103294731, 103267693, 103207520, 103062248, 102912926, 102839516, 102793076, 102753662, 102713921, 102675034]
3147A02675034q3619k32528k04682K2583P7530J6045j3588p0404o6902J4564J5831
3158A02149864n3184p4105q2901n4069L5622O7398N6907O0158O7848O0921M6516J4901
3170A02295876p2838n1331Q6357J47057J93519J67870L0304k335L3310O6658J32134
3181A03026581J62338J98006J43432p7392o4942K06589K34390N4100K5795Q5946J28585
3192A04123428K25067J95763j1207q751K17842K22473J4831K236J65008J74408P3357
3203A05394455J8768o1203l6407J31775J58432O2339N3101J11198J04828N6107Q415
3214A06001808q3732q1925K3415N5244M4342M4609L9574M1176M8469N3192O3851N4504
3226A06304527L7834j1085j33514j39687l2669R895L8201K8770m9705m8737J0544O3988
$$ y = [102675034, 102591415, 102358887, 102154205, 102176788, 102254318, 102270363, 102256775, 102186371, 102119469, 102134033, 102149864, 102096680, 102022575, 101939674, 101885605, 101921227, 101988625, 102045532, 102105690, 102173538, 102234459, 102280975, 102295876, 102223038, 102171707, 102258064, 102405121, 102598640, 102766510, 102796814, 102794479, 102827789, 102894447, 103026581, 103188919, 103386925, 103530357, 103452965, 103388023, 103594612, 103829002, 103883102, 103908897, 103994843, 104123428, 104348495, 104544258, 104533051, 104524300, 104742142, 104964615, 104979446, 104981682, 105146690, 105321098, 105394455, 105413223, 105352020, 105315613, 105447388, 105605820, 105668159, 105721260, 105832458, 105937286, 105993393, 106001808, 105918076, 105836151, 105859566, 105914810, 105959152, 106003761, 106043335, 106084511, 106132980, 106186172, 106250023, 106304527, 106342361, 106331276, 106197762, 106058075, 106025406, 106035301, 106073502, 106102272, 106052567, 106003830, 106014374, 106078362]
3238A06078362J74758J54305n219q4091j68037j34209O3156J17974R1598M4609r8610
3249A06234596r6344P2266Q1779l6720q2184j14464r5245r155M3655J11267J01448
3260A06210899n653l8574k4582k6299k7229l0731n2094k7008Q2398O0196j23261j33636
3272A05864426J3473M5990J7098j4138j03309q7258N5550P5623k358k7946k7153m6517
3284A05763481j00471q5038K449M7257R8823P3838p8415p1831J05545J19423j3275
3295A05861786k6230O5971N5314m5800p9277r2506n4337Q9600R0362n4954q5976l0235
3307A05693718l8025j00281j03355p8934j4259J53564J60073Q850n0309q2443p7469
3318A05471130k807J167o1539o6566j0773l1402j38260j54969r9235p6958p6294l9055
$$ y = [106078362, 106253120, 106407425, 106402206, 106318115, 106150078, 106015869, 106079025, 106196999, 106288597, 106333206, 106234596, 106138252, 106210518, 106292297, 106255577, 106173393, 106058929, 105963684, 105954529, 105998184, 106109451, 106210899, 106205246, 106166672, 106142090, 106115791, 106088562, 106057831, 106005737, 105978729, 106061127, 106121323, 105998062, 105864426, 105877899, 105923889, 105940987, 105926849, 105823540, 105736282, 105791832, 105867455, 105865097, 105837151, 105809998, 105763481, 105663010, 105577972, 105580421, 105627678, 105726501, 105800339, 105721924, 105650093, 105755638, 105875061, 105861786, 105835556, 105901527, 105956841, 105911041, 105831764, 105739258, 105684921, 105774521, 105864883, 105809929, 105723953, 105693718, 105655693, 105555412, 105452057, 105373123, 105358864, 105512428, 105672501, 105681351, 105631042, 105548599, 105471130, 105468323, 105469490, 105407951, 105341385, 105330612, 105299210, 105160950, 105005981, 104906746, 104829788, 104753494, 104714439]
3330A04714439N2597O9046J7022r31J2016l4164j59523j93833j72477j24474N127K5177
3342A04210022n6198q0467q9646p4318j2588j450m3533l1662M3724L7071n0857p7767
3354A03772331p3318o1249j0010k2247j25908j06575L3806Q8531J22261Q2848o8855
3365A03631615j24405j16371j22979j42097j04141K4940L9101n1857q1207q8906q1993
3376A02781700l4233m3541j15036j30508j05835r6009q9813p7415n0232n2742q7311
3387A01899025r9991j16348q8097J7502K1072n7144j18736k34123k20085n0423j3474
3398A00939178q7333p1335J4999M8874P1480M0741q3542r8587j8524J0277K6466K1507
3410A00814201l1166j6784P9773Q3160N821k6939o9451k9998J08390J86181K94876
$$ y = [104714439, 104767036, 104836082, 104853104, 104852173, 104864189, 104830025, 104670502, 104476669, 104304192, 104179718, 104184845, 104210022, 104153824, 104073357, 103983711, 103909393, 103896805, 103895355, 103851822, 103820160, 103863884, 103900955, 103850098, 103772331, 103699013, 103637764, 103627754, 103605507, 103479599, 103373024, 103406830, 103495361, 103617622, 103700470, 103631615, 103507210, 103390839, 103267860, 103125763, 103021622, 103046562, 103085663, 103033806, 102952599, 102863693, 102781700, 102747467, 102703926, 102588890, 102458382, 102352547, 102256538, 102166725, 102089310, 102039078, 101986336, 101899025, 101799034, 101682686, 101594589, 101612091, 101633163, 101576019, 101457283, 101223160, 101003075, 100952652, 100939178, 100851845, 100780510, 100795509, 100844383, 100915863, 100956604, 100873062, 100774475, 100755951, 100766228, 100792694, 100814201, 100783035, 100766251, 100846024, 100929184, 100935005, 100908066, 100838615, 100808617, 100917007, 101103188, 101398064]
3421A01398064K27951q8837j52161j8447L4713Q4465R9854M9972Q9096K29691K67273
3432A02221634K46925J92406M6585J3855R3864Q3283j6930p583J16134J35758P5409
3443A03201340N6770K3384P9300K88368K90825J01090K1095k1523l9291n775j4183
3454A03981400q4710m3487J44859J64726J1681J8692J90857J74469k2362p8293n9913
3465A04397919k2271Q8021J12228O0127N1049Q2870M4487j09672q6449J41571J71501
3476A04931381M3961j023k5489k1485K6970M7852N5618O4301Q6715N7511o0227n3551
3488A05152534R3529J03928P538l8292q9287p9849o699N1285J24123J70494K39372
3499A05728676J76163q2779j28502Q362M1008L6956J2589q3946o1753J04950J22048
$$ y = [101398064, 101626015, 101537178, 101385017, 101366570, 101401283, 101485748, 101585602, 101635574, 101724670, 101954361, 102221634, 102468559, 102660965, 102707550, 102721405, 102815269, 102898552, 102881622, 102874039, 102990173, 103125931, 103201340, 103258110, 103281494, 103360794, 103649162, 103939987, 104041077, 104062172, 104040649, 104001358, 103995583, 103981400, 103896690, 103853203, 103998062, 104162788, 104174469, 104193161, 104384018, 104558487, 104536125, 104457832, 104397919, 104375648, 104463669, 104575897, 104636024, 104687073, 104769943, 104814430, 104704758, 104618309, 104759880, 104931381, 104975342, 104974319, 104948830, 104927345, 104954315, 105002167, 105057785, 105122086, 105208801, 105266312, 105206085, 105152534, 105246063, 105349991, 105357529, 105319237, 105229950, 105150101, 105143402, 105194687, 105318810, 105489304, 105728676, 105904839, 105822060, 105693558, 105701920, 105742928, 105779884, 105792473, 105708527, 105646774, 105751724, 105873772]
3510A05873772L105j2261N7320M6585m1077n4000N72n4o2461l7835Q9425J07795L2013
3523A06002899J4473L6911J9570n7770l4516J29555J12724j09413j17538P2952J04195
3534A06174042M1816j8905j51566j57234k8923O226l5263P484J49658J69350R2979
3545A06249664L6721m6807q4495q5900q5998q5762m6517N6702Q5136M5563M9591R1408
3557A06179306Q2565L5836j1727r5848j10863p4249k1904J04637J07270r156o6047
3568A06119820j29532j13846n074N5237J37856J01188j02401j40862m2389k6420o6323
3579A05787254m9118K3102M5563L5690K8473O149M670K9495K2743j8143k5032q31k152
3592A05887863o622m7043j76338j50154M6493J08978J24650M8683j88088k64435k67883
$$ y = [105873772, 105876877, 105864616, 105921936, 105968521, 105927444, 105873444, 105874016, 105873962, 105811501, 105773666, 105863091, 105970886, 106002899, 106017372, 106054283, 106073853, 106016083, 105981567, 106111122, 106223846, 106114433, 105996895, 106069847, 106174042, 106215858, 106196953, 106045387, 105888153, 105859230, 105865456, 105830193, 105837677, 105987335, 106156685, 106249664, 106286385, 106239578, 106155083, 106069183, 105983185, 105897423, 105850906, 105907608, 105992744, 106038307, 106087898, 106179306, 106261871, 106297707, 106285980, 106190132, 106079269, 106005020, 105983116, 106087753, 106195023, 106185867, 106119820, 105990288, 105876442, 105871368, 105926605, 106064461, 106165649, 106063248, 105922386, 105879997, 105853577, 105787254, 105738136, 105761238, 105806801, 105842491, 105870964, 105877113, 105881783, 105911278, 105934021, 105915878, 105890846, 105890015, 105887863, 105881241, 105834198, 105657860, 105507706, 105554199, 105663177, 105787827, 105836510, 105648422, 105383987, 105116104]
3603A05116104j69540J28959K05063J16852N4451o2561j02776p7201p3365n9433p5508
3614A05001045j45721j33538l0349p279m9728m5044M723n104o5415j07986j82648j58264
3626A04074692j2207L3806L2615n478j40312j42937o286J2276o0441p4363m4869o0562
3638A03605934j32965j27525k0127m2030k00485k35535k14699j27884J07666J50803
3648A02763153J7998j5595N417j5907p2144r6008j03569r7870p0457n2429l2425k4987
3660A02205177k1667m1962q9386j30508j96503j96197j35636q1993J6525J9806q9477
3671A01258179j02089n7747o867R3842J21429J12198M3534j66245j67869P3951O8642
3682A01270958j50894k25998k73750j84655J20262K15363J75827J26511r369m9782
$$ y = [105116104, 104946564, 105075523, 105280586, 105397438, 105451889, 105389328, 105286552, 105209351, 105135986, 105076553, 105001045, 104855324, 104721786, 104691437, 104684158, 104634430, 104589386, 104594109, 104589005, 104523590, 104415604, 104232956, 104074692, 104062485, 104096291, 104128906, 104123428, 103983116, 103840179, 103833893, 103846169, 103785728, 103711365, 103666496, 103605934, 103472969, 103345444, 103325317, 103283287, 103082802, 102847267, 102632568, 102504684, 102612350, 102763153, 102781151, 102765556, 102770973, 102755066, 102682922, 102586914, 102483345, 102385475, 102315018, 102262589, 102230164, 102205177, 102183510, 102141548, 102052162, 101921654, 101725151, 101528954, 101393318, 101311325, 101327850, 101347656, 101258179, 101156090, 101098343, 101091476, 101185318, 101306747, 101418945, 101462479, 101296234, 101128365, 101202316, 101270958, 101120064, 100894066, 100620316, 100435661, 100555923, 100771286, 100947113, 101073624, 101064255, 101014473]
3692A01014473j2070q987k3338j1521K4727M8614O7093Q9165J53351R6466j08696j90285
3704A01138992k70263j32729L40218M60868L50022K11807j07788j97075j14990l7834
3714A01641228J45096J66946L6781j4900p1808k9922J46965K09968K29149J72920j3893
3725A02618530p9208n3665o6925j01563r7755o8451k1622Q4252R0721j4664k3796N0690
3737A02316544N1071j3924k1507J2688K8396N8624L1517p0068j05957j04691r2285
3748A02090408p6248o18J93688K14340O9404J8807J2855r750k4818o8100j73951j69296
3760A02076721o0371M318O1104J12846J86203J71402N1048M265l433j3374p134j7090
3772A02566505n8387l8224N8442P8414M5754J7281n3002l7903P6218J07361O8283Q9691
$$ y = [101014473, 101002403, 100993416, 100970078, 100958557, 100983284, 101031898, 101098991, 101188156, 101341507, 101437973, 101329277, 101138992, 100868729, 100736000, 101076218, 101537086, 101887108, 102098915, 101991127, 101794052, 101679062, 101641228, 101786324, 101953270, 101990051, 101975151, 101903343, 101873421, 102020386, 102230354, 102459503, 102632423, 102618530, 102539322, 102485657, 102418732, 102317169, 102219414, 102150963, 102129341, 102213593, 102304314, 102289650, 102265854, 102316544, 102367615, 102353691, 102332184, 102344872, 102373268, 102431892, 102463409, 102393341, 102287384, 102182693, 102090408, 102014160, 102013542, 102207230, 102421570, 102490974, 102509781, 102522636, 102512886, 102488068, 102419968, 102246017, 102076721, 102016350, 102020668, 102081772, 102194618, 102380821, 102552223, 102603271, 102607536, 102604103, 102590729, 102583595, 102566505, 102508118, 102469894, 102528336, 102606750, 102652504, 102669785, 102616783, 102578880, 102655098, 102762459, 102830742, 102920433]
3784A02920433J95602J59050m8378q6143k975N5267J69990J61148K3888m2465j24191
3795A03381226p5722J51802K17247J76262J47110R6985L8742p9918o2988J13822J57044
3806A04261612J30318P2578q0803j10336n8891K5177K30148K51098J09986K3674q4305
3817A04770256j25244j30844o3225J30814K00561J96121J67633N3284M9881J64322
3827A05413559J72134J09124N6480j5518o9260j46652j17973L9917J04683J31851J21544
3838A05799889N5816O264j00273m2824K64763K56973m8355j57165j82129j66794o0082
3849A05626083k2773o1272J0612K18728K73346K36152J50131p4409j21735M288L365
3860A06242516r1317j12556j01166o1394L8269P5989N2643Q6327K02369J81076K5154
$$ y = [102920433, 103116035, 103275085, 103226707, 103140564, 103137589, 103192856, 103362846, 103523994, 103547882, 103505417, 103381226, 103305504, 103457306, 103674553, 103850815, 103997925, 104094910, 104133652, 104053734, 103990746, 104104568, 104261612, 104391930, 104464508, 104383705, 104273369, 104214478, 104239655, 104469803, 104720901, 104830887, 104854561, 104770256, 104645012, 104514168, 104450943, 104581757, 104782318, 104978439, 105146072, 105199356, 105249237, 105413559, 105585693, 105694817, 105751297, 105735779, 105666519, 105519867, 105401894, 105441811, 105546494, 105678345, 105799889, 105855705, 105861969, 105761696, 105718872, 105983635, 106240608, 106192253, 106035088, 105852959, 105686165, 105626083, 105603310, 105542038, 105552650, 105771378, 106044724, 106280876, 106431007, 106356598, 106234863, 106239151, 106242516, 106151199, 106038643, 105937477, 105876083, 105914352, 105990341, 106042984, 106129311, 106331680, 106512756, 106537910]
3871A06537910n6716j40786j31012n218N1849Q2474J02043J29151P3837j20995j37329
3882A06385208J0300O2012P9055P6081J6479L1799J44272J33248J5098n5176j27052
3893A06771324j57760j76522j09268Q0368J72875K51533K02683m3869r3918J1062M2588
3904A06951096O5750M8423n6762k8252J81816J60141q0467j78001k64023j74431J90117
3915A06815407K68196J43219M2869j68060j76575L1350Q6380N3978M1366J1330N287
3926A07154747M0245O516j17493j36093n9960m2083p8797l1898J29287J43868J91N478
3938A07014008J75911J39282j08864j78742j57501q6616J04217J75164J96456J26984
3948A07400299q8859j87752k74094j93733J48720K17086O7467J1254l6789m7394M600
$$ y = [106537910, 106481194, 106340408, 106209396, 106204178, 106256027, 106338501, 106440544, 106569695, 106643532, 106522537, 106385208, 106395508, 106457520, 106536575, 106612656, 106629135, 106660934, 106805206, 106938454, 106953552, 106898376, 106771324, 106613564, 106437042, 106327774, 106408142, 106581017, 106832550, 107035233, 106991364, 106897446, 106908508, 106951096, 107016846, 107065269, 107008507, 106980255, 107162071, 107322212, 107241745, 107063744, 106799721, 106625290, 106815407, 107083603, 107226822, 107269691, 107101631, 106925056, 106956406, 107042786, 107096764, 107138130, 107149460, 107154747, 107194992, 107201508, 107084015, 106947922, 106887962, 106845879, 106767082, 106735184, 106864471, 107008339, 107008530, 107014008, 107189919, 107329201, 107220337, 107041595, 106884094, 106797478, 106901695, 107076859, 107273315, 107400299, 107311440, 107123688, 106849594, 106655861, 106804581, 107021667, 107089134, 107100388, 107063599, 107016205, 107020805]
3959A07020805j1016j01395j07842o1744L692J52207J61979L6812j6853o7162m7973
3970A06961510J05789O7665j93550k26883j02135Q606K15149K50336J27296O0631k3605
3981A07250809m4396J5381O149n9959q2016r8778n6480Q4472J11695M2129K0096K0104
3993A07209206n04m9805n3047j8814J2329P3220P2837
4000A07245422
$$ y = [107020805, 107009789, 106908394, 106800552, 106738808, 106742500, 106894707, 107056686, 107093498, 107076645, 107009483, 106961510, 107067299, 107134964, 106941414, 106714531, 106612396, 106621002, 106836151, 107086487, 107213783, 107274414, 107250809, 107206413, 107221794, 107227943, 107167984, 107085968, 106987190, 106930710, 107015182, 107126877, 107169006, 107189102, 107209206, 107208702, 107158897, 107105850, 107087036, 107099365, 107172585, 107245422]
##END=$$ End of the data block
