##TITLE=$$ Begin of the data block
##JCAMP-DX=5.00 $$ ACD/SpecManager v 10.08
##SPECTROMETER/DATA SYSTEM=16PC
##DATE=01 Jul 2013 15:10:36
##DATA TYPE=INFRARED SPECTRUM
##DATA CLASS=XYDATA
##ORIGIN=
##OWNER=
##NPOINTS=3601
##FIRSTX=400.00000000
##LASTX=4000.00000000
##MAXX=4000.00000000
##MINX=400.00000000
##MAXY=562.00000000
##MINY=21.88832664
##XFACTOR=1.0000000000
##YFACTOR=0.000001000000000
##FIRSTY=108.17305756
##DELTAX=1.00000000
##XUNITS=1/CM
##YUNITS=TRANSMITTANCE
##XYDATA=(X++(Y..Y))
400 108173058 185099060 286259521 402555969 471641785 394181427 272042999 175059692
407 175059692 99999977 77565002 75789452 65408989 69021729 116049858 156756729 135784744
415 135784744 99418594 76782272 63999985 69655441 85493805 115872551 131538437 79968925
423 79968925 35329315 77671478 136813156 167232651 174999969 136906464 95266243 98401474
431 98401474 105079361 76208855 53686619 52791954 114285706 375354340 562000000 302892365
439 302892365 27215170 151963470 342372864 363063965 332876709 297875519 241007187
446 241007187 134882309 56573700 110795685 187234024 172985550 180530945 356056091 485542145
454 485542145 318696533 110526299 71763535 84940742 103311584 125444435 130625946 129954605
462 129954605 126812195 123635406 125551674 127870270 127507278 124769569 116340302 110006500 116610077
471 116610077 123669411 119706726 112552284 105267143 100680901 105131104 111154678 112287140 111869980
480 111869980 111145279 109946465 108624527 106868790 103836037 101474762 102180359 103768776 104872322
489 104872322 105437042 104485390 103420349 103606438 104181313 104404137 105274673 108520554 111217262 109968109
499 109968109 107917091 107441162 107444664 107643654 107979774 108490967 108604218 107280777 105955719 105860497
509 105860497 106567070 108569572 110332848 110090302 109030052 107543419 106254051 106295731 106529137
518 106529137 105896065 105286835 105363533 105752464 106497116 107007744 106294914 105600784 106057861 107005592
528 107005592 108638023 109523773 107294868 104954910 105457542 106584404 106926132 107009193 106838249 106569214
538 106569214 106353355 106209160 106169601 106342316 106992676 107680084 108060646 108109642 107577820 106794807
548 106794807 105833908 105214478 105747078 106631233 107392670 107862976 107477043 106950523 106903030 107057167
558 107057167 107401634 107757591 107964012 107956100 107432556 106941628 107090469 107400940 107749580 107679367 106266449
569 106266449 104787827 104315903 104540375 105825302 107219818 107797386 107848930 107097099 106320091 106415680
579 106415680 106747696 106892059 107110168 107605576 108127716 108576561 108703918 107940414 107149506 107166267
589 107166267 107506271 108026146 108537819 108753418 108828857 108907822 108739090 107965637 107048508 106272079
599 106272079 105809189 106116768 106626846 106840706 107007195 107199928 107445694 107920547 108250069 107913513
609 107913513 107525681 107700943 107919594 107796310 107542084 107172226 106888222 106990120 107197449 107322144
619 107322144 107386902 107341507 107216454 107003738 106768539 106577202 106417938 106247520 106226349 106649948 107069733
630 107069733 107049683 106847473 106538673 106233498 106089661 106039978 106083961 106179237 106303741 106395721 106311180
641 106311180 106274696 106596085 106875702 106736275 106420326 106068039 105608894 104839630 104298302 104700829
651 104700829 105309982 105488350 105652191 106204147 106547668 105890015 105221962 105530403 106034279 106198097
661 106198097 106271957 106447960 106364342 105528786 104524994 103647705 103271507 104296516 105440826 105391907
671 105391907 105141594 105358788 105699585 106130219 106388947 106052849 105571533 105252480 105098961 105303596
681 105303596 105605507 105841423 105910797 105472252 105085083 105375626 105801079 105930496 106054474 106431702
691 106431702 106726883 106606033 106323624 105990768 105703377 105623009 105663849 105862900 106013298 105825348
701 105825348 105584190 105541039 105507919 105355141 105158852 104932449 104734253 104750038 104610779 103793999 102945709
712 102945709 102719734 102569984 102135040 101514557 100679680 99654243 98296593 97074173 96450729 96295425
722 96295425 96758194 97460388 98023415 98596954 99223610 99845909 100452446 100947426 101181885 101303574
732 101303574 101343918 101502701 102128387 102806282 103248878 103422928 103052284 102577896 102380203 102364372
742 102364372 102625061 102974174 103225685 103467896 103782845 104003334 103882431 103741333 103938148 104115128
752 104115128 103908279 103694107 103828430 104009338 103952362 103960968 104406761 104800674 104605652 104337265 104420639
763 104420639 104589989 104714867 104814270 104863785 104862930 104786255 104683876 104586884 104526901 104568886 104643723 104676392
775 104676392 104749275 104989769 105187843 105084320 104953911 105055046 105177185 105131363 105111023 105315086 105538055
786 105538055 105629303 105623009 105420135 105269669 105501457 105773689 105780220 105743767 105836845 105903770 105781006
797 105781006 105664421 105752945 105873466 105941246 105889793 105447601 105144783 105665871 106276131 106379768 106244202
808 106244202 105837585 105461838 105470016 105676819 106171700 106483124 105891342 105230072 105281998 105480217 105386589
819 105386589 105397484 105954216 106483482 106441475 106180664 105796791 105516052 105759239 106038353 105882690
829 105882690 105661156 105617996 105656456 105811142 105931999 105784866 105656525 105805397 106082298 106517265
839 106517265 106831001 106650253 106286903 105922386 105574722 105275558 105165146 105503487 105962799 106303307
849 106303307 106520844 106427597 106334641 106639191 106894806 106651756 106316734 106180809 106140877 106200790 106330704
860 106330704 106568146 106714485 106456924 106175423 106240913 106367729 106394005 106319214 105981277 105702759 105876282
871 105876282 106129333 106179932 106148865 106056549 105922005 105763100 105603577 105438087 105371544 105605171 105844620
882 105844620 105790451 105659058 105553268 105514313 105681679 105863281 105924629 105832214 105351402 104950806 105191658
893 105191658 105561371 105644890 105710526 105951736 106177879 106241348 106206467 106057503 105886742 105775734 105740929
904 105740929 105890366 106030655 105945824 105811478 105755280 105705070 105588051 105533501 105748627 105926796 105721947
915 105721947 105459335 105350372 105390289 105739716 106113434 106248878 106238411 106033417 105794098 105692978
925 105692978 105644348 105613586 105619690 105704140 105764793 105673523 105549576 105451775 105433060 105659767 105850288 105669853
937 105669853 105444122 105426857 105498650 105682610 105804680 105616379 105363747 105218887 105155014 105234673 105362030
948 105362030 105456879 105534889 105576416 105607056 105656525 105692482 105684731 105656265 105633850 105575729 105427834 105253601
960 105253601 105078552 104962204 105004166 105109688 105235100 105326797 105299522 105204369 105021622 104878471 104936119
971 104936119 105072853 105221603 105379631 105538368 105647995 105633064 105561592 105459717 105377174 105387642 105445267
982 105445267 105552460 105638123 105602097 105533768 105475426 105467964 105603363 105770584 105893112 105959412 105930420
993 105930420 105812050 105527260 105285667 105336472 105483818 105641243 105729744 105571266 105376335 105319450 105330345
1004 105330345 105408218 105519173 105648209 105737709 105725952 105609940 105280731 104994179 105051231 105207397 105318954
1015 105318954 105384232 105317184 105226967 105220390 105218269 105166054 105096413 104996635 104947945 105072685 105234573 105314919
1027 105314919 105383133 105510857 105572510 105380966 105192352 105266853 105405022 105479431 105533836 105553581 105586288
1038 105586288 105727409 105818626 105659698 105471703 105440399 105471275 105554604 105621719 105573509 105491470 105387283
1049 105387283 105371017 105660606 105944206 105905106 105775757 105684898 105626801 105668137 105720284 105699661 105657623
1060 105657623 105609413 105579803 105639931 105665680 105513885 105312752 105119370 105003716 105109932 105272598 105345154
1071 105345154 105414986 105547882 105661842 105684349 105652473 105561516 105464172 105408836 105403473 105507202 105614594
1082 105614594 105627365 105582855 105442688 105335495 105432106 105567505 105603218 105630135 105715652 105791687 105804970
1093 105804970 105778267 105696991 105619621 105623886 105637337 105607368 105551788 105444641 105364586 105428864 105495499 105413338
1105 105413338 105326889 105368515 105423279 105397583 105359673 105331207 105358269 105554054 105738708 105733368 105648064 105507942
1117 105507942 105388618 105402565 105464149 105537392 105585670 105528328 105461189 105479858 105504272 105455421 105425407 105536865
1129 105536865 105619026 105475784 105305649 105287193 105283974 105168510 105092499 105259872 105386230 105164932 104866646
1140 104866646 104661392 104544350 104618095 104730392 104745911 104716469 104645538 104542686 104398682 104273224 104257011
1151 104257011 104247543 104137802 104031990 104006050 104037598 104141975 104281853 104434158 104571129 104668877 104692459
1162 104692459 104559494 104388351 104281158 104204010 104142639 104140182 104233170 104427025 104799629 105169846 105351089
1173 105351089 105437393 105450676 105420517 105364868 105340477 105464531 105573486 105486038 105372360 105346725 105395218
1184 105395218 105585266 105786797 105893089 105901428 105720261 105509209 105386040 105384827 105673935 105968048 105978699
1195 105978699 105883644 105725456 105620789 105815384 105964470 105675270 105337166 105285141 105289528 105180954 105113365
1206 105113365 105246254 105393341 105365417 105330513 105440590 105554291 105569458 105520317 105369759 105229446 105208443
1217 105208443 105277275 105480476 105705093 105851341 105923935 105861427 105762405 105737946 105689072 105504608 105331924
1228 105331924 105320000 105352737 105318733 105352852 105671547 105918312 105668808 105342842 105304810 105296585 105110672
1239 105110672 104959366 105039520 105189705 105341431 105412628 105216141 104998543 104985664 105052307 105179832 105274200
1250 105274200 105208565 105062607 104844025 104641869 104588936 104561592 104461288 104345413 104218933 104140594 104227402
1261 104227402 104309319 104184387 104065392 104159424 104281540 104303024 104261971 104121162 103977676 103940323 103936455
1272 103936455 103928635 103919960 103898743 103871841 103833534 103809662 103837967 103877022 103885101 103900833 103970840 104029251
1284 104029251 104014923 103960228 103883171 103765633 103583527 103372452 103140404 102946136 102871033 102855110 102900192
1295 102900192 102901909 102677437 102463600 102508614 102595161 102559326 102488899 102399368 102343582 102405617 102507164
1306 102507164 102595161 102677750 102735733 102797867 102900597 103001595 103072929 103107574 103065346 103017662 103016785 103079750
1318 103079750 103272102 103500557 103741432 103851173 103568672 103222725 103090904 103065514 103178497 103288361
1328 103288361 103246307 103105972 102839233 102542564 102334717 102120758 101821281 101508186 101203659 100977249
1338 100977249 100954247 100989677 100955963 100926132 100963280 100969620 100832985 100659653 100540634 100409439 100208832
1349 100208832 100001930 99824501 99701141 99716019 99726173 99596405 99387596 99132660 98780083 98295929
1359 98295929 97660233 96796127 95840096 94838402 93984413 93561813 93345566 93293686 93140503 92628021
1369 92628021 91690971 90135002 88089226 85383415 82721039 80657196 79466606 79716942 81084152
1378 81084152 83693695 86764336 89534119 92070580 94104309 95884178 97612663 99159264 100470970
1387 100470970 101517746 102219223 102673340 102936363 103052757 103033806 103034996 103297447 103575394 103661034
1397 103661034 103681419 103688522 103699448 103759834 103835655 103908562 103977081 104049850 104077957 103989624 103862144 103726120
1409 103726120 103649643 103786659 103909752 103785728 103585884 103412773 103239182 103063370 102911278 102850868
1419 102850868 102754066 102447174 102135040 102046440 101935722 101598312 101139641 100599648 99970078 99258163
1429 99258163 98457237 97566772 96575638 95434975 94257477 93132782 92080879 91209435 90344688
1438 90344688 89326881 88221596 87018631 85785362 84618378 83419823 82101341 80730942 79368874
1447 79368874 77949646 76450180 74803162 72881409 70841309 68665237 66747925 65595795 64855934
1456 64855934 64390869 64060547 63676880 63246059 62566353 62073112 62223602 62750244 63369274 64586235
1466 64586235 66878052 70046539 74250336 78895615 83626152 87887665 90766068 92984367 95011421
1475 95011421 96695374 98015404 99047180 99824829 100452042 101086472 101600052 101863762 102037956 102265884
1485 102265884 102469757 102597046 102715157 102867813 103073479 103424690 103742599 103826332 103834152 103846550 103895691
1496 103895691 104081985 104280830 104372787 104442383 104572487 104648300 104531456 104375313 104274605 104266861 104455521
1507 104455521 104737259 105087326 105373123 105390785 105329224 105334686 105331085 105286713 105214691 105092766 104995087
1518 104995087 104988403 105072327 105340340 105577324 105510399 105406113 105479477 105611992 105764313 105913902 106023552
1529 106023552 106097816 106115646 106116531 106172485 106164696 105945084 105673264 105437897 105303665 105451271 105621315
1540 105621315 105534218 105431129 105492928 105620499 105802132 105956360 105946091 105926323 106054543 106186081 106233452
1551 106233452 106182381 105934952 105654480 105473091 105386116 105450531 105613205 105852844 106130646 106435562
1561 106435562 106663109 106680847 106561516 106257370 105997391 106064629 106249191 106443146 106623383 106737091
1571 106737091 106765289 106638809 106455322 106246590 106141182 106368591 106657600 106787537 106836197 106785606
1581 106785606 106702065 106634804 106616898 106731842 106877258 106984833 107035751 106949257 106842804 106841560 106841347 106741310
1593 106741310 106656433 106695267 106776115 106855865 106927254 106958557 106979752 107028389 107049965 106977203 106885651 106839325
1605 106839325 106805397 106772896 106740211 106700439 106658340 106607414 106574295 106612137 106634827 106528015 106429550 106465912
1617 106465912 106556625 106680962 106786133 106783127 106759689 106778999 106825562 106938789 107017059 106921310 106803085
1628 106803085 106787392 106814552 106913544 106943054 106679077 106398560 106341072 106394669 106564781 106738586 106780769
1639 106780769 106763985 106732346 106635925 106388451 106142853 106031540 106029602 106225754 106411507 106379768 106214905
1650 106214905 105828712 105531670 105720825 106047989 106278870 106468674 106593536 106656052 106640984 106577827
1660 106577827 106467865 106380272 106426308 106480858 106418633 106351181 106365440 106409691 106475899 106519768 106475494 106399582
1672 106399582 106306694 106256317 106338928 106475952 106655693 106767960 106662079 106447456 106124542 105869217
1682 105869217 105915215 106089302 106322571 106535576 106600639 106593224 106547615 106459496 106323456 106177094 106051132
1693 106051132 105960587 105954666 105961273 105881645 105844666 105993843 106186249 106324646 106415154 106406067 106373550 106375954
1705 106375954 106414696 106533310 106663773 106769943 106799385 106636520 106434532 106315590 106256989 106280754 106374763
1716 106374763 106567169 106759071 106851433 106872749 106781624 106688690 106727524 106787849 106804558 106775497 106653381
1727 106653381 106508469 106412811 106313416 106140968 106016327 106076050 106203384 106326843 106446983 106550789
1737 106550789 106607391 106548691 106473061 106466530 106497856 106593086 106666328 106602142 106515121 106488129 106500603 106569382
1749 106569382 106664894 106768341 106864166 106928612 106967209 106973816 106959511 106928535 106895042 106881927 106866859 106826378
1761 106826378 106786537 106773926 106763245 106746696 106698296 106570175 106420036 106258156 106178787 106334587 106560440
1772 106560440 106742432 106879593 106904411 106902435 106971313 107006836 106897614 106762505 106700256 106659622 106605553
1783 106605553 106588028 106666161 106777451 106889984 106970932 106962204 106907295 106804298 106731033 106806778 106905075
1794 106905075 106926537 106908989 106833191 106770775 106804581 106881668 106994415 107089592 107102966 107059624 106930084
1805 106930084 106813553 106837105 106887337 106864761 106854485 106944420 107026695 107000305 106932426 106835052 106772469 106850960
1817 106850960 106956268 106993889 107010651 107037636 107027336 106913544 106783104 106704567 106666420 106682083 106745171
1828 106745171 106859543 107007767 107199379 107357193 107394432 107349251 107187653 107039139 107087662 107135864 106993462
1839 106993462 106823135 106730652 106696243 106746506 106848099 106996986 107131813 107160995 107171059 107251762 107301476
1850 107301476 107196785 107092545 107145119 107226562 107250618 107248520 107219933 107172989 107109520 107047958 107020020 106987473
1862 106987473 106887123 106825638 106943253 107075760 107082489 107032921 106926178 106832428 106851501 106893494 106885834
1873 106885834 106876205 106902550 106921127 106869698 106841347 106961845 107070610 106986305 106896996 106984497 107086136
1884 107086136 107063416 107025291 107063385 107090904 107012962 106945084 107010841 107091164 107068230 107061890 107213516 107340431
1896 107340431 107244514 107113190 107092621 107108162 107143211 107169579 107133224 107094879 107122543 107140350 107059906 106986641
1908 106986641 107031631 107089493 107079269 107038757 106958412 106899117 106951378 107016541 107014206 106979752 106903053 106840225
1920 106840225 106861351 106914398 106971100 107029961 107084824 107121155 107110641 107088470 107083008 107086227 107096382 107122726
1932 107122726 107200005 107249977 107180023 107068039 106940247 106858681 106946609 107046249 107014702 106930252 106792786
1943 106792786 106694366 106765411 106890533 107000015 107086922 107114098 107102249 107030388 106986404 107107307 107224533
1954 107224533 107166031 107079292 107074356 107091476 107116196 107122490 107054825 106986877 106991173 107015465 107021858 107039597 107106354
1967 107106354 107158661 107132126 107067108 106964180 106878113 106879974 106921150 106977486 107046555 107121536 107191368 107251808
1979 107251808 107275246 107219719 107123802 106987045 106884216 106919693 107004021 107093575 107155228 107125618 107051773
1990 107051773 106957291 106848953 106721970 106634590 106675644 106748344 106769180 106786896 106831886 106875610 106899239
2001 106899239 106904007 106863022 106841637 106942871 107026550 106931450 106823608 106856796 106906555 106890129 106836151 106712151
2013 106712151 106618378 106680038 106789635 106892159 106955261 106905556 106811020 106701370 106618073 106633163 106684349
2024 106684349 106738899 106780006 106765007 106738495 106741859 106742020 106703926 106674812 106713821 106750198 106708977 106661987
2036 106661987 106667587 106691101 106714867 106746056 106798676 106834480 106807968 106754662 106688095 106628609 106600929 106605103
2048 106605103 106665512 106733627 106762291 106771469 106743904 106743881 106872536 107001877 107018257 106979538 106894943 106796455
2060 106796455 106696487 106662560 106837654 107007576 106956604 106832077 106696983 106588554 106580856 106626053 106713699
2071 106713699 106805611 106846237 106877113 106923798 106978462 107047394 107113548 107180115 107192612 107055283 106894829
2082 106894829 106819054 106788589 106817482 106853149 106824234 106800911 106858871 106910133 106867455 106804199 106755470 106748650
2094 106748650 106855698 106977699 107030846 107041504 106989693 106930588 106917023 106936028 107010361 107085297 107112312
2105 107112312 107095238 107005646 106891586 106769371 106705757 106830193 106970764 106951569 106913879 106987167 107030746
2116 107030746 106885887 106735970 106755348 106812241 106813095 106817459 106864929 106921646 106979652 107000542 106916496 106807472
2128 106807472 106728508 106686142 106727386 106785629 106796288 106800247 106822037 106846138 106855843 106878967 106970360 107032227
2140 107032227 106942108 106828781 106796455 106796410 106824638 106851051 106829308 106803940 106811806 106829521 106854340 106861015 106785652
2153 106785652 106741096 106872818 107018829 107026649 107013153 107074615 107120178 107059143 106987282 106989265 107007408 107026413
2165 107026413 107003471 106835342 106687881 106745911 106849312 106877205 106896683 106947067 106990791 107011078 106984833
2176 106984833 106854965 106706543 106599518 106551865 106643600 106748436 106729652 106698318 106748055 106794479 106767532
2187 106767532 106717827 106672646 106631592 106604477 106587814 106584045 106584908 106568764 106577965 106667305 106777641 106876205
2199 106876205 106938744 106923149 106849953 106690216 106550194 106561256 106618881 106658073 106691360 106710526 106712601 106684494
2211 106684494 106648178 106618973 106603500 106624557 106648827 106636879 106629684 106680367 106712936 106606575 106548592 106776115
2223 106776115 107018784 107023285 106975296 107010696 107025314 106931091 106815147 106722641 106691261 106820824 106970070
2234 106970070 107024597 107003448 106841805 106676674 106647156 106682159 106781311 106871506 106849243 106805161 106820221
2245 106820221 106819984 106735756 106631210 106536270 106483337 106542183 106630608 106687851 106719353 106693672 106660316 106679245
2257 106679245 106687378 106628342 106541946 106436081 106349846 106327225 106361290 106492065 106622719 106638527 106632973 106693123
2269 106693123 106723305 106622742 106493523 106409286 106354591 106317970 106360817 106611420 106857491 106891632 106827354
2280 106827354 106691597 106536385 106426765 106350586 106323288 106327148 106364799 106390472 106338402 106271263 106239700
2291 106239700 106213928 106179687 106140877 106082222 106046722 106096390 106158661 106192444 106165291 105995705 105789658
2302 105789658 105615974 105504585 105549789 105627228 105634689 105599998 105500290 105385353 105317497 105236122 105081459
2313 105081459 104913254 104791428 104655548 104437065 104220078 104100868 103974052 103720306 103477379 103349968
2323 103349968 103317978 103428986 103584480 103735588 103780914 103492119 103201126 103254959 103379723 103359245 103367210
2334 103367210 103570770 103773140 103795578 103750801 103674240 103618958 103668427 103766678 103875015 104025055 104266167
2345 104266167 104506042 104691269 104754280 104591820 104257561 103726410 103131149 102566833 102121208 102012703
2355 102012703 101944206 101601601 101253960 101057121 101036575 101337601 101756332 102174522 102480621 102410194
2365 102410194 102303619 102473518 102738716 103000732 103323891 103759026 104247757 104792091 105261658 105472443
2375 105472443 105587051 105679298 105831238 106240768 106634232 106747719 106749870 106702301 106661774 106734489 106833435
2386 106833435 106899712 106955101 107021713 107039543 106917259 106770660 106694031 106660248 106690308 106734062 106741074 106732796
2398 106732796 106710503 106684303 106675697 106651497 106575920 106478020 106358955 106266640 106267715 106307121 106358620 106402107
2410 106402107 106395241 106378197 106386276 106391647 106364510 106345673 106377029 106425377 106480026 106515427 106468269 106440880
2422 106440880 106561111 106688972 106708191 106675217 106579445 106505730 106571983 106668259 106728104 106738564 106620094
2433 106620094 106505775 106523872 106609108 106779716 106913254 106828545 106719803 106771278 106831619 106766914 106709122
2444 106709122 106777718 106876083 106949471 106991623 106962822 106908417 106876114 106819107 106659081 106538200 106629921
2455 106629921 106761887 106803581 106802628 106737350 106684944 106743813 106828590 106888153 106917999 106892036 106823921 106698013
2467 106698013 106576080 106532761 106513596 106483551 106458618 106433510 106436798 106522896 106608749 106616638 106584976 106512756
2479 106512756 106440521 106401131 106416298 106567665 106708145 106675789 106596733 106547287 106514641 106512474 106537460 106614876
2491 106614876 106672546 106612297 106537247 106543228 106553818 106503250 106455322 106457542 106493042 106596329 106660767 106540871
2503 106540871 106387451 106319046 106286766 106295517 106302116 106242348 106184006 106186844 106210709 106245872 106260582 106197617
2515 106197617 106123474 106091049 106083557 106116486 106145836 106111809 106077049 106090591 106133148 106223274 106296463 106274124
2527 106274124 106217148 106150246 106103157 106130859 106182076 106226013 106256126 106244896 106224228 106216835 106222748 106268188
2539 106268188 106297226 106249382 106164528 106033875 105942963 106030037 106127975 106073906 105993248 105977371 105965591 105919624
2551 105919624 105863594 105797409 105755302 105796265 105845764 105827332 105805710 105842972 105870529 105827591 105752708 105652542
2563 105652542 105561615 105528023 105517387 105504868 105509689 105560730 105603813 105592133 105532288 105376694 105241135 105261131
2575 105261131 105329636 105396011 105426216 105339790 105225060 105152985 105094910 105037971 105005524 105026909 105071159 105130814
2587 105130814 105164597 105110168 105023003 104922340 104854248 104914070 104972984 104897285 104796692 104746605 104715988
2598 104715988 104703285 104695221 104671219 104651665 104663536 104666443 104609680 104550911 104550552 104549408 104493973 104427406 104365036
2611 104365036 104336571 104399895 104485771 104535652 104575180 104610893 104641434 104679634 104689476 104620430 104528809 104459808
2623 104459808 104396225 104319832 104278755 104341103 104428360 104481956 104509949 104490784 104454514 104432800 104399155 104316284
2635 104316284 104248192 104260971 104310730 104392815 104455444 104429031 104362030 104268738 104181908 104140450 104140160 104211426
2647 104211426 104289169 104318024 104299088 104195404 104065849 103946854 103868553 103899361 103960609 103997398 104006599
2658 104006599 103962227 103877975 103734184 103604721 103582596 103590416 103567078 103556587 103584976 103644989 103783630
2669 103783630 103863861 103693077 103484848 103405907 103403755 103518654 103638908 103636620 103600456 103572968 103564453 103629066
2681 103629066 103677673 103601051 103513550 103512955 103539658 103569199 103593681 103593750 103579308 103546234 103517105 103509666 103533890
2694 103533890 103618690 103724716 103829788 103910919 103932526 103910019 103818222 103743286 103804733 103877235 103855438
2705 103855438 103798698 103720734 103652977 103663422 103655716 103526970 103364822 103204514 103100227 103165245 103257324
2716 103257324 103253006 103209229 103149536 103050636 102860855 102688904 102658890 102672646 102659035 102661087 102699753 102769829
2728 102769829 102875755 103009201 103192497 103337814 103315948 103273132 103326012 103433823 103632187 103808517
2738 103808517 103835251 103792908 103705170 103615021 103576706 103580093 103655815 103735565 103759285 103732605 103597519 103484627
2750 103484627 103545502 103659203 103766060 103833603 103786232 103693481 103595688 103504684 103454567 103418633 103370834
2761 103370834 103343056 103383446 103417229 103360603 103288742 103264046 103241035 103189392 103125763 103059479 102982094 102891609
2773 102891609 102777672 102599045 102446220 102434204 102447937 102405907 102322151 102159073 101989723 101899529 101813766
2784 101813766 101683189 101516487 101300934 101051353 100756714 100481628 100305222 100172638 100063065 99953201
2794 99953201 99810623 99641678 99435730 99210953 98981544 98748611 98513367 98289413 98109940 97917267
2804 97917267 97653122 97352341 97018600 96686890 96416069 96137878 95794746 95413445 94987175 94558784
2814 94558784 94186569 93817062 93426414 92984055 92426941 91828369 91271446 90663506 89918709 89099503
2824 89099503 88266922 87339256 86259460 85014297 83570480 81931091 80085251 78041245 75807068
2833 75807068 73372314 70715546 67877815 64870285 61760925 58597397 55451561 52401302 49476028
2842 49476028 46753025 44166183 41640209 39279842 37120914 35294701 33957268 33070015 32671474
2851 32671474 32686089 33068253 33766342 34728790 35909508 37267040 38735771 40294025 41768215
2860 41768215 42956470 43921780 44653297 45170471 45455837 45609093 45677135 45800900 46135258 46684978
2870 46684978 47548340 48599602 49783443 50986790 52097321 53057358 53781818 54240417 54338074 54183983
2880 54183983 53877972 53352928 52521347 51543903 50561619 49545906 48519585 47469185 46379494
2889 46379494 45278404 44175507 43110180 42134712 41219780 40356586 39535618 38758038 37982891 37158752
2899 37158752 36318111 35469341 34633324 33827972 33070374 32418011 31767559 31012486 30219769 29431293
2909 29431293 28615711 27735447 26851057 26012993 25213789 24450016 23759817 23189281 22710800 22290920
2919 22290920 21993160 21888327 21920942 22061419 22302794 22612381 23037575 23649071 24344204 24987743
2929 24987743 25747967 26801132 27987957 29207943 30460976 31716919 32965229 34191681 35376930
2938 35376930 36540531 37551285 38265560 38739967 38973949 38995049 38833950 38480663 37895344 37197922
2948 37197922 36462997 35786438 35289906 34970615 34872864 34976959 35289642 35775803 36379147 37169815
2958 37169815 38192627 39467072 41029045 42874023 45043278 47435165 49944828 52623104 55518269
2967 55518269 58533047 61623310 64677597 67560768 70299408 72846100 75287552 77774902 80067467
2976 80067467 81893684 83497070 85050346 86494232 87836243 89048477 90077850 91007401 91914200
2985 91914200 92762878 93556686 94256493 94777939 95259903 95857140 96437431 96905327 97304916 97649170
2995 97649170 97935745 98153610 98341652 98526146 98733688 99020363 99323914 99592087 99850845 100106216
3005 100106216 100365517 100644394 100923897 101218536 101443459 101465912 101444099 101506638 101609253 101765106
3015 101765106 101930283 102079102 102169922 102089668 102026726 102175186 102404739 102664330 102909897 103088402
3025 103088402 103175690 103071068 102950928 102979897 103092529 103311180 103537010 103676437 103735687 103646492 103538605
3036 103538605 103541801 103587769 103640625 103732559 103915642 104094101 104175713 104201653 104161095 104117821 104151627 104203537
3048 104203537 104223633 104264305 104380562 104514404 104626747 104715706 104752419 104778412 104833771 104893562 104958221
3059 104958221 104991577 104929306 104855988 104846954 104865356 104890297 104949020 105098412 105228569 105216881 105157974 105107948
3071 105107948 105059334 105004623 104999992 105161644 105302048 105194878 105072449 105131271 105252312 105397919 105520370
3082 105520370 105547478 105515030 105414703 105306412 105241371 105237122 105368950 105514618 105554581 105556030 105530502
3093 105530502 105525276 105615707 105729080 105829903 105881645 105788376 105692741 105759644 105826355 105746292 105635666
3104 105635666 105569267 105524513 105507782 105506706 105489967 105520584 105699394 105881592 105932541 105922440 105858803 105794952
3116 105794952 105802155 105833717 105875465 105901077 105864571 105810501 105764961 105736992 105753853 105786774 105817177 105841705
3128 105841705 105846191 105844521 105838730 105849884 105924202 105988266 105971191 105911560 105794594 105709480 105778404 105887390
3140 105887390 105971046 106005501 105889534 105789520 105905869 106035255 105992218 105923386 105935814 105962677 105971863
3151 105971863 105966377 105947372 105888130 105704712 105569649 105693077 105878067 105978676 106051849 106106636 106140495
3162 106140495 106159378 106146835 106070282 105984070 105928230 105912949 105988594 106074570 106093452 106085945 106060028 106036301
3174 106036301 106043602 106064888 106104729 106127090 106071091 106015701 106051132 106082680 106008598 105940224 105972740 106052467
3186 106052467 106182503 106287666 106273483 106200714 106073235 105967072 105991936 106050491 106066391 106086205 106154701
3197 106154701 106200935 106129929 106058502 106102226 106169487 106200813 106215240 106202126 106190681 106221672 106249619 106220123
3209 106220123 106200287 106248215 106336403 106481575 106609009 106635376 106603050 106495834 106405853 106444672 106537674
3220 106537674 106668259 106773903 106775734 106706192 106521225 106371162 106447220 106582596 106669762 106721802 106697678
3231 106697678 106652191 106645508 106620407 106489655 106403015 106529213 106723785 106904312 107053162 107115814 107120300
3242 107120300 107069756 106984184 106877136 106770920 106687881 106641365 106677696 106720329 106660652 106641098 106824753
3253 106824753 107041023 107182289 107222702 107048721 106815483 106629326 106522705 106620216 106751701 106764313
3263 106764313 106730438 106651970 106587219 106612991 106675293 106749748 106824112 106877686 106911110 106923416 106898422 106777527
3275 106777527 106686874 106788017 106916023 106950401 106919144 106763794 106623077 106649521 106743164 106871078 106984520
3286 106984520 107002708 106988762 106984138 106972809 106951859 106923340 106885956 106846619 106794640 106781410 106887291 107014610
3298 107014610 107102539 107120773 106969330 106796387 106728668 106730293 106841400 106960487 106974503 106958176 106951523
3309 106951523 106945374 106945343 106947014 106944466 106947662 106991600 106995132 106818672 106672264 106783058 106959747 107096436
3321 107096436 107163956 107037544 106897858 106921814 106995750 107082268 107129120 107040260 106909485 106786156 106707283
3332 106707283 106754013 106843040 106913826 106979080 107038422 107070518 107042618 106988289 106925819 106868073 106840584 106823372
3344 106823372 106791901 106785271 106864212 106939194 106913826 106869270 106863113 106869431 106889008 106898926 106853226 106821609 106888435
3357 106888435 106963631 106986282 106952927 106779602 106646706 106778404 106959297 107026695 107046219 107028725 106975677
3368 106975677 106897018 106778000 106556770 106384346 106435844 106577011 106745316 106900383 106958412 106987022 107042122
3379 107042122 107074905 107039162 106982925 106943275 106906700 106867050 106839226 106834694 106857468 106930420 107008362 107056831
3391 107056831 107066246 107005836 106904388 106741379 106633949 106755997 106916328 106966209 106952095 106831192 106722328
3402 106722328 106773735 106854080 106840752 106855774 107054443 107214310 107080528 106905342 106894684 106932571 106957504
3413 106957504 107011650 107163879 107272339 107161186 107001259 106903931 106871368 106987953 107118149 107122162 107097122
3424 107097122 107102509 107111404 107111694 107118103 107153793 107181091 107162712 107120369 107065865 106991341 106869957 106770226 106770111
3437 106770111 106814362 106882263 106948090 106968353 106975319 106981064 107002304 107083221 107153366 107140587 107094147 107037331
3449 107037331 106975578 106914139 106876656 106914185 106949493 106875916 106832481 106979393 107146164 107186340 107187958 107178856
3461 107178856 107192970 107306931 107420471 107429909 107421753 107487366 107508255 107350281 107151627 107000946 106912445
3472 106912445 106969521 107052895 107030724 107024002 107148979 107288071 107363960 107372070 107238670 107093643 107068420
3483 107068420 107084465 107107140 107135986 107157639 107176163 107195999 107202362 107160088 107134750 107209755 107296204 107334183
3495 107334183 107320091 107178352 107064743 107160591 107313393 107435104 107513474 107495834 107415031 107264664 107109665
3506 107109665 107003189 106974052 107119156 107287216 107338211 107335281 107294296 107216736 107070518 106971954 107087036
3517 107087036 107234642 107257843 107250000 107252190 107264091 107319763 107357025 107305885 107223579 107148483 107066940 106940933
3529 106940933 106881882 107062599 107260605 107253738 107213493 107266594 107325172 107331390 107321571 107317474 107304619 107273102
3541 107273102 107230927 107180283 107128502 107087372 107045319 106974533 106935379 107006645 107105232 107170273 107213852 107224106
3553 107224106 107211922 107189301 107140968 107024666 106933426 106981064 107062866 107099625 107128311 107167267 107192780 107165100
3565 107165100 107150551 107234024 107319878 107324745 107296463 107233406 107200577 107313011 107418892 107355209 107270500 107304123
3577 107304123 107320496 107189270 107033966 106962418 106891319 106731796 106608391 106650589 106754349 106860397 106963875
3588 106963875 107055542 107089233 106968330 106834671 106823753 106857727 106909988 106962128 106977722 106984138 107008621 107014801
3600 107014801 106957985 106890228 106860992 106833191 106788300 106719894 106575462 106474449 106572083 106708313 106778740
3611 106778740 106771393 106566925 106382988 106457230 106610199 106744743 106851433 106878922 106855865 106789871 106692459
3622 106692459 106574699 106445145 106294014 106186981 106193520 106292366 106540726 106772568 106784721 106745430 106784912
3633 106784912 106813690 106769394 106700775 106617096 106574318 106674881 106788704 106814430 106768227 106613846 106407188
3644 106407188 106161453 105968239 105924011 106027031 106380989 106765869 106982658 107071991 106949257 106790924
3654 106790924 106784035 106812309 106808449 106812263 106859375 106894989 106858994 106802895 106761505 106724762 106709549 106669594
3666 106669594 106541367 106393501 106260941 106181099 106239151 106326462 106327034 106347725 106499550 106654099 106675812
3677 106675812 106697105 106863327 106999969 106938721 106806061 106700821 106537460 106170532 105878540 105981659
3687 105981659 106209442 106386139 106547615 106665894 106756805 106841896 106875824 106782028 106675598 106674553 106693314
3698 106693314 106681396 106651611 106577538 106526161 106583687 106665947 106718369 106738304 106700348 106618095 106469490 106336067
3710 106336067 106303429 106337234 106445549 106586624 106741096 106849815 106825470 106733109 106589699 106451820 106386253
3721 106386253 106379387 106466820 106567642 106586197 106602142 106722595 106769394 106488777 106214447 106294868 106431816
3732 106431816 106395485 106329109 106322220 106306000 106190514 106128670 106356934 106534668 106273743 105952957 105847694
3743 105847694 105879875 106119080 106397675 106550980 106639526 106657288 106639267 106613586 106594849 106618736 106649902
3754 106649902 106642410 106663658 106812408 106948448 106935242 106860207 106742523 106650139 106704689 106764175 106678345
3765 106678345 106593346 106619408 106714058 106908180 107091667 107140205 107127190 107090828 107012321 106867958 106710266
3776 106710266 106564613 106488777 106600143 106744934 106772377 106790565 106884148 106972481 107003090 106976059 106851624
3787 106851624 106696442 106544777 106453796 106555054 106659554 106568954 106442642 106398773 106362511 106273628 106206253
3798 106206253 106220459 106297920 106477882 106647469 106689499 106656166 106539436 106402733 106301712 106251526 106283424
3809 106283424 106404373 106695625 106965538 107011200 106947517 106804298 106633759 106495026 106397102 106391380 106409691
3820 106409691 106388809 106365273 106339645 106356667 106481339 106653191 106872986 107021835 106927444 106750534 106596420
3831 106596420 106458733 106364563 106318687 106333305 106413269 106613632 106795738 106781532 106744240 106863525 106941910
3842 106941910 106794403 106563042 106300140 106089806 106097458 106131172 106005188 105866264 105781433 105803825 106089661
3853 106089661 106396362 106467529 106500603 106656952 106788177 106778839 106691071 106517120 106351181 106293129 106317856
3864 106317856 106485870 106639984 106599213 106495476 106389618 106313705 106344009 106408546 106456680 106500366 106561470
3875 106561470 106559349 106354645 106145119 106096741 106165268 106424072 106686234 106747032 106733086 106702728 106655807
3886 106655807 106603714 106569839 106619476 106638145 106464508 106304382 106376221 106480835 106457016 106409264 106402229
3897 106402229 106393883 106356834 106311508 106233170 106229782 106485031 106746887 106769920 106717751 106675461 106633118 106602905
3909 106602905 106603600 106680443 106765839 106798599 106804703 106789276 106753662 106680893 106630753 106692123 106760689 106748535
3921 106748535 106695221 106578972 106495758 106575012 106694389 106765007 106815910 106823204 106856560 107045151 107186363
3932 107186363 107067749 106848022 106563873 106368828 106522247 106743164 106803177 106803658 106775238 106701614 106550072
3943 106550072 106400223 106322021 106311394 106419518 106550217 106602837 106642029 106736732 106773232 106601456 106399132
3954 106399132 106296707 106285950 106434822 106645012 106878372 107022354 106890060 106666252 106459137 106311394
3964 106311394 106328270 106430199 106600876 106755371 106763268 106744507 106816246 106856415 106736015 106592964 106513359
3975 106513359 106523659 106756805 106979225 106940674 106823875 106731819 106653236 106614044 106605621 106653809 106680916
3986 106680916 106576302 106464432 106454895 106481720 106527115 106556061 106515289 106441620 106341095 106252625 106222298
3997 106222298 106234261 106324722 106383636
4000 106383636
##END=$$ End of the data block
