##TITLE=1125 $$ Begin of the data block
##JCAMP-DX=5.00 $$ ACD/SpecManager v 10.08
##SPECTROMETER/DATA SYSTEM=Alpha
##DATE=18 Dec 2013 10:32:56
##DATA TYPE=INFRARED SPECTRUM
##DATA CLASS=XYDATA
##ORIGIN=
##OWNER=
##NPOINTS=1667
##FIRSTX=599.63549805
##LASTX=3997.56909180
##MAXX=3997.56909180
##MINX=599.63549805
##MAXY=0.78789902
##MINY=0.35025916
##XFACTOR=1.0000000000
##YFACTOR=1.000000000000000e-9
##FIRSTY=0.75104886
##DELTAX=2.03957605
##XUNITS=1/CM
##YUNITS=ARBITRARY UNITS
##XYDATA=(X++(Y..Y))
599.6G51048863k032995k045989k209366l081441l520727l924668m934787n798757
616G23500133p163108r362697j1082411j2263596j2751460j0996342p083774k160489
632.3F50636256L313601Q091688J0951638J2320221J2257278J0703742Q824766O843865
648.6G23943055M615068L117800K124369R56953L64899J18196m46617J39117K134919
666.9G37067759P22349k691269j899064r24408o94454o56366j036465j255334j239002
685.3G27393746j480221j400650j238108j548349j473785j222789j456738j375973
701.6G16197133j191735j491845j393020j070499j239479j229227j078307j149178
717.9G06353843j078725j337587j734853j415491j208783j490056j336992j208484
$$ y = [751048863, 749015868, 746969879, 744760513, 741679072, 738158345, 734233677, 729298890, 723500133, 716337025, 706974328, 695891917, 683628321, 670876861, 659880519, 652796745, 650636256, 653949857, 662041545, 672993183, 685313404, 697570682, 708274424, 717099190, 723943055, 728558123, 731675923, 733800292, 734757245, 735122144, 735240340, 734793723, 734932840, 737067759, 737790108, 735098839, 733199775, 732275367, 731580913, 730924547, 729888082, 728632748, 727393746, 725913525, 724512875, 723274767, 721726418, 720252633, 719029844, 717573106, 716197133, 715005398, 713513553, 712120533, 711050034, 709810555, 708581328, 707503021, 706353843, 705275118, 703937531, 702202678, 700787187, 699578404, 698088348, 696751356, 695542872]
734.2F95542872j483381j376569j356721j707673j558364j410961j775205j734674
750.6F83139324j534998j726508j693786j654207j899481j864374j846671k138018
766.9F68781281k071381j924157k163470k208710k181113k404868k372146k401411
783.2F51054025k798975k900779l022671l435552l495455l648996m258514m489600
799.5F23003483m675985n187451n131841m838467m690110l874362k642035j391173
815.8E90572059M31836K217471L439665M628539N205214M936993M551054L619134K175987
834.2F21777952J177430K26199q59200j426638j925885k515197k598822k714753l021896
852.5F08119190k918005l011823l441572l468692l479422l698885l710508l950775
$$ y = [695542872, 694059491, 692682922, 691326201, 689618528, 688060164, 686649203, 684873998, 683139324, 681604326, 679877818, 678184032, 676529825, 674630344, 672765970, 670919299, 668781281, 666709900, 664785743, 662622273, 660413563, 658232450, 655827582, 653455436, 651054025, 648255050, 645354271, 642331600, 638896048, 635400593, 631751597, 627493083, 623003483, 618327498, 613140047, 608008206, 603169739, 598479629, 594605267, 591963232, 590572059, 591003895, 593221366, 596661031, 601289570, 606494784, 611431777, 615982831, 619601965, 621777952, 622955382, 623181581, 622322381, 620895743, 618969858, 616454661, 613855839, 611141086, 608119190, 605201185, 602189362, 598747790, 595279098, 591799676, 588100791, 584390283, 580439508]
868.9E80439508m391611m468321m737795n313635n655825o259143p163644p826924
885.2E34622610q773923r930671j0596454j0984838j0918796j0086775r150594q388072
901.5D55792487p728547p752001q469731r355605j0425746j1306346j1422962j0963142
917.8C78368407r865373p981062n833685l511548r17584J431704L442645N245864O454259
936.2C66833627P156015P565915P338286O614297N674780M360646K961725J834631
952.5D10339922Q44150J30535k01434m50909n29290m13626m53025n56529o96242j131683
972.9D06881869j660347k134115k747118l290832l669530m155934m519373m562587
989.2C80142033m541218m418850m114539l773093l278732k630919k016485j330406
$$ y = [580439508, 576047897, 571579576, 566841781, 561528146, 555872321, 549613178, 542449534, 534622610, 525848687, 515918016, 505321562, 494336724, 483417928, 473331153, 464180559, 455792487, 448063940, 440311939, 431842208, 422486603, 412060857, 400754511, 389331549, 378368407, 368503034, 360521972, 354688287, 351176739, 350259155, 351690859, 355133504, 360379368, 366833627, 373989642, 381555557, 388893843, 395508140, 401182920, 405543566, 408505291, 410339922, 411184072, 411314607, 411113173, 410662264, 410132974, 409719348, 409266323, 408709794, 408013552, 406881869, 405221522, 403087407, 400340289, 397049457, 393379927, 389223993, 384704620, 380142033, 375600815, 371181965, 367067426, 363294333, 360015601, 357384682, 355368197, 354037791]
1005.5C54037791n67406J42783Q90344J645983K317816L093362L845542M335195M817814
1023.9C74559224N367726N754351O051302O299913O360233O337822O211668N859732
1040.2D22801971N481244N124747M616678M153550L823846L435463L119469K942055
1056.5D55499023K789825K705932K657265K500623K367169K314299K146006J946449
1072.8D74926591J787871J536787J231938Q98570M37796j18196p53701j446515k044618
1091.2D76456523k520472k941042l230095l317714l264934l018051k588749k099573
1107.5D53475893j522989r06437l72827J01238M81546P23243R25183J056403J107812
1125.8D55069065J215309J337975J365155J331598J232683J070977R16183O62952K77400
$$ y = [354037791, 353470385, 353613168, 354503512, 356149495, 358467311, 361560673, 365406215, 369741410, 374559224, 379926950, 385681301, 391732603, 398032516, 404392749, 410730571, 416942239, 422801971, 428283215, 433407962, 438024640, 442178190, 446002036, 449437499, 452556968, 455499023, 458288848, 460994780, 463652045, 466152668, 468519837, 470834136, 472980142, 474926591, 476714462, 478251249, 479483187, 480381757, 480819553, 480701357, 479947656, 478501141, 476456523, 473936051, 470995009, 467764914, 464447200, 461182266, 458164215, 455575466, 453475893, 451952904, 451046467, 450673640, 450774878, 451256424, 451979667, 452904850, 453961253, 455069065, 456284374, 457622349, 458987504, 460319102, 461551785, 462622762, 463538945, 464201897, 464479297]
1144.2D64479297l0934k12849l71515n00590n70744n72682n26875m58598l30091j74880
1164.6D60729539p7396p898J42276L41118M95165O50973Q41140J013756J182228J376927
1185D66687828J563311J752645J973211K177418K363294K599269K822727K989680L183245
1203.3D88112628L384203L611744L877818M077286M253685M475117M656851M848659
1219.7E21297991N116880N287409N400777N597651N752683N901932O110251O200254
1236E66665828O242693O330549O322682O360472O475448O402552O283880O280124O148040
1254.3F23512268N942524N815208N616009N423605N268157M964590M690468M517198
1270.6F65750027M206240L933430L727197L330052L024399K892197K598166K328873
$$ y = [464479297, 464448363, 464235514, 463863999, 463363409, 462792665, 462219983, 461693108, 461234510, 460904419, 460729539, 460652143, 460644245, 460786521, 461127639, 461622804, 462273777, 463114917, 464128673, 465310901, 466687828, 468251139, 470003784, 471976995, 474154413, 476517707, 479116976, 481939703, 484929383, 488112628, 491496831, 495108575, 498986393, 503063679, 507317364, 511792481, 516449332, 521297991, 526414871, 531702280, 537103057, 542700708, 548453391, 554355323, 560465574, 566665828, 572908521, 579239070, 585561752, 591922224, 598397672, 604800224, 611084104, 617364228, 623512268, 629454792, 635270000, 640886009, 646309614, 651577771, 656542361, 661232829, 665750027, 669956267, 673889697, 677616894, 680946946, 683971345, 686863542, 689461708, 691790581]
1287F91790581K177953J869560J619160J484871J201749J000762R09447O71208N19932
1305.3G03245223M94718K89559Q5712M4286m7505o9618K2292n4836j37627j31428k44797
1327.8G03495979k67028k17379l94046n55217n37992l58581k2471M1663k14397l03865
1348.2G00666666k21789k65837k78234k14100l79205o25968n61058k94805l21746o98506
1368.5F96805418j204968j582980j479566j017630m93706J38998O09458Q05438J091718
1386.9F93672180J321316R98259L59356J8358J95384M78447M56988J63675Q7499J45555
1407.3F97897017N4419l338j59442n61893q47280m32372J53482N0008k95878o35385
1427.7F95219338r21607j125753j679242k672612l265679l544808m678249n811274
$$ y = [691790581, 693968534, 695838094, 697457254, 698942125, 700143874, 701144636, 702054083, 702725291, 703245223, 703739941, 704029500, 704115212, 704159498, 704111993, 704042375, 704064667, 704009831, 703872204, 703740776, 703495979, 703228951, 703011572, 702617526, 702062309, 701524317, 701165736, 701143265, 701184928, 700970531, 700666666, 700444877, 700179040, 699900806, 699686706, 699307501, 698681533, 698120475, 697825670, 697503924, 696805418, 695600450, 694017470, 692537904, 691520274, 691026568, 691165566, 691775024, 692580462, 693672180, 694993496, 695991755, 696351111, 696369469, 696564853, 697043300, 697500288, 697663963, 697751462, 697897017, 697951436, 697948098, 697788656, 697226763, 696379483, 695947111, 696100593, 696150601, 695854723, 695219338, 694297731, 693171978, 691492736, 688820124, 685554445, 682009637, 677331388, 671520114]
1444F71520114n783498m477799k381623q82447m57346k57135J166046K262413J997650
1462.4F62706375K122581K812505K456248J477360J230658J482844J388192R52482
1478.7F76629245K98679j62721n28216j157462j242280l65675j03712q13603j147986
1497F71406269o85453m94957j037836k128005k043665j74880J41502o20306j245916
1515.4F63116753j450479j390874j185954o71923m34220m24027o11723j182496j258314
1533.7F54506743r63271j555621k184570j090050M709N6982m54903r74893j083315
1552.1F46261811j362085j900315j982868l44098O08266j03772q40187j174569q69513
1570.5F38292670o17981j066565j127064n28694n16772p78973r16779r93073r76026
$$ y = [671520114, 665736616, 661258817, 658877194, 657994747, 657537401, 657280266, 658446312, 660708725, 662706375, 664828956, 667641461, 670097709, 671575069, 672805727, 674288571, 675676763, 676629245, 676927924, 676765203, 676236987, 675079525, 673837245, 673471570, 673367858, 672554255, 671406269, 670720816, 670225859, 669188023, 667060018, 665016353, 664841473, 664982975, 664362669, 663116753, 661666274, 660275400, 659089446, 658417523, 657983303, 657559276, 656947553, 655765057, 654506743, 653543472, 651987851, 649803281, 648713231, 648717940, 648774922, 648320019, 647345126, 646261811, 644899726, 642999411, 641016543, 640672445, 641280711, 641176939, 640336752, 639162183, 638292670, 637674689, 636608124, 635481060, 634952366, 634435594, 633656621, 632739842, 631746769, 630770743]
1588.8F30770743j056731j175403j121045j085221j196623j313329j451135j564324
1605.1F20806932j608073j654327j654625j742959k127528k208054j662016j804233
1621.5F06345117k148211j749933j410544j323044j371026j801968j749992n39064
1637.8E94251335j39177o67691j240075j539230j029194o28590j137793m93885Q75116
1656.1E88250816M03344n27620p49886l19838k72572m90904j55449K79248L92139N93543
1676.5E87402821M74155q4222m06504M24505J403928J167416P81775L40640r9182j05739
1696.9E91299593L04103J114071J378596J081466J119912J118600P64668K87056Q7977
1715.3E98556042P91371J791894J711845J276672J048267P73847M80116L43084Q20756
$$ y = [630770743, 629714012, 628538609, 627417564, 626332343, 625135720, 623822391, 622371256, 620806932, 619198859, 617544532, 615889907, 614146948, 612019420, 609811366, 608149350, 606345117, 604196906, 602446973, 601036429, 599713385, 598342359, 596540391, 594790399, 594251335, 594112158, 593444467, 592204392, 590665162, 589635968, 589007378, 587869585, 587375700, 588250816, 588654160, 588126540, 587376654, 587056816, 586784244, 586293340, 586137891, 586417139, 586809278, 587402821, 587876976, 587792754, 587386250, 587810755, 589214683, 590382099, 591163874, 591504514, 591405332, 591299593, 591603696, 592717767, 594096363, 595177829, 596297741, 597416341, 598181009, 598468065, 598556042, 599347413, 601139307, 602851152, 604127824, 605176091, 605949938, 606430054, 606773138, 607593894]
1733.6F07593894J654565J433194J062870J157641J160443R34959P62284J075446J634956
1752F18470252J549243J184762J081169J026868J177252J268625R52840O86347O63817
1770.3F28061175J113534J644969J480401J119733J040935J075328J125395J130521
1786.7F37791991P73311N23567J001418J388430J118958Q48353R35376J197040J211703
1805F46790147R68516Q14974R31919J043498R63509R23634R34481P76291N72384O10590
1825.4F55329943O95288Q32319J139879J129389Q96156Q03649O61135L73364M37677
1843.8F62298799R22620J105547R73701Q20816P31051P00295O80089O76751O19054
1862.1F69528723M32849K49386L84151Q47340J015723P63655N52177N61476N78105
$$ y = [607593894, 609248459, 610681653, 611744523, 612902164, 614062607, 614997566, 615759850, 616835296, 618470252, 620019495, 621204257, 622285426, 623312294, 624489546, 625758171, 626711011, 627397358, 628061175, 629174709, 630819678, 632300079, 633419812, 634460747, 635536075, 636661470, 637791991, 638565302, 639088869, 640090287, 641478717, 642597675, 643446028, 644381404, 645578444, 646790147, 647758663, 648573637, 649505556, 650549054, 651512563, 652436197, 653370678, 654146969, 654719353, 655329943, 656025231, 656857550, 657997429, 659126818, 660022974, 660826623, 661487758, 661861122, 662298799, 663221419, 664326966, 665300667, 666121483, 666852534, 667552829, 668232918, 668909669, 669528723, 669961572, 670210958, 670595109, 671442449, 672458172, 673221827, 673774004, 674335480, 674913585]
1880.5F74913585M98235M42982L51966K93076M92096O24477N23150M96149M63546L64661
1900.9F79463923L61919L41952K33770K44438L54171K99931J29819P7128J69337K35081
1921.3F81911469K93016L44634K84851J96576J09374P6831R2983L4809p5340j21296
1941.7F83147907j8954J29163J20938j907m6075o4253j12117p1883n4598j66416k23100
1964.1F82638705j89901j53482j00255j01208j85907k29001k26855k55049k43664k49326
1984.5F80704057l46124l96311l92258l47436k35677k41518l77714l93808l49581m30942
2004.9F77192688m88818m51147m49360m62353m77016n25951n03361m55797m88758m82261
2025.3F72407866m51506n26011n92112n68271n38409n19156n48601o16372n97656n43415
$$ y = [674913585, 675411820, 675854802, 676206768, 676499844, 676991940, 677616417, 678139567, 678635716, 679099262, 679463923, 679825842, 680167794, 680401564, 680646002, 681000173, 681300104, 681429923, 681507051, 681676388, 681911469, 682204485, 682549119, 682833970, 683030546, 683139920, 683216751, 683309734, 683344543, 683269203, 683147907, 683128953, 683258116, 683379054, 683377147, 683331072, 683266819, 683154702, 683082819, 683028221, 682861805, 682638705, 682448804, 682295322, 682195067, 682093859, 681907952, 681678951, 681452096, 681197047, 680953383, 680704057, 680357933, 679961622, 679569364, 679221928, 678986251, 678744733, 678367019, 677973211, 677623630, 677192688, 676703870, 676252723, 675803363, 675341010, 674863994, 674338043, 673834682, 673378885, 672890127, 672407866, 671956360, 671430349, 670838237, 670269966, 669731557, 669212401, 668663800, 668047428, 667449772, 666906357]
2045.7F66906357n83351o14643n91993o35982o51240o04570o56247p11262o61612o53863
2066.1F60541594o93142o82772o89983o79851o37888p08402p92741p85470p96974p81357
2086.5F53293014p28071p57098p61390p08044p47621p85351p39812p56741p97808p77066
2106.9F45734012p82311p63833p05839p53164q07702p51436p32899p33614o67989o94037
2127.3F38341188p70032p44283p29144p24256o53922o71387p28846p01487p08401o95407
2147.7F31214023o29843o67512o88672o24120o44923o29246n40912o02901o70254n96345
2168.1F24919295n80609o13749n80966n96106n96941n34474n70298n93304n17309n12540
2188.4F19222999n55575n43535n44846n35667m91202n26309n67079n05268m96745n61774
$$ y = [666906357, 666323006, 665708363, 665116370, 664480388, 663829148, 663224578, 662568331, 661857069, 661195457, 660541594, 659848452, 659165680, 658475697, 657795846, 657157958, 656449556, 655656815, 654871345, 654074371, 653293014, 652564943, 651807845, 651046455, 650338411, 649590790, 648805439, 648065627, 647308886, 646511078, 645734012, 644951701, 644187868, 643482029, 642728865, 641921163, 641169727, 640436828, 639703214, 639035225, 638341188, 637571156, 636826873, 636097729, 635373473, 634719551, 634048164, 633319318, 632617831, 631909430, 631214023, 630584180, 629916668, 629227996, 628603876, 627958953, 627329707, 626788795, 626185894, 625515640, 624919295, 624338686, 623724937, 623143971, 622547865, 621950924, 621416450, 620846152, 620252848, 619735539, 619222999, 618667424, 618123889, 617579043, 617043376, 616552174, 616025865, 615458786, 614953518, 614456773, 613894999]
2208.8F13894999n61357n38527n05865m69565n35131n91099n18441m91679n31495n15878
2229.2F08635962n18084n02944m39345m90606n67913n02289m45604m52340m27901m49181
2249.6F03839755m82380m13239l90172m37618l77118l20912l48985l27527l43442l99053
2270E99999309l45946l28302l82543l74019l76165l19719j05560N7757J14560J93477
2290.4E98132849K21431K28286L31700L75330L55423M75466O82354Q82029J068116
2308.8F02752984J034319P98702Q33094J245320J714230J935839J709700J358032J388133
2327.1F14770353J564920J345098R10222P83325R11712J052559P83801l77298k278983
2345.5F19465709k617777k88903K890586M884542M732906L559351J981974L52025q76009
$$ y = [613894999, 613333642, 612795115, 612289250, 611819685, 611284554, 610693455, 610175014, 609683335, 609151840, 608635962, 608117878, 607614934, 607175589, 606684983, 606117070, 605614781, 605169177, 604716837, 604288936, 603839755, 603357375, 602944136, 602553964, 602116346, 601739228, 601418316, 601069331, 600741804, 600398362, 599999309, 599653363, 599325061, 598942518, 598568499, 598192334, 597872615, 597767055, 597824812, 597939372, 598132849, 598354280, 598582566, 598914266, 599289596, 599645019, 600120485, 600802839, 601684868, 602752984, 603787303, 604586005, 605419099, 606664419, 608378649, 610314488, 612024188, 613382220, 614770353, 616335273, 617680371, 618590593, 619373918, 620285630, 621338189, 622121990, 621744692, 619465709, 616847932, 616559029, 619449615, 624334157, 629067063, 632626414, 634608388, 634960413, 634084404]
2363.8F34084404j915634k729118k988398l014207k922893k573728k201796j873314
2380.2F13865316j422942r35137m54485L1769L25560M13478M85658M70639L78430M03404
2400.6F13561690M13179L58284M02808M01556L22581L53098L62158K78651K70009K66552
2421F16990566K09511K25424K29955J67012J87815J96218J22190J14321J22905J02699
2441.3F18668616J13606P6592R179L6478N2274N006L040k0563q1003p9215r3698j45555
2465.8F18544757j38461j43349j78516j88649k12967k13325j92881k52366l07739k92003
2486.2F16424501l24249l60191l29495l61442m21882l92377l88623m51266m76241m97699
2506.6F12421036n24342m88937m96507n73754n73993n63264o24060o38962o28889o61194
$$ y = [634084404, 632168770, 629439652, 626451254, 623437047, 620514154, 617940426, 615738630, 613865316, 612442374, 611507237, 611052752, 611084521, 611410081, 611823559, 612309217, 612779856, 613158286, 613561690, 613974869, 614333153, 614735961, 615137517, 615460098, 615813196, 616175354, 616454005, 616724014, 616990566, 617200077, 617425501, 617655456, 617822468, 618010283, 618206501, 618328691, 618443012, 618565917, 618668616, 618782222, 618858814, 618867993, 618904471, 618956745, 618961751, 618964791, 618944228, 618863225, 618784010, 618690312, 618544757, 618406296, 618262947, 618084431, 617895782, 617682815, 617469490, 617276609, 617024243, 616716504, 616424501, 616100252, 615740061, 615410566, 615049124, 614627242, 614234865, 613846242, 613394976, 612918735, 612421036, 611896694, 611407757, 610911250, 610337496, 609763503, 609200239, 608576179, 607937217, 607308328, 606647134]
2527F06647134o52135o33895o77645o98567p03513p31349p23720p23481p55429p53939
2547.4E99593461p74146q29994q08478p80403q30531q32796q05080q55089q82148q58605
2567.8E91336191q68678q60572q55804r15825r38237r07123q81076q64744q94546r26376
2588.2E82423210q84294q67963r23574r19581q75234q96991r28878r17733r03964q88169
2608.6E73416829q77738r10044r25481q91864q77083r01103r37819r63748r44733q99375
2629E64287841q98659r16421q97765q98779r07242q74579q85308r01997q75771r04083
2649.4E55327237r06051q51333q73923r14991q74162q28325q38578q59380q87453q88586
2669.8E46604455q25465q01444q42512q54552q33988q09848p65979p53701p93100q08835
$$ y = [606647134, 605994999, 605361104, 604683459, 603984892, 603281379, 602550030, 601826310, 601102829, 600347400, 599593461, 598819315, 597989321, 597180843, 596400440, 595569909, 594737113, 593932033, 593076944, 592194796, 591336191, 590467513, 589606941, 588751137, 587835312, 586897075, 585989952, 585108876, 584244132, 583349586, 582423210, 581538916, 580670953, 579747379, 578827798, 577952564, 577055573, 576126695, 575208962, 574304998, 573416829, 572539091, 571629047, 570703566, 569811702, 568934619, 568033516, 567095697, 566131949, 565187216, 564287841, 563389182, 562472761, 561574996, 560676217, 559768975, 558894396, 558009088, 557107091, 556231320, 555327237, 554421186, 553569853, 552695930, 551780939, 550906777, 550078452, 549239874, 548380494, 547493041, 546604455, 545778990, 544977546, 544135034, 543280482, 542446494, 541636646, 540870667, 540116966, 539323866, 538515031]
2690.2E38515031q02636p80284p31647p29799p62821p38382p14183p53760p67231p36177
2710.6E30998111p08878o86467o97434p04408o52253o23346o51240o63400o47962n99980
2731E24362743n68092o16729o29783n84602n81980n48303m71711m86195n24462m61697
2751.4E18889189m04716l93212l58581l55065l81470l92079l99292l78549l28004l03984
2771.8E15194237k93672k45750k16067k45750k53439k45273k63452k30253j65999j49309
2792.2E12885273j52052j42753j00732o3240j03534j40428j11819r5307q4639n8770
2812.5E11831999n7519o2048m6313l6299k1756J2458K6583J5915K2888O2287P4565
2835E11822760M8339M8876P3672P2479J2517l7372J6451O2763J0431j3590K146l993
$$ y = [538515031, 537712395, 536932111, 536200464, 535470665, 534707844, 533969462, 533255279, 532501519, 531734288, 530998111, 530289233, 529602766, 528905332, 528200924, 527548671, 526925325, 526274085, 525610685, 524962723, 524362743, 523794651, 523177922, 522548139, 521963537, 521381557, 520833254, 520361543, 519875348, 519350886, 518889189, 518484473, 518091261, 517732680, 517377615, 516996145, 516604066, 516204774, 515826225, 515498221, 515194237, 514900565, 514654815, 514438748, 514192998, 513939559, 513694286, 513430834, 513200581, 513034582, 512885273, 512733221, 512590468, 512489736, 512426496, 512322962, 512182534, 512070715, 511975408, 511890769, 511831999, 511774480, 511712432, 511666119, 511629820, 511608064, 511620522, 511647105, 511663020, 511685908, 511748195, 511822760, 511871099, 511919975, 511993647, 512066126, 512078643, 512041271, 512057722, 512120485, 512130916, 512117326, 512119472, 512115479]
2859.5E12115479J1146R536o6280j46627j62423j32203l4988P6711J20044J90556K56359
2881.9E12237310K38657K44260K42055J88052J70112J56581J02580Q1122J02699J11639
2902.3E13875067J18077J23858J09554J06573J18136J33753J81556J99318J52469J13844
2922.7E15232205M6194o3062j13129j50979k65181l40521l14594k48193r6143J60754
2943.1E13847351M26352O01351O39677N96524N56647M95792L96728L12329K17139J06633
2963.5E18196523K8849o1810k03669l50297m77254n72741o01113n37992m33027l10779
2983.9E14676690j31845L0696J51873L31044N48124O63996O61492O75917P40051P38740
3004.3E19086778O28114N23925M54128L56793L35634L76284L11076K18928J79291J33634
$$ y = [512115479, 512126625, 512136161, 512069881, 511923254, 511760831, 511628628, 511593640, 511670351, 511790395, 511980951, 512237310, 512475967, 512720227, 512962282, 513150334, 513320446, 513477027, 513579607, 513660729, 513763428, 513875067, 513993144, 514117002, 514226556, 514333129, 514451265, 514585018, 514766574, 514965892, 515118361, 515232205, 515278399, 515215337, 515102208, 514951229, 514686048, 514345527, 514030933, 513782740, 513686597, 513847351, 514273703, 514875054, 515514731, 516111255, 516667902, 517163694, 517560422, 517872751, 518089890, 518196523, 518225372, 518163562, 517959893, 517609596, 517132342, 516559601, 515958488, 515420496, 514987469, 514676690, 514544845, 514575541, 514727414, 515058458, 515606582, 516270578, 516932070, 517607987, 518348038, 519086778, 519714892, 520238817, 520692945, 521049738, 521385372, 521761656, 522072732, 522291660, 522470951, 522604585]
3024.7E22604585J12831J20342J11520R2626J11997J18852K9444l2544l576K5034K6286
3047.1E23317397m77l2783m6670l4273J8001K3901n3882j00673j07646q3983R54J5557
3071.6E22915423r8288k00033k10703j46150p8202o0141o7591j03295j44899j42813
3092E21663308j47402k05398k36213j91510j31190j34944k20478k85685k58923k26080
3112.4E19625485k89261l53873k91169j94847j97828k28942k46226k95282l04520k87175
3132.8E16936362l06666l35455l48389l47853l38197l14057l25560l83794l94047l36885
3153.2E13505459l24607l66926l86358l66211l24368l35217l90887m05013l99530l83914
3173.5E09822428l52561l70562m09842m29213m26054l62396l03686l15726l39269l32952
$$ y = [522604585, 522717416, 522837758, 522949278, 523041904, 523153901, 523272753, 523302197, 523269653, 523266077, 523291111, 523317397, 523316920, 523284137, 523237467, 523203194, 523221195, 523245096, 523191214, 523090541, 522982895, 522898912, 522899866, 522915423, 522817135, 522617102, 522406399, 522260249, 522182047, 522121906, 522054315, 521951020, 521806121, 521663308, 521515906, 521310508, 521074295, 520882785, 520751595, 520616651, 520396173, 520110488, 519851565, 519625485, 519336224, 518982351, 518691182, 518496335, 518298507, 518069565, 517823339, 517528057, 517223537, 516936362, 516629696, 516294241, 515945852, 515597999, 515259802, 514945745, 514620185, 514236391, 513842344, 513505459, 513180852, 512813926, 512427568, 512061357, 511736989, 511401772, 511010885, 510605872, 510206342, 509822428, 509469867, 509099305, 508689463, 508260250, 507834196, 507471800, 507168114, 506852388, 506513119, 506180167]
3193.9E06180167l24011l16322k93850k69950k74598k91110l01301l01182k73943k47538
3214.3E03286362k42770k27273j87695j94609k29656k23875k10226j84119j57893j06930
3234.7E01321316j5557m053q5592j49310j35720q1420n2213p0870j07706j38819j47522
3257.2E00332534j09851r8169j29878j08064j15454j83970j56939j09762j04993o9589
3277.6D99145865r0986j49936j05530k3663n5700j39177j32173m6641L3379R3907J09672
3300D98639017K0147r6023n6744J18494K11984K18183K55883K84880K65092K61992
3320.4E00122905K69055K41339L05355M71115N20051M79042N12183N43296N68390O45042
3340.8E04677773P06195P50900P81119P91609Q68618R96590J015902R70125J031756
$$ y = [506180167, 505856156, 505539834, 505245984, 504976034, 504701436, 504410326, 504109025, 503807843, 503533900, 503286362, 503043592, 502816319, 502628624, 502434015, 502204359, 501980484, 501770258, 501586139, 501428246, 501321316, 501305759, 501301706, 501216114, 501066804, 500931084, 500849664, 500797451, 500726581, 500618875, 500480056, 500332534, 500222683, 500124514, 499994636, 499886572, 499771118, 499587148, 499430209, 499320447, 499215454, 499145865, 499054879, 498904943, 498799413, 498775750, 498720050, 498580873, 498448700, 498402059, 498435438, 498529345, 498639017, 498659164, 498563141, 498506397, 498624891, 498836875, 499055058, 499310941, 499595821, 499860913, 500122905, 500391960, 500633299, 500938654, 501409769, 501929820, 502408862, 502921045, 503464341, 504032731, 504677773, 505383968, 506134868, 506915987, 507707596, 508576214, 509572804, 510588706, 511558831, 512590587]
3359.1E12590587J177073J255273J227320J196861J252949J366973J418233J382887
3375.5E22868156J335383J272738J197278J201094J246571J156688R78052J018227
3391.8E32274187J238286J257777J055420R25600J035929J196563J184941J116812
3408.1E41285515J114011J100063J078725J092791J079142J038492J043976J029372
3424.4E49862087R50992R58443R73165Q67962Q01683Q61943R45747R72211Q76009P26700
3444.8E58796942P38919Q34048Q36909P86066P21275O26207O47843Q15809Q32498O60777
3465.2E66297293O30498Q73446J110971J115263R93132Q58903P83026R05216J092255
3483.6E74660003J134932J094938J096069J134098J112521J102209J144886J152456
$$ y = [512590587, 513767660, 515022933, 516250253, 517447114, 518700063, 520067036, 521485269, 522868156, 524203539, 525476277, 526673555, 527874649, 529121220, 530277908, 531255960, 532274187, 533512473, 534770250, 535825670, 536751270, 537787199, 538983762, 540168703, 541285515, 542399526, 543499589, 544578314, 545671105, 546750247, 547788739, 548832715, 549862087, 550813079, 551771522, 552744687, 553612649, 554414332, 555276275, 556222022, 557194233, 558070242, 558796942, 559535861, 560369909, 561206818, 561992884, 562714159, 563340366, 563988209, 564804018, 565636516, 566297293, 566927791, 567801237, 568912208, 570027471, 571020603, 571879506, 572662532, 573567748, 574660003, 575794935, 576889873, 577985942, 579120040, 580232561, 581334770, 582479656, 583632112]
3499.9E83632112J218617J396060J415252J314521J313329J312613J319409J380205
3516.2E94302118J348793J209557J187385J366555J618326J739025J627982J473069
3532.5F05872810J477778J594186J660525J572609J441300J590789J944244K027690
3548.8F19181931J892328J952231K035380J900017J753807J639724J534700J753092
3565.1F33643210K354860K569497K264142K004564J899540J906991J914501J728356
3581.5F50285661J388788J530290K399683K720416K163171K036155K305567K314806
3597.8F67144537K329946K394259K093315J895010K295435K621710K645731K698481
3614.1F86118424K714515L185212L865063L527463K578139K381265L811181M696608
$$ y = [583632112, 584850729, 586246789, 587662041, 588976562, 590289891, 591602504, 592921913, 594302118, 595650911, 596860468, 598047853, 599414408, 601032734, 602771759, 604399741, 605872810, 607350588, 608944774, 610605299, 612177908, 613619208, 615209997, 617154241, 619181931, 621074259, 623026490, 625061870, 626961887, 628715694, 630355418, 631890118, 633643210, 635998070, 638567567, 640831709, 642836273, 644735813, 646642804, 648557305, 650285661, 651674449, 653204739, 655604422, 658324838, 660488009, 662524164, 664829731, 667144537, 669474483, 671868742, 673962057, 675857067, 678152502, 680774212, 683419943, 686118424, 688832939, 692018151, 695883214, 699410677, 701988816, 704370081, 708181262, 712877870]
3630.4G12877870L617167L180623L325641L257156L085375K651035K010525K139866
3646.7G36145258L760815M728973L517627K875149L327787L069282K566934K354443
3663G62346268J714050J261712J996636K253354J466393K390921L102243J883447J080215
3681.4G79495239M95553j01149K25246J298368J520336R18388M62413K70903L67940
3699.8G84953237P12156N40435k47180p25687l26633O52611P36117J57118K0862K07007
3720.1G86680043L69608M68552L80814k69532r71019r44972j30892O33359O1333j109719
3740.5G85167575q94368M57108J79887m02749O74010J063287M8399m09782N8413L35633
3760.9G86277413p4207k72692j41978J63496M10258J25885l46422m44948o7294J26362
$$ y = [712877870, 716495037, 719675660, 723001301, 726258457, 729343832, 731994867, 734005392, 736145258, 739906073, 744635046, 748152673, 751027822, 754355609, 757424891, 759991825, 762346268, 764060318, 765322030, 767318666, 769572020, 771038413, 773429334, 776531577, 778415024, 779495239, 779990792, 779889643, 780114889, 781413257, 782933593, 783851981, 784314394, 784585297, 784953237, 785665393, 786205828, 785958648, 785232961, 784906328, 785558939, 786295056, 786452174, 786473036, 786680043, 787049651, 787518203, 787899017, 787629485, 786658466, 785713494, 785582602, 786215961, 786277294, 785167575, 784273207, 784730315, 784910202, 784507453, 785181463, 786244750, 786293149, 785883367, 785941780, 786277413, 786203206, 785930514, 785788536, 785952032, 786362290, 786488175, 786141753, 785696805, 785629511, 785755873]
3781.3G85755873L4153J35720J11997j15752l42250n33998n16891n74708l69013L60787
3801.7G83945918K11537P3433N71310R2447q02099q33929k77817l91364j27793P97689
3822.1G83259332L71874k22147k58446m14133o19054p53820l65972L93748M93944K68280
3842.5G82153606J49548l72469j292765j496732M34577K039611L86656q40962q49128
3860.9G80311942l75271O974k72930j47223L50594K26438m2021m67360n53965k49565
3881.3G78787613k24590J18434J57237k29239R9659J47581o12498r24646n59271k3842
3901.7G76736438N39661O90937K31683j87814m25577o02067m43041j8776N8055j79827
3922.1G76399672j37985l9398k91169l54648J4067J35362j13010l17872l63290j65761
$$ y = [785755873, 785790026, 785925746, 786037743, 785921991, 785579741, 785045743, 784528852, 783954144, 783585131, 783945918, 784157455, 784230888, 784802198, 784894645, 784092546, 783258617, 782980800, 782589436, 782461643, 783259332, 783631206, 783409059, 783150613, 782736480, 782117426, 781363606, 780997634, 781391382, 781885326, 782153606, 782303154, 781930685, 780637920, 779141188, 779575765, 781615376, 782002032, 781161070, 780311942, 779936671, 779943645, 779670715, 779523492, 779874086, 780100524, 780058503, 779591143, 779037178, 778787613, 778563023, 778681457, 778838694, 778609455, 778709114, 778856695, 778244197, 777319551, 776760280, 776736438, 777276099, 777967036, 778198719, 778010905, 777585328, 776983261, 776540220, 776521444, 776579499, 776399672, 776261687, 776222289, 775931120, 775576472, 775590539, 775725901, 775612891, 775295019, 774931729, 774765968]
3942.5G74765968n2392j78158j03295L8027p0750k27154k74896k36690r7037j2993
3962.9G73550630j14441k19822k38061j91987j00970p0751j06632j31309j51396j72258
3983.3G72053003j99377k33054k34723j87576p3135k1339j25527
3997.5G70978272
$$ y = [774765968, 774713576, 774535418, 774432123, 774470150, 774399400, 774172246, 773897350, 773660660, 773563623, 773550630, 773436189, 773216367, 772978306, 772786319, 772685349, 772614598, 772507966, 772376657, 772225261, 772053003, 771853626, 771620572, 771385849, 771198273, 771125138, 771103799, 770978272]
##END=$$ End of the data block
