##TITLE=$$ Begin of the data block
##JCAMP-DX=5.00 $$ ACD/SpecManager v 10.08
##SPECTROMETER/DATA SYSTEM=Alpha
##DATE=22 Dec 2014 10:36:42
##DATA TYPE=INFRARED SPECTRUM
##DATA CLASS=XYDATA
##ORIGIN=
##OWNER=
##NPOINTS=1765
##FIRSTX=399.76428223
##LASTX=3997.64306641
##MAXX=3997.64306641
##MINX=399.76428223
##MAXY=0.86159950
##MINY=0.37184852
##XFACTOR=1.0000000000
##YFACTOR=1.000000000000000e-9
##FIRSTY=0.62311614
##DELTAX=2.03961372
##XUNITS=1/CM
##YUNITS=ARBITRARY UNITS
##XYDATA=(X++(Y..Y))
$$ plain form
399.8 623116136 621967435 619280159 615588188 614955664 618156075 620817900 620351493 619554937 621060610
418.1 621060610 622043669 619331419 615922749 614688635 614296973 611836612 607846677 605746329 606246650
436.5 606246650 606555641 606309295 608706772 614529014 619594812 620969474 621079743 623244762 625929832
454.8 625929832 625395477 622253418 620832920 620989144 619080365 614575148 611101866 610277295 608990133
473.2 608990133 605229557 601898611 601797819 602920175 601816475 599675953 599972606 601932645 601853549
491.5 601853549 599126697 597116053 597427011 597147048 593774676 589836836 588558972 588128924 585009813
509.9 585009813 579985499 576579034 574916244 571791708 566705227 562973082 562327862 562598348 561348915
528.3 561348915 560172260 561898768 565785646 568899632 571286738 575605571 581590593 585467756
$$ packed form
399.8F23116136j148701k687276l691971o32524L200411K661825m66407p96556J505673
418.1F21060610R83059k712250l408670j234114l91662k460361l989935k100348N00321
436.5F06246650L08991k46346K397477N822242N065798J374662J10269K165019K685070
454.8F25929832n34355l142059j420498J56224j908779m505217l473282q24571j287162
473.2F08990133l760576l330946j00792J122356j103700k140522K96653J960039p9096
491.5F01853549k726852k010644L10958k79963l372372l937840j277864m30048l119111
509.9E85009813n024314l406465j662790l124536n086481l732145o45220K70486j249433
528.3E61348915j176655J726508L886878L113986K387106M318833N985022L877163
$$ plain form
544.6 585467756 585581660 584593475 584861755 584914744 582296431 577931225 574728966 572584510 568590343
562.9 568590343 562034905 555513799 550897837 547244310 543661296 541801989 543794155 548734367
579.3 548734367 553889811 558646500 564521909 571439505 576625049 578508317 579122603 580758214 582315803
597.6 582315803 581780136 580210030 580188394 581761718 582595885 582101882 582539916 585193932 588355422
616 588355422 590177059 591876864 595664263 600668192 604162514 605836809 607954144 611518741 614512622
634.3 614512622 615250528 615486443 617471993 620057285 620843112 620464146 621573806 624312937 625986814
652.7 625986814 625621259 625555336 627575755 629903615 630258799 629883051 631715119 635266542 635993361
671 635993361 635283470 635963321 638701200 641207635 641616762 641477942 643006742 645299971 645740926
$$ packed form
544.6E85467756J13904r88185K68280N2989k618313m365206l202259k144456l994167
562.9E68590343o555438o521106m615962l653527l583014j859307J992166M940212
579.3E48734367N155444M756689N875409O917596N185544J883268O14286J635611J557589
597.6E82315803n35667j570106k1636J573324Q34167m94003M38034K654016L161490
616E88355422J821637J699805L787399N003929L494322J674295K117335L564597K993881
634.3F14512622P37906K35915J985550K585292P85827l78966J109660K739131J673877
652.7F25986814l65555o5923K020419K327860L55184l75748J832068L551423P26819
671F35993361p09891O79851K737879K506435M09127j38820J528800K293229M40955
$$ plain form
689.4 645740926 644200742 643103898 643216610 642286539 638992488 635375500 633694112 633109391 631753504
707.7 631753504 630436659 631532133 635112166 638773620 641453207 644982755 650692761 656790733
724.1 656790733 661106288 664330363 668627739 673723638 677114367 678215027 679276884 681528926
740.4 681528926 682941914 681577742 678791285 676813126 675039530 671322227 665937722 661505461
756.7 661505461 659021497 656766653 653791368 652002037 653414607 657195628 661272824 665634215
773 665634215 672040164 680483162 688211381 693530858 698114693 703726649 709032476 712028921 713700712
791.4 713700712 716652453 721078336 724767506 726953924 729561627 733704627 737457693 738962710
807.7 738962710 739466190 741184413 743576169 744345069 743401289 743010581 743893981 743862510 741378844
$$ packed form
689.4F45740926j540184j096844J12712r30071l294051l616988j681388n84721j355887
707.7F31753504j316845J095474L580033L661454K679587L529548N710006O097972
724.1F56790733M315555L224075M297376N095899L390729J100660J061857K252042
740.4F81528926J412988j364172k786457j978159j773596l717303n384505m432261
756.7F61505461k483964k254844k975285j789331J412570L781021M077196M361391
773F65634215O405949Q442998P728219N319477M583835N611956N305827K996445J671791
791.4G13700712K951741M425883L689170K186418K607703M143000L753066J505017
807.7G38962710N03480J718223K391756P68900r43780l90708Q83400l1471k483666
$$ plain form
826 741378844 737898290 735197604 732488990 728035212 722409964 717889369 714928150 711763024 707558274
844.4 707558274 703750610 701540649 699662030 696240246 691671133 687829077 685451925 684248805
860.7 684248805 685012400 689467490 697778225 707730830 716838300 724582911 731630623 737234533 739476323
879.1 739476323 738111734 735115588 731892169 727696776 721819699 715597093 710779369 707070351
895.4 707070351 702848434 697824121 693228185 689314723 684561551 677903593 670215130 662724674
911.7 662724674 655107200 646472931 637542546 630325913 625783443 622958899 620770156 619594932
928 619594932 620206177 622056127 623969615 626044750 629329503 633804679 637821555 639646649 638770759
946.4 638770759 635171473 628298163 617938578 605297565 591994047 578325033 563489795 547346950
$$ packed form
826G41378844l480554k700686k708614m453778n625248m520595k961219l165126m204750
844.4G07558274l807664k209961j878619l421784m569113l842056k377152j203120
860.7F84248805P63595M455090Q310735R952605R107470P744611P047712N603910K241790
879.1G39476323j364589k996146l223419m195393n877077o222606m817724l709018
895.4G07070351m221917n024313m595936l913462m753172o657958p688463p490456
911.7F62724674p617474q634269q930385p216633m542470k824544k188743j175224
928F19594932O11245J849950J913488K075135L284753M475176M016876J825094q75890
946.4F38770759l599286o873310j0359585j2641013j3303518j3669014j4835238j6142845
$$ plain form
962.7 547346950 530793130 514301479 497337610 479508460 461429358 444141448 428067356
977 428067356 413170964 399980724 389469892 381990463 376999199 373761594 372028410 371848524
993.3 371848524 372852147 374208093 375448376 376752317 378215969 379303873 379461855 378945619 378461748
1011.6 378461748 378319800 378420383 378904492 380235732 382604092 385606050 388772577 392116249 395843148
1030 395843148 399709165 402961880 405177146 406698912 407986611 408992827 409631461 410406232 412017971
1048.4 412017971 414720178 418389320 423065484 429087698 436556786 445033878 454099119 463420540
1064.7 463420540 471467704 474940449 471284717 461995035 451834053 444546610 440736979 439559877
1081 439559877 440525502 443437546 447661966 452386081 457415998 462962568 468672007 473429620 476431936
$$ packed form
962.7E47346950j6553820j6491651j6963869j7829150j8079102j7287910j6074092
977D28067356j4896392j3190240j0510832p479429m991264l237605j733184j79886
993.3C71848524J003623J355946J240283J303941J463652J087904J57982n16236m83871
1011.6C78461748j41948J00583M84109J331240K368360L001958L166527L343672L726899
1030C95843148L866017L252715K215266J521766J287699J006216O38634P74771J611739
1048.4D12017971K702207L669142M676164O022214P469088Q477092R065241R321421
1064.7D63420540Q047164L472745l655732r289682j0160982p287443l809631j177102
1081D39559877R65625K912044M224420M724115N029917N546570N709439M757613L002316
$$ plain form
1099.4 476431936 478011519 479092449 480241716 481711686 483943701 487309963 491428792 495294690
1115.7 495294690 498260111 500569820 502704680 504647553 506442785 508862615 512659490 517283320
1132 517283320 520993948 522358119 521079421 517457902 511747897 504440486 496684492 489738256 484085947
1150.3 484085947 479517341 475967854 473865807 473482817 474445581 476444095 479881465 485329390 492717087
1168.7 492717087 501417696 511023641 521657944 533273458 545170367 556623995 567601860 578402936
1185 578402936 588642359 597319841 604023516 609242797 613420606 616434097 618258834 619628131
1201.3 619628131 621421576 623715222 626091421 628670931 632139623 636617482 641217768 645102620
1217.7 645102620 648303807 651073575 653027415 653566301 652927279 652021766 651210308 650082707 648486674
$$ packed form
1099.4D76431936J579583J080930J149267J469970K232015L366262M118829L865898
1115.7D95294690K965421K309709K134860J942873J795232K419830L796875M623830
1132E17283320L710628J364171j278698l621519n710005p307411p755994o946236n652309
1150.3D84085947m568606l549487k102047l82990R62764J998514L437370N447925P387697
1168.7D92717087Q700609R605945J0634303J1615514J1896909J1453628J0977865J0801076
1185E78402936J0239423Q677482O703675N219281M177809L013491J824737J369297
1201.3F19628131J793445K293646K376199K579510L468692M477859M600286L884852
1217.7F45102620L201187K769768J953840N38886o39022r05513q11458j127601j596033
$$ plain form
1236 648486674 647000909 646171331 645846665 645660341 645826995 646889567 648763597 650665164 652118206
1254.4 652118206 653422415 654893458 656218946 656961083 657513261 658793628 660886347 662886262 664173245
1272.7 664173245 665046811 665871561 666277349 665821254 664933085 664379954 664129257 663496614 662296414
1291.1 662296414 661057591 660051107 658827543 657023966 655096054 653664887 652551115 651124597
1307.4 651124597 649426401 648128510 647424400 646717012 645529568 644108951 642722189 640845239 637713432
1325.8 637713432 633429587 628911555 624794960 621039212 617649078 615122676 613926589 613754928
1342.1 613754928 613835871 613875628 614057302 614308298 614150524 613384068 612429559 611673474 610891998 609684348
1362.5 609684348 608419240 607748210 607596040 607571781 607550561 607864201 608694077 609561920 609998405 610533297
$$ packed form
1236F48486674j485765q29578l24666j86324J66654J062572J874030J901567J453042
1254.4F52118206J304209J471043J325488P42137N52178J280367K092719J999915J286983
1272.7F64173245Q73566Q24750M05788m56095q88169n53131k50697o32643j200200
1291.1F62296414j238823j006484j223564j803577j927912j431167j113772j426518
1307.4F51124597j698196j297891p04110p07388j187444j420617j386762j876950l131807
1325.8F37713432m283845m518032m116595l755748l390134k526402j196087j71661
1342.1F13754928Q0943L9757J81674K50996j57774p66456r54509p56085p81476j207650
1362.5F09684348j265108o71030j52170k4259k1220L13640Q29876Q67843M36485N34892
$$ plain form
1382.9 610533297 612393320 615951121 619750500 622397244 624103963 625195146 625458300 624707818 623539507
1401.2 623539507 622519672 621432126 620006561 618258059 616528928 615225077 614236295 613098800
1417.5 613098800 611976385 611734688 612181902 612690866 613173604 613985360 615345776 616857409 618189454
1435.9 618189454 619561970 621208549 622946024 624250352 624858677 624961197 624791265 624273419 623236835
1454.3 623236835 621283174 619266331 618934631 619504392 620684087 623108566 626807332 631773293 638650596
1472.6 638650596 646304965 653466702 660154462 666278899 671893477 677090108 682226479 687347949
1488.9 687347949 691958904 695716023 699286580 703092456 706450462 709182799 711668730 714265943
1505.2 714265943 717059255 719294846 721188128 723221064 725276649 727092028 728529274 729930699
$$ packed form
1382.9F10533297J860023L557801L799379K646744J706719J091183K63154p50482j168311
1401.2F23539507j019835j087546j425565j748502j729131j303851r88782j137495
1417.5F13098800j122415k41697M47214N08964M82738Q11756J360416J511633J332045
1435.9F18189454J372516J646579J737475J304328O08325J02520j69932n17846j036584
1454.3F23236835j953661k016843l31700N69761J179695K424479L698766M965961O877303
1472.6F38650596P654369P161737O687760O124437N614578N196631N136371N121470
1488.9F87347949M610955L757119L570557L805876L358006K732337K485931K597213
1505.2G14265943K793312K235591J893282K032936K055585J815379J437246J401425
$$ plain form
1521.6 729930699 731535912 732958317 734013855 734967828 736043453 737086773 737959862 738531530 738644600
1539.9 738644600 738740265 739006400 739094973 739093363 739157498 739215136 739037097 738598466 737532198 736365259
1560.3 736365259 736144900 735781074 735158384 734541595 733831108 733211100 732335448 730949879 729993999
1578.7 729993999 729295373 728144348 726754129 725451291 724076986 722280562 720137715 718030572
1595 718030572 716057062 713834763 711090386 708138883 705315769 702397227 698964715 695286751 691902041
1613.4 691902041 688247502 683886588 680521905 677878201 674871504 671974897 669158638 666425884
1629.7 666425884 664615750 663456678 662037492 660959125 660828888 661390543 662383795 663558185 665084124
1648 665084124 666949034 669379056 672734439 675686419 678485990 681810677 685712159 689561784 692903161
$$ packed form
1521.6G29930699J605213J422405J055538R53973J075625J043320Q73089N71668J13070
1539.9G38644600R5665K66135Q8573j610O4135N7638j78039m38631j066268j166939
1560.3G36365259k20359l63826o22690o16789p10487o20008q75652j385569r55880
1578.7G29993999o98626j151025j390219j302838j374305j796424k142847k107143
1595G18030572j973510k222299k744377k951503k823114k918542l432512l677964l384710
1613.4F91902041l654539m360914l364683k643704l006697k896607k816259k732754
1629.7F66425884j810134j159072j419186j078367j30237N61655R93252J174390J525939
1648F65084124J864910K430022L355383K951980K799571L324687L901482L849625L341377
$$ plain form
1666.4 692903161 696565092 700977683 705036342 708801866 712823212 716866195 720736206 724446237
1682.7 724446237 728571177 732659936 736400247 739984453 742970169 745730400 748603702 751174331
1699 751174331 753489077 755499363 757369637 759348392 761099577 762519896 763945460 765606880 767377615
1717.4 767377615 768978655 770514309 772252321 774232090 776049554 777560830 778982401 780632794
1733.7 780632794 782466412 783959687 785263836 786869824 788772583 790551841 792058647 793641031
1750 793641031 795642376 797588170 799087286 800411999 801891685 803482950 804873109 805940211 806930125
1768.4 806930125 807989478 808890462 809618354 810404778 811357081 812375069 813160956 813672006 814325988
1786.7 814325988 815267384 816020250 816394150 816887319 817698359 818516970 819069922 819504797 820126534 820930839
$$ packed form
1666.4F92903161L661931M412591M058659L765524M021346M042983L870011L710031
1682.7G24446237M124940M088759L740311L584206K985716K760231K873302K570629
1699G51174331K314746K010286J870274J978755J751185J420319J425564J661420J770735
1717.4G67377615J601040J535654J738012J979769J817464J511276J421571J650393
1733.7G80632794J833618J493275J304149J605988J902759J779258J506806J582384
1750G93641031K001345J945794J499116J324713J479686J591265J390159J067102R89914
1768.4H06930125J059353R00984P27892P86424R52303J017988P85887N11050O53982
1786.7H14325988R41396P52866L73900M93169Q11040Q18611N52952M34875O21737Q04305
$$ plain form
1807.1 820930839 821612179 821991622 822339296 822922170 823590398 824109674 824482679 824868917 825409830 825934112
1827.5 825934112 826113522 826262295 826794744 827383101 827714920 827927411 828164518 828335702 828477025 828626573
1847.9 828626573 828802824 829127669 829473615 829633057 829654217 829797029 830136180 830446184 830499887 830373883
1868.3 830373883 830501378 830896795 831156433 831253529 831458449 831803441 832095921 832268059 832448363 832670450
1888.7 832670450 832916081 833146155 833256841 833367646 833593428 833792627 833853662 833882391 833995998 834127247
1909.1 834127247 834197700 834261954 834354758 834420562 834488332 834555149 834608495 834769249 834974885 835068405 835081756
1931.5 835081756 835122526 835224152 835345268 835420668 835426748 835478246 835634232 835766017 835848749 835981250 836171448
1954 836171448 836319029 836379290 836433947 836563051 836728930 836850822 836922526 836988509 837091744 837204814 837274551
$$ packed form
1807.1H20930839O81340L79443L47674N82874O68228N19276L73005L86238N40913N24282
1827.5H25934112J79410J48773N32449N88357L31819K12491K37107J71184J41323J49548
1847.9H28626573J76251L24845L45946J59442K1160J42812L39151L10004N3703j26004
1868.3H30373883J27495L95417K59638R7096K04920L44992K92480J72138J80304K22087
1888.7H32670450K45631K30074J10686J10805K25782J99199O1035K8729J13607J31249
1909.1H34127247P0453O4254R2804O5804O7770O6817N3346J60754K05636R3520J3351
1931.5H35081756M0770J01626J21116P5400O080N1498J55986J31785Q2732J32501J90198
1954H36171448J47581O0261N4657J29104J65879J21892P1704O5983J03235J13070O9737
$$ plain form
1976.4 837274551 837318122 837380826 837485671 837582648 837604046 837575436 837569237 837590694 837618589 837612092 837570310 837570369
2000.9 837570369 837590277 837526739 837383091 837256730 837151706 836979032 836680710 836317897 835982382 835590959
2021.3 835590959 834957600 834295273 834164560 834424734 834457755 834206462 833948135 833790600 833643019 833397090
2041.7 833397090 833093524 832862556 832747757 832670748 832539499 832413137 832402527 832435071 832399786 832352817
2062.1 832352817 832402706 832537174 832651734 832669318 832669854 832780302 832921863 832931757 832874596 832947075 833131373
2084.5 833131373 833248496 833254576 833305240 833512843 833731353 833797812 833838880 834017575 834245622 834366739
2104.9 834366739 834395528 834481835 834671855 834838331 834880769 834881783 834958136 835084081 835155368 835150242 835170805
2127.3 835170805 835267663 835353374 835339904 835310817 835391164 835506439 835518718 835478067 835525513 835650384 835739493
$$ packed form
1976.4H37274551M3571O2704J04845R6977K1398k8610o199K1457K7895o497m1782N9
2000.9H37570369J9908o3538j43648j26361j05024j72674k98322l62813l35515l91423
2021.3H35590959o33359o62327j30713K60174L3021k51293k58327j57535j47581k45929
2041.7H33397090l03566k30968j14799p7009j31249j26362j0610L2544l5285m6969
2062.1H32352817M9889J34468J14560J7584N36J10448J41561R894n7161P2479J84298
2084.5H33131373J17123O080N0664K07603K18510O6459M1068J78695K28047J21117
2104.9H34366739K8789Q6307J90020J66476M2438J014P6353J25945P1287n126K0563
2127.3H35170805R6858Q5711j3470k9087Q0347J15275J2279m0651M7446J24871Q9109
$$ plain form
2149.8 835739493 835779250 835860193 836025059 836217403 836375475 836531579 836764932 837042570 837278843 837525606
2170.2 837525606 837884784 838318110 838710010 839012980 839294553 839638352 840036809 840419769 840741038 841037869
2190.6 841037869 841350496 841639280 841882527 842130721 842420518 842739820 843041301 843313158 843623579 843982697
2211 843982697 844315827 844608903 844897747 845183015 845430493 845633566 845834851 846052885 846279323 846506357
2231.4 846506357 846714616 846917093 847128272 847336054 847537935 847709179 847845495 847987711 848140061 848301291
2251.8 848301291 848475277 848646343 848826528 849018514 849193573 849338591 849479318 849652290 849844158 850012958
2272.2 850012958 850156844 850298285 850447237 850586712 850722790 850916088 851161361 851416707 851668298 851887524
2292.5 851887524 852100968 852367878 852671385 852933407 853166044 853506029 853980780 854470789 854906082 855295599
$$ packed form
2149.8H35739493L9757Q0943J64866J92344J58072J56104K33353K77638K36273K46763
2170.2H37525606L59178M33326L91900L02970K81573L43799L98457L82960L21269K96831
2190.6H41037869L12627K88784K43247K48194K89797L19302L01481K71857L10421L59118
2211H43982697L33130K93076K88844K85268K47478K03073K01285K18034K26438K27034
2231.4H46506357K08259K02477K11179K07782K01881J71244J36316J42216J52350J61230
2251.8H48301291J73986J71066J80185J91986J75059J45018J40727J72972J91868J68800
2272.2H50012958J43886J41441J48952J39475J36078J93298K45273K55346K51591K19226
2292.5H51887524K13444K66910L03507K62022K32637L39985M74751M90009M35293L89517
$$ plain form
2312.9 855295599 855713606 856276512 856983662 857603908 857972205 858324885 858816683 859243989 859449923 859490275
2333.3 859490275 859475672 859436333 859387636 859289229 858829141 857756495 856928289 857233047 858490944 859919310
2353.7 859919310 860903502 861433029 861599505 861353219 860584140 859415114 858153284 856916428 855641663
2372.1 855641663 854339540 853140652 852082849 851152122 850393474 849839568 849469483 849229038 849056542
2390.4 849056542 848913193 848782778 848637760 848472238 848291159 848099351 847915649 847728431 847511232 847269773
2410.8 847269773 847028375 846781731 846495986 846176326 845860660 845529139 845166981 844825923 844499409 844117641
2431.2 844117641 843698323 843308091 842928886 842546463 842174113 841780126 841374218 840983570 840567112 840116203
2451.6 840116203 839702129 839365900 839050591 838678539 838277578 837926269 837605536 837232590 836814761 836439610
$$ packed form
2312.9H55295599M18007N62906P07150O20246L68297L52680M91798M27306K05934M0352
2333.3H59490275j4603l9339m8697r8407m60088j072646q28206L04758J257897J428366
2353.7H59919310R84192N29527J66476k46286p69079j169026j261830j236856j274765
2372.1H55641663j302123j198888j057803r30727p58648n53906l70085k40445j72496
2390.4H49056542j43349j30415j45018j65522j81079j91808j83702j87218k17199k41459
2410.8H47269773k41398k46644k85745l19660l15666l31521l62158l41058l26514l81768
2431.2H44117641m19318l90232l79205l82423l72350l93987m05908l90648m16458m50909
2451.6H40116203m14074l36229l15309l72052m00961l51309l20733l72946m17829l75151
$$ plain form
2472 836439610 836131096 835831583 835498095 835151672 834834695 834548712 834243596 833897948 833584547 833360612
2492.4 833360612 833159268 832894206 832619846 832450926 832336664 832113802 831789613 831562042 831489921 831376016
2512.8 831376016 831077099 830716550 830497921 830352366 830040395 829594612 829238117 828997016 828687370 828210533
2533.2 828210533 827707171 827333033 826987863 826480389 825888038 825456202 825177431 824796319 824237108 823724568
2553.6 823724568 823410451 823120892 822623551 822005987 821548402 821273386 820920408 820395827 819899201 819558322
2574 819558322 819229484 818731189 818181455 817831933 817624986 817298234 816836655 816473782 816284895 816058993
2594.4 816058993 815648019 815224111 814993322 814858913 814567924 814071298 813585877 813255727 812879801 812226713
2614.8 812226713 811491251 810983002 810584664 809976518 809147239 808356106 807711661 807003617 806053996 805064857
$$ packed form
2472H36439610l08514k99513l33488l46423l16977k85983l05116l45648l13401k23935
2492.4H33360612k01344k65062k74360j68920j14262k22862l24189k27571p2121j13905
2512.8H31376016k98917l60549k18629j45555l11971m45783l56495k41101l09646m76837
2533.2H28210533n03362l74138l45170n07474n92351m31836k78771l81112n59211n12540
2553.6H23724568l14117k89559m97341o17564m57585k75016l52978n24581m96626l40879
2574H19558322l28838m98295n49734l49522k06947l26752m61579l62873j88887k25902
2594.4H16058993m10974m23908k30789j34409k90989m96626m85421l30150l75926o53088
2614.8H12226713p35462n08249l98338o08146q29279p91133o44445p08044r49621r89139
$$ plain form
2635.2 805064857 804334819 803742647 802907109 801843584 800931156 800255060 799502373 798502147 797486782
2653.5 797486782 796714067 796083391 795326114 794408202 793569088 792941093 792280734 791397512 790544689 789947033
2673.9 789947033 789433718 788761556 787957251 787270010 786766589 786174774 785351336 784554362 784008682 783513963
2694.3 783513963 782755435 781807363 780997753 780377030 779658318 778687418 777701378 776963294 776337922 775546670
2714.7 775546670 774626851 773847342 773283005 772643626 771741927 770898461 770412624 770035923 769388378 768587589
2735.1 768587589 768019855 767646968 767100513 766328275 765668988 765305340 764970303 764359832 763642609 763168573
2755.5 763168573 762876391 762456059 761830449 761278689 760997951 760712266 760133445 759439588 758946180 758571625
2775.9 758571625 757963419 757093906 756304204 755730629 755106628 754206181 753165364 752245188 751415133
$$ packed form
2635.2H05064857p30038n92172q35538j063525r12428o76096p52687j000226j015365
2653.5G97486782p72715o30676p57277r17912q39114o27995o60359q83222q52823n97656
2673.9G89947033n13315o72162q04305o87241n03421n91815q23438p96974n45680m94719
2694.3G83513963p58528r48072q09610o20723p18712r70900r86040p38084o25372p91252
2714.7G75546670r19819p79509n64337o39379r01699q43466m85837l76701o47545q00789
2735.1G68587589n67734l72887n46455p72238o59287l63648l35037o10471p17223m74036
2755.5G63168573k92182m20332o25610n51760k80738k85685n78821o93857m93408l74555
2775.9G58571625o08206q69513p89702n73575o24001r00447j040817r20176q30055
$$ plain form
2794.3 751415133 750389338 749119103 747883439 746806443 745642424 744191945 742662430 741289973
2810.6 741289973 739932060 738351822 736595273 734921634 733411074 731809497 729917526 727900088
2826.9 727900088 725982130 724083126 721990228 719700217 717425168 715197206 712716818 709822237
2843.2 709822237 706743777 703729153 700751126 697770894 694997847 692667246 690697610 688672245
2859.5 688672245 686216593 683333516 680171072 676658094 672695816 668469369 664225578 660003781
2875.9 660003781 655822098 651855290 648379803 645583093 643361568 641530812 640125215 639241993
2892.2 639241993 638759792 638311386 637626112 636830389 636091530 635240614 634019732 632434785 630638301
2910.5 630638301 628566921 625968218 622840285 619560540 616459548 613640308 611194849 609344840
$$ packed form
2794.3G51415133j025795j270235j235664j076996j164019j450479j529515j372457
2810.6G41289973j357913j580238j756549j673639j510560j601577j891971k017438
2826.9G27900088j917958j899004k092898k290011k275049k227962k480388k894581
2843.2G09822237l078460l014624k978027k980232k773047k330601j969636k025365
2859.5F88672245k455652k883077l162444l512978l962278m226447m243791m221797
2875.9F60003781m181683l966808l475487k796710k221525j830756j405597q83222
2892.2F39241993m82201m48406o85274p95723p38859q50916j220882j584947j796484
2910.5F30638301k071380k598703l127933l279745l100992k819240k445459j850009
$$ plain form
2926.8 609344840 608325660 608164012 608799160 610275805 612680376 615997314 619979262 624254763 628632247
2945.2 628632247 633130789 637784481 642482638 647020996 651447594 655983806 660525501 664763212
2961.5 664763212 668642581 672330558 675890088 679174066 682143211 685033143 688025594 691072464
2977.8 691072464 693952620 696495533 698831916 701107264 703179777 704919100 706411600 707743764
2994.2 707743764 708868265 709615111 709965765 710209966 710422993 710363805 710004926 709545314 709006548 708161533
3014.5 708161533 706907392 705446362 704001129 702587664 701033175 699234247 697387457 695666492
3030.9 695666492 693939805 691964626 689779580 687760830 685950160 683955550 681635559 679240704
3047.2 679240704 677012563 674846709 672525167 670120835 667770565 665447831 663111389 660779238
$$ packed form
2926.8F09344840j019180j61648O35148J476645K404571L316938L981948M275501M377484
2945.2F28632247M498542M653692M698157M538358M426598M536212M541695M237711
2961.5F64763212L879369L687977L559530L283978K969145K889932K992451L046870
2977.8F91072464K880156K542913K336383K275348K072513J739323J492500J332164
2994.2G07743764J124501P46846L50654K44201K13027n9188l58879m59612n38766q45015
3014.5G08161533j254141j461030j445233j413465j554489j798928j846790j720965
3030.9F95666492j726687j975179k185046k018750j810670j994610k319991k394855
3047.2F79240704k228141k165854k321542k404332k350270k322734k336442k332151
$$ plain form
3063.5 660779238 658523858 656295240 653914213 651385546 648942173 646797419 644821227 642622054
3079.8 642622054 640139520 637669265 635281146 632881165 630438864 627890825 625358105 623058617
3096.1 623058617 620909154 618639290 616192579 613789976 611547649 609290123 606905401 604653835
3112.4 604653835 602686584 600698471 598465562 596052229 593560874 591097236 588742852 586527646
3128.8 586527646 584383547 582200348 580016613 577933967 575908303 573783696 571546793 569312096
3145.1 569312096 567161500 565238833 563513875 561584234 559306502 557038486 554972053 552974641
3161.4 552974641 550931692 548896372 546987236 545187891 543375432 541508019 539676845 537901759
3177.7 537901759 536084712 534202516 532350242 530620873 529003203 527356505 525586843 523821533
$$ packed form
3063.5F60779238k255380k228618k381027k528667k443373k144754j976192k199173
3079.8F42622054k482534k470255k388119k399981k442301k548039k532720k299488
3096.1F23058617k149463k269864k446711k402603k242327k257526k384722k251566
3112.4F04653835j967251j988113k232909k413333k491355k463638k354384k215206
3128.8E86527646k144099k183199k183735k082646k025664k124607k236903k234697
3145.1E69312096k150596j922667j724958j929641k277732k268016k066433j997412
3161.4E52974641k042949k035320j909136j799345j812459j867413j831174j775086
3177.7E37901759j817047j882196j852274j729369j617670j646698j769662j765310
$$ plain form
3194 523821533 522150934 520479202 518780470 517166734 515707731 514296293 512764573 511161864 509645700
3212.4 509645700 508213222 506788492 505337715 503878295 502487004 501183152 499877751 498551726
3228.7 498551726 497348398 496265024 494959414 493387491 491955012 490791142 489703327 488601595
3245 488601595 487497747 486355245 485230446 484209716 483212054 482146800 481085509 480130315 479231089
3263.4 479231089 478341639 477611452 477091789 476425260 475408167 474313706 473341376 472437680 471515119
3281.7 471515119 470595181 469752759 468997389 468312711 467625797 466818601 465853930 464757204 463644683
3300.1 463644683 462755054 462132245 461424112 460322917 458921731 457502306 456235439 455053926 453869313
3318.4 453869313 452727228 451649338 450573921 449333757 447886854 446466774 445198864 444025517
$$ packed form
3194E23821533j670599j671732j698732j613736j459003j411438j531720j602709j516164
3212.4E09645700j432478j424730j450777j459420j391291j303852j305401j326025
3228.7D98551726j203328j083374j305610j571923j432479j163870j087815j101732
3245D88601595j103848j142502j124799j020730r97662j065254j061291r55194q99226
3263.4D79231089q89450p30187n19663o66529j017093j094461r72330r03696r22561
3281.7D71515119r19938q42422p55370o84678o86914q07196r64671j096726j112521
3300.1D63644683q89629o22809p08133j101195j401186j419425j266867j181513j184613
3318.4D53869313j142085j077890j075417j240164j446903j420080j267910j173347
$$ plain form
3334.8 444025517 442898870 441697538 440327793 438834637 437238485 435673058 434346974 433045566
3351.1 433045566 431434125 429673463 428109944 426746964 425299853 423743576 422401071 421274722
3367.4 421274722 419936657 418192357 416390836 414888054 413621366 412389725 411060721 409730047
3383.7 409730047 408653945 407935023 407455772 406838566 405823946 404748529 404098094 403737962 403034389
3402.1 403034389 401890308 400913060 400316864 399829060 399314225 398697048 398010880 397457242 397045016
3420.4 397045016 396715283 396562994 396608621 396735966 396815628 396957636 397255272 397364557 397112608 396942556
3440.8 396942556 397165954 397621989 398110330 398544282 399007380 399569660 400199890 400990427 401953995 402828962
3461.2 402828962 403659999 404772133 406019330 406936198 407424897 407897532 408716083 409907907 411109984
$$ packed form
3334.8D44025517j126647j201332j369745j493156j596152j565427j326084j301408
3351.1D33045566j611441j760662j563519j362980j447111j556277j342505j126349
3367.4D21274722j338065j744300j801521j502782j266688j231641j329004j330674
3383.7D09730047j076102p18922m79251o17206j014620j075417o50435l60132p03573
3402.1D03034389j144081r77248n96196m87804n14835o17177o86168n53638m12226
3420.4C97045016l29733j52289M5627J27345P9662J42008K97636J09285k51949j70052
3440.8C96942556K23398M56035M88341M33952M63098N62280O30230P90537R63568Q74967
3461.2D02828962Q31037J112134J247197R16868M88699M72635Q18551J191824J202077
$$ plain form
3479.6 411109984 411961645 412745833 413774610 414819866 415763795 416811287 418023139 419311613 420530230
3497.9 420530230 421658844 422767311 423752815 424646199 425651044 426878154 428368032 429834247 430978894
3516.3 430978894 432031810 433342814 434944898 436422318 437509835 438550949 439892322 441519111
3532.6 441519111 443251550 444824725 446219772 447828531 449703425 451430917 452775240 454090208
3548.9 454090208 455670208 457422972 459294230 461267829 463338554 465472162 467453361 469199926
3565.2 469199926 471251547 473938733 476673812 479171544 481703162 484442711 487439245 490662813
3581.5 490662813 493857533 496759832 499515027 502658010 506011605 509212554 512476504 516070962
3597.9 516070962 519739866 523276031 526771247 530165970 533504665 536923051 540475726 544242680
$$ packed form
3479.6D11109984Q51661P84188J028777J045256R43929J047492J211852J288474J218617
3497.9D20530230J128614J108467R85504Q93384J004845J227110J489878J466215J144647
3516.3D30978894J052916J311004J602084J477420J087517J041114J341373J626789
3532.6D41519111J732439J573175J395047J608759J874894J727492J344323J314968
3548.9D54090208J580000J752764J871258J973599K070725K133608J981199J746565
3565.2D69199926K051621K687186K735079K497732K531618K739549K996534L223568
3581.5D90662813L194720K902299K755195L142983L353595L200949L263950L594458
3597.9E16070962L668904L536165L495216L394723L338695L418386L552675L766954
$$ plain form
3614.2 544242680 547934651 551404059 555179894 559196651 562927365 566083193 568955302 572496891
3630.5 572496891 576370776 580059707 583545327 586829185 590122998 593583465 596944809 599863827
3646.8 599863827 602639616 606018603 609545290 612640202 615785837 619233012 622408152 625194490
3663.1 625194490 627955317 630542338 632738948 635204732 637666702 639482200 641719222 644625306
3679.4 644625306 647499025 650210857 652683854 654719651 656347692 658177316 660370469 662587821
3695.8 662587821 664629698 666360557 667816103 669417500 671216607 672767580 673751235 674590528 676190555
3714.1 676190555 678182960 679864705 681114674 682176292 683285475 684554577 685998976 687239170
3730.4 687239170 688039541 688660085 689652801 691233456 692730010 693203986 693051219 693907440 694913864
$$ packed form
3614.2E44242680L691971L469408L775835M016757L730714L155828K872109L541589
3630.5E72496891L873885L688931L485620L283858L293813L460467L361344K919018
3646.8E99863827K775789L378987L526687L094912L145635L447175L175140K786338
3663.1F25194490K760827K587021K196610K465784K461970J815498K237022K906084
3679.4F44625306K873719K711832K472997K035797J628041J829624K193153K217352
3695.8F62587821K041877J730859J455546J601397J799107J550973R83655Q39293J600027
3714.1F76190555J992405J681745J249969J061618J109183J269102J444399J240194
3730.4F87239170Q00371O20544R92716J580655J496554M73976j52767Q56221J006424
$$ plain form
3748.8 694913864 695242047 696216881 697941422 699241102 699922144 700782835 701922238 702841043 703544140
3767.1 703544140 704130173 704888523 706031203 707138240 707889915 708426833 709095597 709741294 710254431
3785.5 710254431 710959673 711898804 712862909 713560700 713959098 714496970 714898288 714963973 715558827 716251552
3805.9 716251552 716808438 717838705 718974233 719488144 719560564 720022559 720262468 720397353 721317470
3824.3 721317470 722355604 723097205 723537862 723887444 724504828 724908948 724766135 724903941 725575447
3842.6 725575447 726500928 727529705 728383005 728486717 727376759 726955712 728185117 729420662 730130494
3861 730130494 730424345 730701506 731068730 731077790 731127918 731636643 732353806 733086407 733417392 733663976
3881.4 733663976 734134734 734352231 734685540 735146046 735250115 735529184 736186683 736612082 736625314 736483812
$$ packed form
3748.8F94913864L28183R74834J724541J299680O81042Q60691J139403R18805P03097
3767.1G03544140N86033P58350J142680J107037P51675N36918O68764O45697N13137
3785.5G10254431P05242R39131R64105O97791L98398N37872M01318O5685N94854O92725
3805.9G16251552N56886J030267J135528N13911P2420M61995K39909J34885R20117
3824.3G21317470J038134P41601M40657L49582O17384M04120j42813J37806O71506
3842.6G25575447R25481J028777Q53300J03712j109958m21047J229405J235545P09832
3861G30130494K93851K77161L67224R060N0128N08725P17163P32601L30985K46584
3881.4G33663976M70758K17497L33309M60506J04069K79069O57499M25399J3232j41502
$$ plain form
3901.8 736483812 736403048 736753404 737489820 738102734 738462150 738716781 738846362 738955021 739210963 739367187
3922.1 739367187 739380717 739635944 740045488 740196884 740215182 740481138 740933239 741307318 741443813 741442859
3942.5 741442859 741625726 741915047 742055357 742190003 742461801 742756367 742989182 743172288 743315279 743493676
3962.9 743493676 743709862 743851542 743989587 744222939 744475603 744673789 744813740 744928956 745103896 745329797
3983.3 745329797 745456159 745470047 745555103 745756924 745940089 746103704 746315539
3997.6 746315539
$$ packed form
3901.8G36483812q0764L50356P36416O12914L59416K54631J29581J08659K55942J56224
3922.1G39367187J3530K55227M09544J51396J8298K65956M52101L74079J36495r54
3942.5G41442859J82867K89321J40310J34646K71798K94566K32815J83106J42991J78397
3962.9G43493676K16186J41680J38045K33352K52664J98186J39951J15216J74940K25901
3983.3G45329797J26362J3888Q5056K01821J83165J63615K11835
3997.6G46315539
##END=$$ End of the data block
