##TITLE=$$ Begin of the data block
##JCAMP-DX=5.00 $$ ACD/SpecManager v 10.08
##SPECTROMETER/DATA SYSTEM=Alpha
##DATE=22 Dec 2014 10:36:42
##DATA TYPE=INFRARED SPECTRUM
##DATA CLASS=XYDATA
##ORIGIN=
##OWNER=
##NPOINTS=1765
##FIRSTX=399.76428223
##LASTX=3997.64306641
##MAXX=3997.64306641
##MINX=399.76428223
##MAXY=0.86223203
##MINY=0.37192607
##XFACTOR=1.0000000000
##YFACTOR=1.000000000000000e-9
##FIRSTY=0.62481284
##DELTAX=2.03961372
##XUNITS=1/CM
##YUNITS=ARBITRARY UNITS
##XYDATA=(X++(Y..Y))
399.8F24812841q55028k666593m274487j264513K848864K559006j38760m32014J524925
418.1F22114241J181960k357363l494740j440227k52485k297521m150271k243400O41048
436.5F07701242M73678l04222J980960N275131M892528J600206K69889K013207K458393
454.8F26361012p40349l171503j046241M79698k016246m776180l534197p15912j227736
473.2F09612346l756225l406763j98186J090944j061082j963079M48942J950920k07365
491.5F02510452k829075k004981L28601k01762l202259l786684j369118q02934l244639
509.9E85397601m773259l261089j659930l125370n176782l822267o13690M46141j074672
528.3E62336683j292526J350879L607214L151476K584100M437685O051957L929914
$$ y = [624812841, 623957813, 621291220, 617016733, 615752220, 618601084, 621160090, 621021330, 620589316, 622114241, 623296201, 620938838, 617444098, 616003871, 615751386, 613453865, 609303594, 607060194, 607701242, 608174920, 607870698, 609851658, 615126789, 620019317, 621619523, 621889412, 623902619, 626361012, 625620663, 622449160, 621402919, 621882617, 619866371, 615090191, 611555994, 610840082, 609612346, 605856121, 602449358, 602251172, 603342116, 602281034, 600317955, 600766897, 602717817, 602510452, 599681377, 597676396, 598004997, 597803235, 594600976, 590814292, 589445174, 588642240, 585397601, 580624342, 577363253, 575703323, 572577953, 567401171, 563578904, 562965214, 563411355, 562336683, 561044157, 562395036, 566002250, 569153726, 571737826, 576175511, 582227468, 586157382]
544.6E86157382l58j246452K12371K00272k566994m285574k987802k074599m163325
562.9E69244921o735980o594837m634082l638387l517389j766026J999795M834652
579.3E49192667M999876M685640N960226O984294N254030K055824O82712J526832J483977
597.6E82826078m92275j556217r8229J516402Q45849n01752M15445K764463L289342
616E89009106J760841J589238L824949N133033L491462J550316K103746L676653L074110
634.3F15213454O97076J29342J964629K626121P35879m46916J119137K760828J727104
652.7F26526654k18094O1870J953542K119541K31028k95758K115845L830195O47843
671F36972666r41992N44548K703071K471745M15504n7757J620531K270281K85626j584590
$$ y = [586157382, 586157024, 584910572, 585122943, 585323215, 582756221, 578470647, 575482845, 573408246, 569244921, 562508941, 555914104, 551280022, 547641635, 544124246, 542358220, 544358015, 549192667, 554192543, 558878183, 564838409, 571822703, 577076733, 579132557, 579815269, 581342101, 582826078, 582333803, 580777586, 580679357, 582195759, 583041608, 582539856, 582955301, 585719764, 589009106, 590769947, 592359185, 596184134, 601317167, 604808629, 606358945, 608462691, 612139344, 615213454, 615910530, 616039872, 618004501, 620630622, 621366501, 620919585, 622038722, 624799550, 626526654, 626308560, 626370430, 628323972, 630443513, 630674541, 630378783, 632494628, 636324823, 636972666, 636030674, 636575222, 639278293, 641750038, 642165542, 642107785, 643728316, 645998597, 646284223, 644699633]
691.4F44699633r19580K40504j014471l420829l635824j662851o54399j474023j379907
709.8F30778253J115382L702760L787517K684414L522575N778075O149172M318893
726.1F61837041L230334M296481N048633L329158J098096J128554K318025J435101
742.4F83721423j379073k817809k028227j848578l768623n387068m414499k489686
758.7F59587860k308905l035843j791180J463354L825665M105210M383862O407857
775.1F72637880Q441269P764399N376697M613459N566001N180955K887189J668155
791.4G14136004L028095M444301L652275K237141K690911M160762L738404J476645
807.7G39564538M51207J663685K386928P97331r35674m15146Q72612O676k486170l550231
$$ y = [644699633, 643780053, 644020557, 643006086, 639585257, 635949433, 634286582, 633632183, 632158160, 630778253, 631893635, 635596395, 639383912, 642068326, 645590901, 651368976, 657518148, 661837041, 665067375, 669363856, 674412489, 677741647, 678839743, 679968297, 682286322, 683721423, 682342350, 679524541, 677496314, 675647736, 671879113, 666492045, 662077546, 659587860, 657278955, 654243112, 652451932, 653915286, 657740951, 661846161, 666230023, 672637880, 681079149, 688843548, 694220245, 698833704, 704399705, 709580660, 712467849, 714136004, 717164099, 721608400, 725260675, 727497816, 730188727, 734349489, 738087893, 739564538, 740015745, 741679430, 744066358, 744863689, 743928015, 743512869, 744385481, 744392157, 741905987, 738355756]
828.1G38355756k720833k694428m499376n679905m555285k984464l147483m169822
844.4G07904160l785372k224564j904846l410995m545390l846347k387226j170337
860.7F84629083P98464M455089Q309841R947002R073019P701457P029474N613267K209842
879.1G39766538j472175l088415l228366m157484n907654o302059m834771l695369
895.4G07080245m266083n069792m545451l827512m742682o729841p754803p502019
911.7F62642062p607162q631051q919299p178843m512488k819777k169967j132547
928F19670928O18755J816631J888394K062380L290773M490137M015267J805305r13083
946.4F38745487l643334o913245j0397792j2652933j3289154j3697922j4901281j6156017
$$ y = [738355756, 735634923, 732940495, 728441119, 722761214, 718205929, 715221465, 712073982, 707904160, 704118788, 701894224, 699989378, 696578383, 692032993, 688186646, 685799420, 684629083, 685427547, 689882636, 698192477, 708139479, 717212498, 724913955, 731943429, 737556696, 739766538, 738294363, 735205948, 731977582, 727820098, 721912444, 715610385, 710775614, 707080245, 702814162, 697744370, 693198919, 689371407, 684628725, 677898884, 670144081, 662642062, 655034900, 646403849, 637484550, 630305707, 625793219, 622973442, 620803475, 619670928, 620289683, 622106314, 623994708, 626057088, 629347861, 633837998, 637853265, 639658570, 638745487, 635102153, 628188908, 617791116, 605138183, 591849029, 578151107, 563249826, 547093809]
962.7E47093809j6515613j6471684j6990751j7867446j8054187j7232955j6036004
977D27925169j4832347j3144165j0518402p463247m940063l209501j719207j72168
993.3C71926069R91673J344502J248419J328200J471162J091450J87755m93437m75884
1011.6C78619909j31249Q0377M31537J306773K394020L028453L150433L333121L753841
1030C95967215L876657L217935K162218J482815J287758J026303O30051P75486J658231
1048.4D12084669K746791L696113M690230O015033P444143Q446157R042859R289026
1064.7D63455021Q011848L459931l651768r254694j0129393p271260l769159j126140
1081D39724386J024723K938121M177839M661351N008757N546451N667776M702121L003895
$$ y = [547093809, 530578196, 514106512, 497115761, 479248315, 461194128, 443961173, 427925169, 413092822, 399948657, 389430255, 381967008, 377026945, 373817444, 372098237, 371926069, 372917742, 374262244, 375510663, 376838863, 378310025, 379401475, 379589230, 379095793, 378619909, 378488660, 378569037, 379000574, 380307347, 382701367, 385729820, 388880253, 392213374, 395967215, 399843872, 403061807, 405224025, 406706840, 407994598, 409020901, 409650952, 410426438, 412084669, 414831460, 418527573, 423217803, 429232836, 436676979, 445123136, 454165995, 463455021, 471466869, 474926800, 471275032, 462020338, 451890945, 444619685, 440850526, 439724386, 440749109, 443687230, 447865069, 452526420, 457535177, 463081628, 468749404, 473451525, 476455420]
1099.4D76455420J627654J113534J147181J475721K259136L401816M145830L847003
1115.7D95473295K935559K308190K105474J897514J793564K439022L809034M611075
1132E17372727L655553J305938j277208l591359n710423p285297p693440o906479n642653
1150.3D84227359m572540l553063k073944l09258J039266K004743L386021N418539
1166.7D85567123P385939Q685589R581149J0626494J1615277J1882007J1453807J1014343
1183E67811728J0832607J0234535Q645296O647766N173743M197478L056943J819194
1199.3F18419290J354336J819432K316237K361178K568066L482401M479409M573762
1215.6F41374111L850341L191173K793908J972914N29885o58214r03308p87139j119554
$$ y = [476455420, 478083074, 479196608, 480343789, 481819510, 484078646, 487480462, 491626292, 495473295, 498408854, 500717044, 502822518, 504720032, 506513596, 508952618, 512761652, 517372727, 521028280, 522334218, 521057010, 517465651, 511755228, 504469931, 496776491, 489870012, 484227359, 479654819, 476101756, 474027812, 473718554, 474757820, 476762563, 480148584, 485567123, 492953062, 501638651, 511219800, 521846294, 533461571, 545343578, 556797385, 567811728, 578644335, 588878870, 597524166, 604171932, 609345675, 613543153, 616600096, 618419290, 619773626, 621593058, 623909295, 626270473, 628838539, 632320940, 636800349, 641374111, 645224452, 648415625, 651209533, 653182447, 653712332, 653054118, 652150810, 651363671, 650244117]
1234F50244117j622439j511573q12173k96474j94549J68502J104951J885831J863361
1252.3F50829554J420676J301825J487732J312852P22766N98669J333475K072275J944780
1270.7F63024604J290799R45448Q58784L61562m97460q70646n21302k48492o36518
1289F63706779j196444j225531j004517j242339j806796j928925j444996j110017j412451
1307.4F51334763j686335j268268o82294p33972j236379j444399j384914j880407l123165
1325.8F37894630m240691m481375m123807l786505l407299k528846j184762j52707
1342.1F13988638P0095J5855J90794K82884j38998p72596r52243p33912p69377j212120
1362.5F09969020j280844o92010j68920k0325N901L26693Q12113Q57890M56214N52118
$$ y = [650244117, 648621678, 647110105, 646297932, 646001458, 645806909, 645975411, 647080362, 648966193, 650829554, 652250230, 653552055, 655039787, 656352639, 657075405, 657674074, 659007549, 661079824, 663024604, 664315403, 665260851, 666119635, 666481197, 665983737, 665113091, 664591789, 664343297, 663706779, 662510335, 661284804, 660280287, 659037948, 657231152, 655302227, 653857231, 652747214, 651334763, 649648428, 648380160, 647697866, 646963894, 645727515, 644283116, 642898202, 641017795, 637894630, 633653939, 629172564, 625048757, 621262252, 617854953, 615326107, 614141345, 613988638, 614058733, 614074588, 614265382, 614548266, 614409268, 613636672, 612684429, 611950517, 611181140, 609969020, 608688176, 607996166, 607827246, 607806921, 607812822, 608139515, 608951628, 609809518, 610265732, 610817850]
1382.9F10817850J832664L497958L776312K666831J712262J072765K68697p12811j159728
1401.2F23772800j056135j117885j445353j770615j720071j246751r25600j121760
1417.5F13368630j148700k70605M41551N35548N05864Q09431J363874J539767J347482
1435.9F18492842J361906J650214J742840J289130N76376O7175j79172n00917j034320
1454.3F23466074j963079j979708k88308N98371J212418K434075L688276M943550O829142
1472.6F38940811P634998P170915O676614O127060N635381N197346N141377N129457
1488.9F87653959M589796L746450L581703L811895L344357K744019K542139K619445
1505.2G14633763K718925K203584J905501K014160K006710J778423J448095J450718
$$ y = [610817850, 612650514, 616148472, 619924784, 622591615, 624303877, 625376642, 625645339, 624932528, 623772800, 622716665, 621598780, 620153427, 618382812, 616662741, 615415990, 614490390, 613368630, 612219930, 611949325, 612390876, 612926424, 613432288, 614241719, 615605593, 617145360, 618492842, 619854748, 621504962, 623247802, 624536932, 625113308, 625180483, 625001311, 624500394, 623466074, 621502995, 619523287, 619234979, 619833350, 621045768, 623479843, 627168119, 632111669, 638940811, 646575809, 653746724, 660423338, 666550398, 672185779, 677383125, 682524502, 687653959, 692243755, 695990205, 699571908, 703383803, 706728160, 709472179, 712014318, 714633763, 717352688, 719556272, 721461773, 723475933, 725482643, 727261066, 728709161, 730159879]
1521.6G30159879J640796J419783J062095R85563J097083J055002Q76725N39124O5863
1539.9G38901913Q8334K63036P7009j610R5845J11401j38402m06683j011669j150072
1560.3G36829102k69115m28557o72639o33776p07209o17743q92222j391112r23634
1578.7G30293095o76393j156927j403927j300872j372099j822769k175510k114952
1595G18269646j987338k264857k790094k979755k823353k906501l420234l645301l339112
1613.4F92113101l633201m378438l405034k681852k994656k867401k839863k762377
1629.7F66550279j812876j159966j403272j003623m0769O10888R86039J148641J547456
1648F65422797J896739K438486L383636K976835K826095L366768L930926L879369L368497
$$ y = [730159879, 731800675, 733220458, 734282553, 735268116, 736365199, 737420201, 738296926, 738836050, 738901913, 738990247, 739253283, 739330292, 739328682, 739424527, 739535928, 739397526, 738990843, 737979174, 736829102, 736559987, 736131430, 735458791, 734825015, 734117806, 733500063, 732607841, 731216729, 730293095, 729616702, 728459775, 727055848, 725754976, 724382877, 722560108, 720384598, 718269646, 716282308, 714017451, 711227357, 708247602, 705424249, 702517748, 699097514, 695452213, 692113101, 688479900, 684101462, 680696428, 678014576, 675019920, 672152519, 669312656, 666550279, 664737403, 663577437, 662174165, 661170542, 661129773, 661740661, 662726700, 663875341, 665422797, 667319536, 669758022, 673141658, 676118493, 678944588, 682311356, 686242282, 690121651, 693490148]
1666.4F93490148L661751M406572M067659L809273M069984M027069L835976L715992
1682.7G25084424M127324M040777L686667L558218K978504K746820K889872K619982
1699G51732588K313494J962364J837194J962304J744211J434565J466572J713812J798451
1717.4G67965555J589656J512885J728416J971900J791716J507818J444877J631200
1733.7G81144023J793563J498342J326442J620113J900971J748920J459539J561701
1750G94053614K027571J973451J499950J330078J499295J579941J343667J017690R68873
1768.4H07294130J083494R28342P39157Q01087R75906J038850P87317N05805O49453
1786.7H14803541R31859P35700L61621N05567Q24570Q24810N66721M42206O08504P86126
$$ y = [693490148, 697151899, 701558471, 705626130, 709435403, 713505387, 717532456, 721368432, 725084424, 729211748, 733252525, 736939192, 740497410, 743475914, 746222734, 749112606, 751732588, 754046082, 756008446, 757845640, 759807944, 761552155, 762986720, 764453292, 766167104, 767965555, 769555211, 771068096, 772796512, 774768412, 776560128, 778067946, 779512823, 781144023, 782937586, 784435928, 785762370, 787382483, 789283454, 791032374, 792491913, 794053614, 796081185, 798054636, 799554586, 800884664, 802383959, 803963900, 805307567, 806325257, 807294130, 808377624, 809305966, 810045123, 810846210, 811822116, 812860966, 813648283, 814154088, 814803541, 815735400, 816471100, 816832721, 817338288, 818162858, 818987668, 819554389, 819996595, 820605099, 821391225]
1807.1H21391225O57618L60310L72350O36161O84380M81546L31521L73602N44310N25415
1827.5H26358438J97589J94967N52356N77867L20673K07782K40028J69694J46031J58728
1847.9H29124153J73151L29197L54170J43767m232J31905L34680K89857K6048j30058
1868.3H30772638J33157M11272L05176J31190J88887L10957K87652J85788J89304K37584
1888.7H33153605K63274K18213Q4758J18970K52069J94489M4644M0949J20759J18375
1909.1H34610105O2704O4671J23977J09554P0929M5657L3021J44124J98484Q7440J3828
1931.5H35564494O4373J27196J12415L4690j7286O7890J75834J36852Q3029J22547
1951.9H36472034J62840J30475Q2076R3102J48356J76310J12832K5630M2975J29461
$$ y = [821391225, 822048843, 822409153, 822781503, 823417664, 824102044, 824583590, 824915111, 825288713, 825833023, 826358438, 826556027, 826750994, 827303350, 827881217, 828201890, 828409672, 828649700, 828819394, 828965425, 829124153, 829297304, 829626501, 829980671, 830124438, 830120206, 830252111, 830586791, 830876648, 830902696, 830772638, 830905795, 831317067, 831622243, 831753433, 831942320, 832253277, 832540929, 832726717, 832916021, 833153605, 833416879, 833635092, 833719850, 833838820, 834090889, 834285378, 834330022, 834370971, 834491730, 834610105, 834672809, 834737480, 834861457, 834971011, 835041940, 835087597, 835120618, 835264742, 835463226, 835550666, 835564494, 835628867, 835756063, 835868478, 835903168, 835885882, 835953772, 836129606, 836266458, 836349487, 836472034, 836634874, 836765349, 836847425, 836940527, 837088883, 837265193, 837378025, 837403655, 837446630, 837576091]
1972.3H37576091J48356P7784K1041N3346J22666R8646Q583k8193J192L1591K8550
1994.8H38139653j3172l2843K0922K7537q1241j72436j45615j04129j52528k57015
2015.2H37229133l27409l33428l99649o49333o89089j40906K74003N2809k50578k77936
2035.6H34487617j82211j66357k45810k83956k02835j17242j21713j44481r1613K0087
2056H32951486O0499r835m5001M1663J29760J02460k98j5438R1553J30177L0219j7702
2080.4H33449543P9393J56283J07348L2127O8188J74641J84238P5520M5299J79112
2100.8H34551692K63214J63317L9100P2599J89900J79589N1439J6987J10090J49667
2121.2H35787594L7968n4359J6570R9123N0783m0651q463J06275J24454L0279k4914
$$ y = [837576091, 837724447, 837802231, 837823272, 837876618, 837999284, 838097930, 838106513, 838078320, 838079512, 838111103, 838139653, 838126481, 838093638, 838114560, 838142097, 838060856, 837888420, 837742805, 837638676, 837486148, 837229133, 836901724, 836568296, 836168647, 835519314, 834830225, 834689319, 834963322, 835016131, 834765553, 834487617, 834305406, 834139049, 833893239, 833609283, 833406448, 833289206, 833167493, 833023012, 832931399, 832951486, 833011985, 833002150, 832957149, 832998812, 833128572, 833231032, 833230734, 833215296, 833306849, 833437026, 833467245, 833449543, 833528936, 833685219, 833792567, 833824694, 833892882, 834067523, 834251761, 834327281, 834372580, 834551692, 834814906, 834978223, 835017323, 835089922, 835279822, 835459411, 835510850, 835527837, 835637927, 835787594, 835825562, 835771203, 835787773, 835886896, 835937679, 835897028, 835888565, 835994840, 836119294, 836149573, 836124659]
2143.7H36124659L8206R8348Q2135N3048Q3029J59085J75834J45852J87338K61247
2164.1H37408781K55585K16782K59817L70562M21583L83020L10242K83003L49343M02748
2184.5H40661466L70383L11911K88785K99573K96950K70069K56538K89083L40819L37124
2204.8H43722701K94507K90215K99334K79606K65717K86818L21209L08633K46346K02000
2225.2H46517086K00927K15709K22743K10166J90139J92821K09749J96457J46031J30236
2245.6H48432064J72556J97410J86920J83404J77145J55270J47939J59800J58012J57773
2266H50128293J89781J98245J71244J57714J40608J36733J48356J49071J70112K04026
2286.4H51794183K48015K69115K29955K25901K80917K94328K49207K55346L63946M50134
$$ y = [836124659, 836162865, 836261213, 836343348, 836396396, 836479425, 836638510, 836814344, 836960196, 837147534, 837408781, 837664366, 837881148, 838140965, 838511527, 838933110, 839316130, 839626372, 839909375, 840258718, 840661466, 841031849, 841343760, 841632545, 841932118, 842229068, 842499137, 842755675, 843044758, 843385577, 843722701, 844017208, 844307423, 844606757, 844886363, 845152080, 845438898, 845760107, 846068740, 846315086, 846517086, 846718013, 846933722, 847156465, 847366631, 847556770, 847749591, 847959340, 848155797, 848301828, 848432064, 848604620, 848802030, 848988950, 849172354, 849349499, 849504769, 849652708, 849812508, 849970520, 850128293, 850318074, 850516319, 850687563, 850845277, 850985885, 851122618, 851270974, 851420045, 851590157, 851794183, 852042198, 852311313, 852541268, 852767169, 853048086, 853342414, 853591621, 853846967, 854210913, 854661047]
2306.8H54661047M36604L90292L63707L95596N34535P09951O79373M30584L24071L95477
2327.2H59321237L65495J87576M1485J3411K8014M0174l3081m74214j149059q79586
2347.6H57461452K78593J230836J403450R75192O04510K77996k34484p95186j139283
2366H60063076j208365j238465j340926j377284j221180j002729q61824p26879n57899
2384.3H50527525l79443k18749j53005j65046j52528j39415j59860j72913j66655j55925
2404.7H48663986j71721k16306k52604k73824k83181k78056k68877k63512l09527l74317
2425.1H45972061l61621l31402l66330m08828m05372l97801l93450l83139l96132l99590
2445.5H42128396l89397m29988m65632m06444l23832l35097m02749m13835l64363l27468
$$ y = [854661047, 855097651, 855487943, 855851650, 856247246, 856781781, 857491732, 858171105, 858601689, 858925760, 859321237, 859686732, 859874308, 859915793, 859929204, 859957218, 859997392, 859964311, 859490097, 858341038, 857461452, 857740045, 858970881, 860374331, 861349523, 861954033, 862232029, 861997545, 861202359, 860063076, 858854711, 857616246, 856275320, 854898036, 853676856, 852674127, 851812303, 851085424, 850527525, 850148082, 849929333, 849776328, 849611282, 849458754, 849319339, 849159479, 848986566, 848819911, 848663986, 848492265, 848275959, 848023355, 847749531, 847466350, 847188294, 846919417, 846655905, 846346378, 845972061, 845610440, 845279038, 844912708, 844503880, 844098508, 843700707, 843307257, 842924118, 842527986, 842128396, 841738999, 841309011, 840843379, 840436935, 840113103, 839778006, 839375257, 838961422, 838597059, 838269591]
2465.9H38269591l34441l67046l72886l19481k82526l29614l86119l50058k79009l00587
2486.3H34947824l51130k91348j77264j71602k73645k87533j61826j00792k10702l28958
2506.7H32593024k44856r0063j56998l10243k71678j34229j64151l70443m76897l54707
2527.1H30018759k22087l14236n00083n00262l43382l11017m85003n91099m75645l43204
2547.5H25932741m09484n58316m96388k87175k80559n11170o19173m20391k30611l48448
2567.9H21771026n56231n35190l46065k97069m76599n52416l52204j93655l19898m87030
2588.3H17654669m01854k07424k08974l94941m28855k15828j00017k85804n08249m70519
2608.7H14432204l21150l96550o43849o87838m84585m03047o28889q76724q25286o43850
$$ y = [838269591, 837935150, 837568104, 837195218, 836875737, 836593211, 836263597, 835877478, 835527420, 835248411, 834947824, 834596694, 834305346, 834128082, 833956480, 833682835, 833395302, 833233476, 833132684, 832921982, 832593024, 832348168, 832258105, 832101107, 831790864, 831519186, 831384957, 831220806, 830850363, 830373466, 830018759, 829796672, 829482436, 828982353, 828482091, 828138709, 827827692, 827342689, 826751590, 826275945, 825932741, 825523257, 824964941, 824468553, 824181378, 823900819, 823389649, 822770476, 822350085, 822119474, 821771026, 821214795, 820679605, 820333540, 820036471, 819559872, 819007456, 818655252, 818461597, 818141699, 817654669, 817252815, 817045391, 816836417, 816441476, 816012621, 815796793, 815696776, 815410972, 814902723, 814432204, 814111054, 813714504, 813070655, 812382817, 811898232, 811495185, 810866296, 809989572, 809164286, 808520436]
2629.1H08520436o88731r18150r62258p31647o14106q34644j056373r55642p32302
2647.4H01026583p39217r38714r73284p34091o02901q03709r77337q16941n66006o21498
2667.8G93252885q84175q99017o28769m81904o45935q15153p01249n10395n95569q36730
2688.2G86253989q10504n37515m72188p45654r44257q03172o22273p34269r69649r33528
2708.6G78680980p03394o72698q65221r54211p56145n31017o33478q88348q23736n06640
2729G71346092m37677o76989p76768n40674l48150n09799p57098o65009l46780l21865
2749.4G65965283o14643p28548n02109l06130m30882o47425n55754k57611k45393n63681
2769.8G61113107p20560n08011l67105o28829q98182p74324n39303o08623r19819j073599
$$ y = [808520436, 807831705, 806913555, 805951297, 805219650, 804605544, 803770900, 802714527, 801758885, 801026583, 800287366, 799348652, 798375368, 797641277, 797038376, 796234667, 795257330, 794440389, 793874383, 793252885, 792368710, 791469693, 790840924, 790359020, 789713085, 788897932, 788196683, 787686288, 787090719, 786253989, 785443485, 784905970, 784433782, 783688128, 782743871, 781940699, 781318426, 780584157, 779614508, 778680980, 777977586, 777304888, 776439667, 775485456, 774729311, 774198294, 773564816, 772676468, 771852732, 771346092, 770908415, 770231426, 769454658, 768913984, 768565834, 768056035, 767298937, 766633928, 766287148, 765965283, 765350640, 764622092, 764119983, 763813853, 763382971, 762735546, 762179792, 761922181, 761676788, 761113107, 760392547, 759884536, 759517431, 758888602, 757990420, 757216096, 756676793, 756068170, 755148351, 754074752]
2790.2G54074752r06765q00848j035750j290619j235664j050830j136959j454830j546919
2808.6G43615568j344383j299620j573264j793802j687467j496434j597107j888931
2824.9G30934560k009809j921117j905143k113104k316415k267659k205670k483010
2841.2G13712633k922714l118634l019393k926111k938509k784908k366125k000869
2857.5F91635370k072274k510786k888442l125786l498435l983796m252136m252732
2873.8F65050983m223585m193961m004002l529847k821982k200365j806795j398564
2890.1F40871882q92102n21720m77135o57320p59542p45058q77082j224518j567483
2908.5F33149922j788080k087653k621114l134370l291070l115296k808869k439857
$$ y = [754074752, 753167987, 752367139, 751331389, 750040770, 748805106, 747754276, 746617317, 745162487, 743615568, 742271185, 740971565, 739398301, 737604499, 735917032, 734420598, 732823491, 730934560, 728924751, 727003634, 725098491, 722985387, 720668972, 718401313, 716195643, 713712633, 710789919, 707671285, 704651892, 701725781, 698787272, 696002364, 693636239, 691635370, 689563096, 687052310, 684163868, 681038082, 677539647, 673555851, 669303715, 665050983, 660827398, 656633437, 652629435, 649099588, 646277606, 644077241, 642270446, 640871882, 639979780, 639458060, 638980925, 638323605, 637564063, 636819005, 635941923, 634717405, 633149922, 631361842, 629274189, 626653075, 623518705, 620227635, 617112339, 614303470, 611863613]
2924.8F11863613j867235j012981j08838O83666J480400K376318L273249L931284M236817
2943.2F24856293M403651M584968M701316M682064M533768M452467M534543M517376
2959.5F61266446M249334L917456L705680L550947L276170K995133K956092L064335
2975.8F88981593L082096K874971K533435K337099K276003K061903J747430J555383
2992.1G07449913J389086J127363P52449M07815L01957K35140n6684l67343m59135
3010.5G10780561n34177q38458j250565j475573j446724j392186j559138j828015j852572
3028.8F98603153j709044j712084j948952k151430k009869j850485k043009k331317
3045.1F82846963k377092k199054k147734k332628k403021k292633k250314k325475
$$ y = [611863613, 609996378, 608983397, 608874559, 609558225, 611038625, 613414943, 616688192, 620619476, 624856293, 629259944, 633844912, 638546228, 643228292, 647762060, 652214527, 656749070, 661266446, 665515780, 669433236, 673138916, 676689863, 679966033, 682961166, 685917258, 688981593, 692063689, 694938660, 697472095, 699809194, 702085197, 704147100, 705894530, 707449913, 708838999, 709966362, 710718811, 711126626, 711428583, 711663723, 711607039, 711239696, 710780561, 710246384, 709407926, 708157361, 706681788, 705235064, 703842878, 702283740, 700455725, 698603153, 696894109, 695182025, 693233073, 691081643, 689071774, 687221289, 685178280, 682846963, 680469871, 678270817, 676123083, 673790455, 671387434, 669094801, 666844487, 664519012]
3061.5F64519012k370954k266407k238333k460658k607704k439975k106428j973510
3077.8F46055043k231062k494394k468944k390802k378404k429724k554238k502739
3094.1F26604736k276480k202332k340019k470672k401293k238750k242684k373100
3110.4F08059406k268493k004862k015710k213478k378165k505660k500296k366603
3126.7E89806139k223253k159476k193451k196014k076566j981139k112210k301157
3143E72562873k294838k157927j933395j764000j942933k259254k254426k045453j982629
3161.4E53928018k045274k026498j919687j857221j864851j879036j823783j774788
3177.7E38736880j824200j894534j880109j754940j652062j692295j774132j770794
$$ y = [664519012, 662148058, 659881651, 657643318, 655182660, 652574956, 650134981, 648028553, 646055043, 643823981, 641329587, 638860643, 636469841, 634091437, 631661713, 629107475, 626604736, 624328256, 622125924, 619785905, 617315233, 614913940, 612675190, 610432506, 608059406, 605790913, 603786051, 601770341, 599556863, 597178698, 594673038, 592172742, 589806139, 587582886, 585423410, 583229959, 581033945, 578957379, 576976240, 574864030, 572562873, 570268035, 568110108, 566176713, 564412713, 562469780, 560210526, 557956100, 555910647, 553928018, 551882744, 549856246, 547936559, 546079338, 544214487, 542335451, 540511668, 538736880, 536912680, 535018146, 533138037, 531383097, 529731035, 528038740, 526264608, 524493814]
3194E24493814j703144j649737j634061j606763j543998j507581j563251j596927j504243
3212.4E10184109j416325j417995j462996j470566j393377j331568j371026j371205
3228.7D98949051j201689j084745j291633j531303j433551j214117j114339j090526
3245D88987148j131416j211881j165658j000375r38356j015514j048446r78201r30012
3263.4D79567289r16808p74593n86927p17073j022786j091063r71854q79079q85487
3281.7D71721619q94069q27879p63923p38323p61300q37326r28164j056015j121640
3300.1D63792980r04292o12438p07477j097739j386791j449049j337409j224577j178533
3318.4D53894675j104862j025706j074225j307815j486033j409501j247526j154631
$$ y = [524493814, 522790670, 521140933, 519506872, 517900109, 516356111, 514848530, 513285279, 511688352, 510184109, 508767784, 507349789, 505886793, 504416227, 503022850, 501691282, 500320256, 498949051, 497747362, 496662617, 495370984, 493839681, 492406130, 491192013, 490077674, 488987148, 487855732, 486643851, 485478193, 484477818, 483539462, 482523948, 481475502, 480497301, 479567289, 478650481, 477875888, 477288961, 476571888, 475549102, 474458039, 473486185, 472607106, 471721619, 470827550, 469999671, 469235748, 468497425, 467736125, 466898799, 465970635, 464914620, 463792980, 462888688, 462276250, 461568773, 460471034, 459084243, 457635194, 456297785, 455073208, 453894675, 452789813, 451764107, 450689882, 449382067, 447896034, 446486533, 445239007, 444084376]
3334.8D44084376j137555j263201j445055j515448j552284j474708j240015j298100
3351.1D33158010j702159j881123j632512j356214j400292j537621j381188j174331
3367.4D21092570j355022j731009j768589j462876j268089j295746j362085j290470
3383.7D09558684j050175p18504m80026o61641j071543j062512o10024m03911p77244
3402.1D02723104j122058r17315n89580n12391n40197o22183o80029n47707l87758
3420.4C96803886l43234k16305O437J07885N3942J36614L21746J70588j63525j66774
3440.8C96711260J43677M13388M61340M20511N27888O58661O54549P44700R31621Q58396
3461.2D02525991P90745J094461J278549R14753M37706M38482Q16703J229554J261324
$$ y = [444084376, 442946821, 441683620, 440238565, 438723117, 437170833, 435696125, 434456110, 433158010, 431455851, 429574728, 427942216, 426586002, 425185710, 423648089, 422266901, 421092570, 419737548, 418006539, 416237950, 414775074, 413506985, 412211239, 410849154, 409558684, 408508509, 407790005, 407309979, 406648338, 405576795, 404514283, 403904259, 403500348, 402723104, 401601046, 400683731, 400094151, 399581760, 399041563, 398419380, 397739351, 397191644, 396803886, 396460652, 396244347, 396250784, 396358669, 396412611, 396549225, 396870971, 397041559, 396878034, 396711260, 396854937, 397268325, 397729665, 398150176, 398678064, 399336725, 399991274, 400735974, 401667595, 402525991, 403316736, 404411197, 405689746, 406604499, 407042205, 407480687, 408297390, 409526944, 410788268]
3479.6D10788268Q57442P38293J001686J069665J016140J098007J189917J226694J178175
3497.9D20164287J160443J176685J008391Q86351J031548J252353J458645J430631
3514.2D29569334J170307J131356J377791J618177J477152J081437J014769J322240
3530.6D39762563J619607J739174J619398J455725J617700J862585J761377J401454
3546.9D52839583J359373J591772J723975J841277J998753K144157K203167K010167
3563.2D67712224J757115K086609K706021K748043K529323K563774K771318K994091
3579.5D87868518L195166L205270K938419K774507L174961L405750L268122L357351
3595.8E13188064L647983L639579L504276L506542L410637L366291L477455L590881
$$ y = [410788268, 411645710, 412384003, 413385689, 414455354, 415471494, 416569501, 417759418, 418986112, 420164287, 421324730, 422501415, 423509806, 424396157, 425427705, 426680058, 428138703, 429569334, 430739641, 431870997, 433248788, 434866965, 436344117, 437425554, 438440323, 439762563, 441382170, 443121344, 444740742, 446196467, 447814167, 449676752, 451438129, 452839583, 454198956, 455790728, 457514703, 459355980, 461354733, 463498890, 465702057, 467712224, 469469339, 471555948, 474261969, 477010012, 479539335, 482103109, 484874427, 487868518, 491063684, 494268954, 497207373, 499981880, 503156841, 506562591, 509830713, 513188064, 516836047, 520475626, 523979902, 527486444, 530897081, 534263372, 537740827, 541331708]
3612.1E41331708L779173L745318L537595L790021M015327L772556L244341K921760
3628.5E70137799L484547L842056L725052L508865L266216L261626L441870L355086
3644.8E98023117K897441K762020L396749L573895L177344L202975L423453L147363
3661.1F23604357K809227K786219K606034K216280K445101K422691J809776K276301
3677.4F42975986K939641K873362K687037K482533K098918J625478J763523K176881
3693.7F61623359K239048K056480J709342J437723J629353J818001J505971R18865
3710F74938142Q74698J645148J949907J663684J283765J066447J068651J232565J482129
3728.4F87205136J321316Q26239N71251R09627J489460J456380N22911m2021R40919
$$ y = [541331708, 545110881, 548856199, 552393794, 556183815, 560199142, 563971698, 567216039, 570137799, 573622346, 577464402, 581189454, 584698319, 587964535, 591226161, 594668031, 598023117, 600920558, 603682578, 607079327, 610653222, 613830566, 617033541, 620456994, 623604357, 626413584, 629199803, 631805837, 634022117, 636467218, 638889909, 640699685, 642975986, 645915627, 648788989, 651476026, 653958559, 656057477, 657682955, 659446478, 661623359, 663862407, 665918887, 667628229, 669065952, 670695305, 672513306, 674019277, 674938142, 675812840, 677457988, 679407895, 681071579, 682355344, 683421791, 684490442, 685723007, 687205136, 688526452, 689352691, 689923942, 690833569, 692323029, 693779409, 694302320, 694260299, 695201218]
3746.7F95201218R77039K41101R89259J782178J307667O60598Q60393J167655R34541
3765.1G04121649O86646N89072P82490J145065J089335P31527N28574O57738O62148
3783.5G10994244N54323P19428R43363R52899O97434M59373N68867L37004K5750O49273
3803.9G16901958P24375N23865R91524J084327N05269J74880N17964J68264O5387Q90493
3824.3G22548306J023769P97749N28991L80814O06120L60012j99437J08361O42538
3842.6G26797223R25839J089752Q93235Q0109j168967m58479J254440J247346P00832
3861G31361330L27110L45945M00782L4511J03056M62115N98848P55549M82738K91407
3881.4G35163391L62873J06454K89559M69744J67489L70741O84202M06384j3351k25485
$$ y = [695201218, 696178257, 696419358, 697408617, 699190795, 700498462, 701159060, 702019453, 703187108, 704121649, 704808295, 705397367, 706179857, 707324922, 708414257, 709145784, 709674358, 710332096, 710994244, 711548567, 712267995, 713211358, 714164257, 714861691, 715321064, 715889931, 716226935, 716252685, 716901958, 717626333, 718150198, 719141722, 720226049, 720731318, 720906198, 721424162, 721592426, 721657813, 722548306, 723572075, 724369824, 724898815, 725279629, 725885749, 726245761, 726046324, 726154685, 726797223, 727723062, 728812814, 729706049, 729786158, 728617191, 728158712, 729413152, 730660498, 731361330, 731688440, 732034385, 732435167, 732469678, 732572734, 733034849, 733633697, 734389246, 734871984, 735163391, 735526264, 735632718, 735922277, 736392021, 736559510, 736930251, 737614453, 738020837, 738007486, 737782001]
3901.8G37782001j50918M07576Q36909O52313L63767K47836P8738M9591K62439K03848
3922.1G40734100J5676K42949M68075K31803L0279J73986L29852L26216J68502O5804
3942.5G42787242K47121K98798P2121Q2136K95520L30626K51592K13742J72555J62542
3962.9G44913995J63377Q9407J25050K76506K54512R5606P8618J89603K60114K26856
3983.3G46673644J10685K6286J01686K39908K11239J35660J64152
3997.6G47663260
$$ y = [737782001, 737631083, 738038659, 738875568, 739527881, 739891648, 740139484, 740218222, 740267813, 740530252, 740734100, 740749776, 740992725, 741460800, 741692603, 741722882, 741896868, 742226720, 742552936, 742721438, 742787242, 743034363, 743333161, 743405282, 743487418, 743782938, 744113564, 744365156, 744578898, 744751453, 744913995, 745077372, 745166779, 745291829, 745568335, 745822847, 745918453, 745997071, 746186674, 746446788, 746673644, 746784329, 746810615, 746912301, 747152209, 747363448, 747499108, 747663260]
##END=$$ End of the data block
