##TITLE=$$ Begin of the data block
##JCAMP-DX=5.00 $$ ACD/SpecManager v 10.08
##SPECTROMETER/DATA SYSTEM=Alpha
##DATE=22 Dec 2014 10:36:42
##DATA TYPE=INFRARED SPECTRUM
##DATA CLASS=XYDATA
##ORIGIN=
##OWNER=
##NPOINTS=1765
##FIRSTX=399.76428223
##LASTX=3997.64306641
##MAXX=3997.64306641
##MINX=399.76428223
##MAXY=0.86206472
##MINY=0.37183657
##XFACTOR=1.0000000000
##YFACTOR=1.000000000000000e-9
##FIRSTY=0.62487918
##DELTAX=2.03961372
##XUNITS=1/CM
##YUNITS=ARBITRARY UNITS
##XYDATA=(X++(Y..Y))
399.8F24879181j814186l234804l795028l78489L326178K553820m93705n31018J702190
418.1F22214139O74784k943397l413021j066328j32858k634287m410744k137363N98133
436.5F06749058J04129n30600K233684N824148N194545J497328J98722K018810K206206
454.8F25496030j009107l199458j092017M92335j754046m465639l451228p54357j264632
473.2F08997881l772258l227592o7472J013994j123607k050579L46303J993418j03295
491.5F02006793k864957k134681K78891j73033l173172l759325j370311q53419l278315
509.9E84678471m679501l152490j768112l257930n122781l702283n59985L14533j314044
528.3E61435878j335561J631260L951609L250122K437174M284680O059647M003942
$$ plain form
399.8 624879181 623064995 619830191 616035163 615656674 618982852 621536672 621042967 620511949 622214139
418.1 622214139 622888923 619945526 616532505 615466177 615333319 612699032 608288288 606150925 606749058
436.5 606749058 606853187 606322587 608556271 614380419 619574964 621072292 621271014 623289824 625496030
454.8 625496030 624486923 621287465 620195448 620687783 618933737 614468098 611016870 610262513 608997881
473.2 608997881 605225623 601998031 601930559 602944553 601820946 599770367 600116670 602110088 602006793
491.5 602006793 599141836 597007155 597286046 597113013 593939841 590180516 588810205 587956786 584678471
509.9 584678471 579998970 576846480 575078368 571820438 566697657 562995374 562435389 562749922 561435878
528.3 561435878 560100317 561731577 565683186 568933308 571370482 575655162 581714809 585718751
544.6E85718751P5936j106918K64883O4791k698303m354953l032446k026975m005850
562.9E68898916o588399o595910m725337l708660l588319j775265K138138M994571
579.3E49049735N070388M639745N833447O853581N176782K131105Q55386J613498J423180
597.6E82646847n86093j519024N3227J593351P61450n57840M96089K770960L170908
616E88829875J759589J681030L820121N109846L551603J653909K200366L641843K867937
634.3F15116119N65291K01225K077401K686322Q58724k57075J152515K614200J588524
652.7F26603246l13580J2099K045930K270102K61546l57688K034664L763914O33479
671F36953712r40502N99563K839208K547085L92020n3287J602769K170920K09153j602530
$$ plain form
544.6 585718751 585794687 584687769 584952652 585017443 582319140 577964187 574931741 572904766 568898916
562.9 568898916 562310517 555714607 550989270 547280610 543692291 541917026 544055164 549049735
579.3 549049735 554120123 558759868 564593315 571446896 576623678 578754783 579610169 581223667 582646847
597.6 582646847 582060754 580541730 580594957 582188308 582949758 582391918 582888007 585658967 588829875
616 588829875 590589464 592270494 596090615 601200461 604752064 606405973 608606339 612248182 615116119
634.3 615116119 615681410 615882635 617960036 620646358 621505082 621248007 622400522 625014722 626603246
652.7 626603246 626289666 626301765 628347695 630617797 630879343 630521655 632556319 636320233 636953712
671 636953712 636013210 636612773 639451981 641999066 642391086 642337799 643940568 646111488 646320641 644718111
691.4F44718111r02176L07440r71019l461361l657162j617193o10471j433015j273691
709.8F31099463J253068L712535L710985K692521L540039N702615O081938M351974
726.1F62145138L316581M362881N044222L234089R99927J137197K428651J494944j457453
744.5F82706177k915919k029121j839697l851116n435407m386604k483427k331078
760.8F57433808l055275j757264J547039L871441M072725M365921O460250Q461833
777.1F81400478P701754N298019M603207N624831N189657K825439J646697L099978
793.4G17390060M584015L695667K140581K651692M206478L763557J435697L75748J645803
811.8G41889298K418995P79331r81570l84986Q90493p7903k542615l551543k794623
$$ plain form
691.4 644718111 643815935 644123375 643152356 639690995 636033833 634416640 633806169 632373154 631099463
709.8 631099463 632352531 636065066 639776051 642468572 646008611 651711226 657793164 662145138
726.1 662145138 665461719 669824600 674868822 678102911 679102838 680240035 682668686 684163630 682706177
744.5 682706177 679790258 677761137 675921440 672070324 666634917 662248313 659764886 657433808
760.8 657433808 654378533 652621269 654168308 658039749 662112474 666478395 672938645 681400478
777.1 681400478 689102232 694400251 699003458 704628289 709817946 712643385 714290082 717390060
793.4 717390060 721974075 725669742 727810323 730462015 734668493 738432050 739867747 740243495 741889298
811.8 741889298 744308293 745087624 744106054 743721068 744611561 744533658 741991043 738439500 735644877
830.1G35644877k800405m525065n641103m448533k889276l239810m343987l810584
846.4G03946114k140880j868427l391385m466593l767193k392411j248002P58588M519165
864.8F89948976Q396387R945214R032011P677793O948710N472243K082228j525938
881.1G37977624l036499l184259m222512n967438o279231m824161l764749m328310
897.4G02370465n053759m500329l833175m811525o747485p697045p454038p626832
913.7F54646277q698642q932829p129848m467547k822578k200842j127004O56247J840055
932.1F21763289J893997K073646L306746M482925L990233J790404q94248l590643o902039
950.5F27914310j0462642j2722492j3326705j3729632j4924228j6155601j6516625
$$ plain form
830.1 735644877 732844472 728319407 722678304 718229771 715340495 712100685 707756698 703946114
846.4 703946114 701805234 699936807 696545422 692078829 688311636 685919225 684671223 685429811 689948976
864.8 689948976 698345363 708290577 717322588 725000381 731949091 737421334 739503562 737977624
881.1 737977624 734941125 731756866 727534354 721566916 715287685 710463524 706698775 702370465
897.4 702370465 697316706 692816377 688983202 684171677 677424192 669727147 662273109 654646277
913.7 654646277 645947635 637014806 629884958 625417411 622594833 620393991 619266987 619923234 621763289
932.1 621763289 623657286 625730932 629037678 633520603 637510836 639301240 638406992 634816349 627914310
950.5 627914310 617451668 604729176 591402471 577672839 562748611 546593010 530076385
964.7E30076385j6488553j6999989j7852277j8054783j7237991j5992284j4803201
979D12647307j3158709j0464698p335544m854887l182561j694887j19448J034230J349985
997.4C74220788J274378J377433J479119J034379J19358n12272m61071j00196J59621
1015.7C78591537N12779J307875K334088K968908L138810L360778L755003L822238
1032C99792016L165930K176702J536608J299500J005948O54667P95812J628518K722204
1050.4D14777905L688365M690230O019562P444382Q422107Q996576R268939Q004993
1066.7D71313059L441066l650069r231717j0090649p230401l744960j099944J031250
1083D40737635K926677M194230M682750M999757N541533N689859M703730K976478J611948
$$ plain form
964.7 530076385 513587832 496587843 478735566 460680783 443442792 427450508 412647307
979 412647307 399488598 389023900 381688356 376833469 373650908 371956021 371836573 372870803 374220788
997.4 374220788 375495166 376872599 378351718 379386097 379505455 378993183 378532112 378431916 378591537
1015.7 378591537 379104316 380412191 382746279 385715187 388853997 392214775 395969778 399792016
1032 399792016 402957946 405134648 406671256 407970756 408976704 409631371 410427183 412055701 414777905
1050.4 414777905 418466270 423156500 429176062 436620444 445042551 454039127 463308066 471313059
1066.7 471313059 474754125 471104056 461872339 451781690 444551289 440806329 439706385 440737635
1083 440737635 443664312 447858542 452541292 457541049 463082582 468772441 473476171 476452649 478064597
1101.4D78064597J118868J142144J439214K238214L417850M155636L834754K897709
1117.7D98308986K262384K110720J954496J862883K475560L764510M533768L624260
1134E20897567J304686j292646l589749n673349p275164p682860o839633n591243m571706
1152.4D79685903l533125k025903l08930J002043K014309L424496N420446P353306
1168.7D93032545Q655697R585023J0649025J1614323J1857390J1435867J1017203J0823429
1185E78670502J0179817Q592427O659210N212963M188776L010511J795769J360893
1201.3F19670868J831829K335847K396285K593637L484309M477501M571676L841400
1217.7F45203352L168583K751827J925111N10633o38247q65876p63595j133562j639902
$$ plain form
1101.4 478064597 479183465 480325609 481764823 484003037 487420887 491576523 495411277 498308986
1117.7 498308986 500571370 502682090 504636586 506499469 508975029 512739539 517273307 520897567
1134 520897567 522202253 520909607 517319858 511646509 504371345 496688485 489848852 484257609 479685903
1152.4 479685903 476152778 474126875 473817945 474819988 476834297 480258793 485679239 493032545
1168.7 493032545 501688242 511273265 521922290 533536613 545394003 556829870 567847073 578670502
1185 578670502 588850319 597442746 604101956 609314919 613503695 616514206 618309975 619670868
1201.3 619670868 621502697 623838544 626234829 628828466 632312775 636790276 641361952 645203352
1217.7 645203352 648371935 651123762 653048873 653559506 652921259 652055383 651291788 650158226 648518324
1236F48518324j492262p72476k53916j51932J75595J074076J868963J862705J427650
1254.4F52256727J324237J489997J289606P13408N97775J340389K086699J937866J273036
1272.7F64309740R38356Q67963L71575n02825q67009m99844k48611o67990j203060
1291.1F62498295j187384r63867j242220j841247j932025j397610j079082j423299
1307.4F51431561j700819j282632p03812p27117j196027j414239j371682j885891l158390
1325.8F37990952m265845m470766m093766l760398l388702k500713j167715j69873
1342.1F14173174M3571m77J90079K96772j27971p77960r56297p25865q02160j275956
1362.5F10036910j271487o62386j93000n2452j2040L34382Q48234Q68439M30584N35548
$$ plain form
1236 648518324 647026062 646253586 645999670 645847738 646023333 647097409 648966372 650829077 652256727
1254.4 652256727 653580964 655070961 656360567 657073975 657671750 659012139 661098838 663036704 664309740
1272.7 664309740 665248096 666116059 666487634 665984809 665117800 664617956 664369345 663701355 662498295
1291.1 662498295 661310911 660347044 659104824 657263577 655331552 653933942 652854860 651431561
1307.4 651431561 649730742 648448110 647744298 647017181 645821154 644406915 643035233 641149342 637990952
1325.8 637990952 633725107 629254341 625160575 621400177 618011475 615510762 614343047 614173174
1342.1 614173174 614216745 614216268 614406347 614703119 614575148 613797188 612840891 612115026 611312866 610036910
1362.5 610036910 608765423 608103037 607910037 607857585 607845545 608179927 609028161 609896600 610327184 610862732
1382.9F10862732J840174L506482L752172K617001J687289J076698K52306p41422j148164
1401.2F23705268j018286j099408j434147j734793j675904j244783r68933j148463
1417.5F13380551j108765k04027M62115N09739M91857Q24571J357079J484930J304090
1435.9F18502140J389921J694679J771688J304627N79059R3758j39654n09738j076580
1454.3F23609900j980423j962245k93016N59449J183331K458036L711641M920244O801665
1472.6F39008582P660210P218003O704032O111324N607486N191267N118608N091012
1488.9F87710524M603922L797173L609241L809511L343821K728045K496779K591669
1505.2G14690685K754689K236187J924336K040148J999795J742602J433014J462341
$$ plain form
1382.9 610862732 612702906 616209388 619961560 622578561 624265850 625342548 625594854 624853432 623705268
1401.2 623705268 622686982 621587574 620153427 618418634 616742730 615497947 614529014 613380551
1417.5 613380551 612271786 612067759 612529874 613039613 613531470 614356041 615713120 617198050 618502140
1435.9 618502140 619892061 621586740 623358428 624663055 625242114 625335872 625196218 624686480 623609900
1454.3 623609900 621629477 619667232 619374216 619933665 621116996 623575032 627286673 632206917 639008582
1472.6 639008582 646668792 653886795 660590827 666702151 672309637 677500904 682619512 687710524
1488.9 687710524 692314446 696111619 699720860 703530371 706874192 709602237 712099016 714690685
1505.2 714690685 717445374 719681561 721605897 723646045 725645840 727388442 728821456 730283797
1521.6G30283797J669526J444816J074672R89855J084864J020491Q31485M91738M3631
1539.9G38934875J38103L25740J26302N5969J35243Q7023j95206m83155j094043j089215
1560.3G36941636j98841m14610o67930o53625p11917n99385r08494j397609q81970
1578.7G30507255o51837j174986j438975j322568j397014j846611k167106k111852
1595G18396306k007842k278805k793133k971590k813637k907157l433764l656566l329694
1613.4F92204118l617048m366339l400981k693057l009618k875804k831817k730787
1629.7F66678667j810312j227558j455128r19521P8976O64711R66251J129866J600206
1648F65706158J933515K404213L426909L113389K899051L391266L964722L905833L372550
$$ plain form
1521.6 730283797 731953323 733398139 734472811 735462666 736547530 737568021 738399506 738891244 738934875
1539.9 738934875 739072978 739398718 739525020 739580989 739716232 739803255 739608049 739124894 738030851 736941636
1560.3 736941636 736742795 736328185 735660255 735006630 734294713 733695328 732786834 731389225 730507255
1578.7 730507255 729855418 728680432 727241457 725918889 724521875 722675264 720508158 718396306
1595 718396306 716388464 714109659 711316526 708344936 705531299 702624142 699190378 695533812 692204118
1613.4 692204118 688587070 684220731 680819750 678126693 675117075 672241271 669409454 666678667
1629.7 666678667 664868355 663640797 662185669 661266148 661345124 662009835 662976086 664105952 665706158
1648 665706158 667639673 670043886 673470795 676584184 679483235 682874501 686839223 690745056 694117606
1666.4F94117606L698110M466057M064441L777444M095257M072904L822982L644288
1682.7G25759089M103422M103482L721476L529489K922892K716422K870679K580106
1699G52307057K304435J975537J834213J954377J728952J401007J419544J651526J760185
1717.4G68336833J636207J582861J792430K022684J795113J463473J397431J616955
1733.7G81643987J787007J469075J286447J598597J904964J757682J484036J605272
1750G94537067K045036J952827J484990J347065J524687J598596J365364J037001R57668
1768.4H07850301J045823R25184P65562Q01801R53198J010120P74205N11109O72102
1786.7H15309405R61840P18773K98858M82440Q39233Q20756N36263M42743O55174Q20160
$$ plain form
1666.4 694117606 697815716 702281773 706346214 710123658 714218915 718291819 722114801 725759089
1682.7 725759089 729862511 733965993 737687469 741216958 744139850 746856272 749726951 752307057
1699 752307057 754611492 756587029 758421242 760375619 762104571 763505578 764925122 766576648 768336833
1717.4 768336833 769973040 771555901 773348331 775371015 777166128 778629601 780027032 781643987
1733.7 781643987 783430994 784900069 786186516 787785113 789690077 791447759 792931795 794537067
1750 794537067 796582103 798534930 800019920 801366985 802891672 804490268 805855632 806892633 807850301
1768.4 807850301 808896124 809821308 810586870 811388671 812341869 813351989 814126194 814637303 815309405
1786.7 815309405 816271245 816990018 817288876 817771316 818610549 819431305 819967568 820410311 821065485 821885645
1807.1H21885645O41823L14415L37958O37054P27177N45919L73602L79205N13077M58419
1827.5H26814294J47819K19226O02484N85556K96235J96278K45512J66595J28686J53303
1847.9H29555988J82093L30805L59595J74940L9994J59860L23296K66254Q165j52468
1868.3H31248522J48177M37736K79010Q8036J81556L20375K83539J77979J85013K27750
1888.7H33577693K58147K26498J00136J35123K61426K02358M3750K9147J34289J45972
1909.1H35114539O0618M1544R7275R3639P4863N2810M6730J61648K05278J00315L3378
1931.5H36082637N6625Q1598Q7679O0499m769O0439J88709J49905Q5891J25944J62661
1954H37137818J27614Q0287R3222J60575J75953Q6725L2067Q4758J29044R1731L8266
$$ plain form
1807.1 821885645 822527468 822841883 823179841 823816895 824544072 825089991 825463593 825842798 826355875 826814294
1827.5 826814294 826962113 827181339 827783823 828369379 828665614 828861892 829107404 829273999 829402685 829555988
1847.9 829555988 829738081 830068886 830428481 830603421 830643415 830803275 831126571 831392825 831400990 831248522
1868.3 831248522 831396699 831834435 832113445 832201481 832383037 832703412 832986951 833164930 833349943 833577693
1888.7 833577693 833835840 834062338 834162474 834297597 834559023 834761381 834805131 834834278 834968567 835114539
1909.1 835114539 835175157 835216701 835313976 835407615 835482478 835535288 835582018 835743666 835948944 836049259 836082637
1931.5 836082637 836139262 836220860 836308539 836369038 836364269 836424708 836613417 836763322 836849213 836975157 837137818
1954 837137818 837265432 837345719 837438941 837599516 837775469 837862194 837894261 837979019 838108063 838199794 838238060
1976.4H38238060M4942R0242J11043P2897J5080k0683j3054K1518M1187O258l1471
1998.8H38576019J2457K7418q8155j83999j40429q7857j30654k46346l52502l63707
2019.2H37022245m06265o47605o74128j05799L09170P0631k47836k86639j96695j68979
2039.6H34668100k40624k80082k00868j11103j01805j33335r9004J3471M5657l8385
2060H33522022p1049L8624J60575J19507j9789r894J34885J52827J6927j5437J15096
2082.5H34144294J71185R8169K2709N0247J81138K07544P4207M0412J63556K20835
2102.9H35374296J47342O9023Q4459J68741J85609P7307J9014J02103J44481L3319
2123.3H36405694o3717J3948J32680J08301j967j9371O7115J05798L2186k7537N1081
$$ plain form
1976.4 838238060 838283002 838373244 838484287 838557184 838572264 838551581 838538527 838560045 838601232 838607490 838576019
1998.8 838576019 838588476 838615894 838527739 838343740 838203311 838115454 837984800 837738454 837385952 837022245
2019.2 837022245 836615980 835968375 835294247 835188448 835497618 835568249 835320413 835033774 834837079 834668100
2039.6 834668100 834427476 834147394 833946526 833835423 833733618 833600283 833501279 833514750 833560407 833522022
2060 833522022 833450973 833489597 833650172 833769679 833749890 833739996 833874881 834027708 834044635 834029198 834144294
2082.5 834144294 834315479 834413648 834436357 834486604 834667742 834875286 834949493 834989905 835153461 835374296
2102.9 835374296 835521638 835590661 835675120 835843861 836029470 836106777 836125791 836227894 836372375 836405694
2123.3 836405694 836341977 836355925 836488605 836596906 836594939 836575568 836642683 836748481 836780667 836753130 836804211
2145.7H36804211J53959J19865L0517M8042J50800J80721J31905J65164K65420K85506
2166.1H38336110K38180K49923L58343M37617L93271L06130K83539L35515L92556L78311
2186.5H41709495L12984K85089L00705L01659K74420K69413L11375L45230L16620K77519
2206.9H44704509K95281L21567L01123K69771K71856K95401L02732K71797K20358K11061
2227.3H47465456K29477K21610K10643K16604K15888J95622J64032J27733J27077J67429
2247.7H49341571J77801J63198J63733J67311J71184J81556J86741J61529J32263J53362
2268.1H51000249J98901K11120J74999J37985J43170J36137J29342J85073K27928K21133
2288.5H52766037K07424K04683K41219K91706K82764J98424J69754L23951M92275M67181
$$ plain form
2145.7 836804211 836958170 837078035 837108552 837156594 837307394 837488115 837620020 837785184 838050604 838336110
2166.1 838336110 838574290 838824213 839182556 839620173 840013444 840319574 840603113 840938628 841331184 841709495
2186.5 841709495 842022479 842307568 842608273 842909932 843184352 843453765 843765140 844110370 844426990 844704509
2206.9 844704509 844999790 845321357 845622480 845892251 846164107 846459508 846762240 847034037 847254395 847465456
2227.3 847465456 847694933 847916543 848127186 848343790 848559678 848755300 848919332 849047065 849174142 849341571
2247.7 849341571 849519372 849682570 849846303 850013614 850184798 850366354 850553095 850714624 850846887 851000249
2268.1 851000249 851199150 851410270 851585269 851723254 851866424 852002561 852131903 852316976 852544904 852766037
2288.5 852766037 852973461 853178144 853419363 853711069 853993833 854192257 854362011 854685962 855178237 855645418
2308.9H55645418L64781L51488M01914M95732O25610N97001L75807K88606L66866L48568
2329.3H59861791J78039K3782k3067n0127j4007R835m05908j035392p21336L25680
2349.7H58149290J100242J214624Q82804N25534J92225k30610p45177j048923j046360
2368H58993649j060605j187086j233220j118600r38475q00133o83606n41389l83436
2386.4H51047099k39134j64867j47700j23322j38104j68860j57118j65403j85728j82748
2406.8H49374115k05814k43724k59518k78891k97129k94983k95699l29613l67165l57687
2427.2H46443892l47734l87430m20392m06205l84868l76164l64304l73662l92496l90649
2447.6H42599988m30644m66287m11749l35753l19182l67761m05490l73304l29733l40283
$$ plain form
2308.9 855645418 856010199 856361687 856763601 857259333 857884943 858481944 858857751 859146357 859513223 859861791
2329.3 859861791 860039830 860063612 860040545 859990418 859976411 859986246 859580338 858544946 857823610 858149290
2349.7 858149290 859249532 860464156 861346960 861872494 862064719 861834109 861088932 860040009 858993649
2368 858993649 857933044 856745958 855512738 854394138 853455663 852655530 851971924 851430535 851047099
2386.4 851047099 850807965 850643098 850495398 850372076 850233972 850065112 849907994 849742591 849556863 849374115
2406.8 849374115 849168301 848924577 848665059 848386168 848089039 847794056 847498357 847168744 846801579 846443892
2427.2 846443892 846096158 845708728 845288336 844882131 844497263 844121099 843756795 843383133 842990637 842599988
2447.6 842599988 842169344 841703057 841291308 840955555 840636373 840268612 839863122 839489818 839160085 838819802
2467.9H38819802l80635l81232l31044l01897l13461l18945l15130l19838l37482l33845
2488.3H35486293k55406j66297j93536k91884k74480j52230j43289k67864l19719j95742
2508.7H33225846n9843j35839l37064l62635j86205j27256l05414m26411l23236k15292
2529.1H30746651l21925n13375m97341l19123l28183n32866n88179m19139k99395m07099
2549.5H26520026n63741n04136l14117l14891n17905o00159m28140k56658l53455n41508
2569.9H22125316m85182k93672l02375n04076n64456l53515j94788l24547m75348l74376
2590.3H18252981j91927k29597m29213m36485k08557j15037l03805m77612m23729l29733
2610.7H15107286m44531o72937o94036m82500m09126o35863q45849p72774o23703p17581
$$ plain form
2467.9 838819802 838439167 838057935 837726891 837424994 837111533 836792588 836477458 836157620 835820138 835486293
2488.3 835486293 835230887 835064590 834871054 834579170 834304690 834152460 834009171 833741307 833421588 833225846
2508.7 833225846 833166003 833030164 832693100 832330465 832144260 832017004 831711590 831285179 830961943 830746651
2529.1 830746651 830424726 829911351 829414010 829094887 828766704 828233838 827645659 827226520 826927125 826520026
2549.5 826520026 825956285 825452149 825138032 824823141 824305236 823705077 823276937 823020279 822666824 822125316
2569.9 822125316 821640134 821346462 821044087 820540011 819975555 819622040 819427252 819102705 818627357 818252981
2590.3 818252981 818061054 817831457 817402244 816965759 816757202 816642165 816338360 815860748 815437019 815107286
2610.7 815107286 814662755 813989818 813295782 812813282 812404156 811768293 810922444 810149670 809525967 808808386
2631.1H08808386r41097r47476p19309o17683q36670j034439r07659p02322p48992
2649.5H01352739r47773r55761p33554o34491p98822r31263q13603o25015o67512q68499
2669.9G93376446q55327o03557m91917o65843q11279o69897m83214n93722q33035p99596
2690.3G86569059n48661n09381p49350q81493p42137o22273p84635j028717r74238
2708.6G79728174o96838o24239q38101r38058p25865n42999o81698q93354p72119m61638
2729G72553265m27484o85811p91669n65231l76642n24938p58588o61195l58343l44038
2749.4G67059326o26862p10964m50194k68161m16756o23345n31197k70307l01480o07908
2769.8G62252152o96659m64559l82602o62327q81552p29561n19812o33896r39011j059533
$$ plain form
2631.1 808808386 807867289 806919813 806200504 805582821 804746151 803711712 802804053 802101731 801352739
2649.5 801352739 800404966 799449205 798715651 798081160 797282338 796351075 795537472 794912457 794244945 793376446
2669.9 793376446 792521119 791917562 791425645 790759802 789948523 789278626 788795412 788201690 787368655 786569059
2690.3 786569059 786020398 785511017 784761667 783880174 783138037 782515764 781731129 780702412 779728174
2708.6 779728174 779031336 778407097 777568996 776630938 775905073 775362074 774680376 773787022 773014903 772553265
2729 772553265 772125781 771439970 770648301 770083070 769706428 769181490 768422902 767761707 767403364 767059326
2749.4 767059326 766432464 765721500 765271306 765003145 764586389 763963044 763431847 763161540 762860060 762252152
2769.8 762252152 761555493 761090934 760708332 760046005 759164453 758434892 757915080 757281184 756342173 755282640
2790.2G55282640r32574q44419j004398j221895j208961j085579j183689j444459j496196
2808.6G44860470j342117j349450j600086j785457j686514j517415j607656j877547
2824.9G32094228j984477j884997j877129k113521k336323k281010k219916k505719
2841.2G14891136k924145l067910k959907k961755l053606k846300k352596j995980
2857.5F92728937k080560k490997k872110l158033l556072m022122m251659m235983
2873.8F66061401m239082m240453m018188l502965k822458k240599j846909j419187
2890.1F41731560q82685m99010m75824o69420p56859p33972q77738j252413j603901
2908.5F33979738j796663k072334k612830l152251l313422l117144k795458k427936
$$ plain form
2790.2 755282640 754350066 753505647 752501249 751279354 750070393 748984814 747801125 746356666 744860470
2808.6 744860470 743518353 742168903 740568817 738783360 737096846 735579431 733971775 732094228
2824.9 732094228 730109751 728224754 726347625 724234104 721897781 719616771 717396855 714891136
2841.2 714891136 711966991 708899081 705939174 702977419 699923813 697077513 694724917 692728937
2857.5 692728937 690648377 688157380 685285270 682127237 678571165 674549043 670297384 666061401
2873.8 666061401 661822319 657581866 653563678 650060713 647238255 644997656 643150747 641731560
2890.1 641731560 640848875 640349865 639874041 639204621 638447762 637713790 636836052 635583639 633979738
2908.5 633979738 632183075 630110741 627497911 624345660 621032238 617915094 615119636 612691700
2924.8F12691700j875400j032233j30117O68406J470864K350152L266275L992795M319668
2943.2F25722110M418075M544914M684866M685223M535913M482269M601300M584253
2959.5F62258923M242957L852129L714323L624677L315628L019571K995491L098548
2975.8F90122247L091216K867043K549827K394021K348065K137005J791120J536906
2992.1G08837450J379966J189649Q23439M01735K59161K18570n1975l27110l92318
3010.5G12338567m81606q16405j244843j460850j420677j368939j542986j824319j848877
3028.8G00329065j692950j714945j953244k136648k009034j841009k026737k346575
3045.1F84607923k379298k156139k121508k341687k416313k333403k322435k360880
$$ plain form
2924.8 612691700 610816300 609784067 609653950 610322356 611793220 614143372 617409647 621402442 625722110
2943.2 625722110 630140185 634685099 639369965 644055188 648591101 653073370 657674670 662258923
2959.5 662258923 666501880 670354009 674068332 677693009 681008637 684028208 687023699 690122247
2975.8 690122247 693213463 696080506 698630333 701024354 703372419 705509424 707300544 708837450
2992.1 708837450 710217416 711407065 712230504 712632239 712891400 713109970 713057995 712730885 712338567
3010.5 712338567 711856961 711040556 709795713 708334863 706914186 705545247 704002261 702177942 700329065
3028.8 700329065 698636115 696921170 694967926 692831278 690822244 688981235 686954498 684607923
3045.1 684607923 682228625 680072486 677950978 675609291 673192978 670859575 668537140 666176260
3061.5F66176260k330244k213895k231062k461433k599955k450585k137304j996040
3077.8F47755742k232969k486706k449572k393901k437115k492129k543331k462387
3094.1F28257632k310633k268792k366006k471805k383291k206207k236902k410770
3110.4F09603226k297461j978993j997292k263725k446354k538502k497971k361893
3126.7E91221035k232671k170682k213121k219557k098501k022207k164960k324819
3143E73774517k293230k158463j935601j772463j971662k306402k301693k088666k006888
3161.4E54939449k041817k023399j918375j849830j882196j940608j907885j827300
3177.7E39548039j799762j832783j847744j766622j678884j722932j820087j807750
$$ plain form
3061.5 666176260 663846016 661632121 659401059 656939626 654339671 651889086 649751782 647755742
3077.8 647755742 645522773 643036067 640586495 638192594 635755479 633263350 630720019 628257632
3094.1 628257632 625946999 623678207 621312201 618840396 616457105 614250898 612013996 609603226
3110.4 609603226 607305765 605326772 603329480 601065755 598619401 596080899 593582928 591221035
3126.7 591221035 588988364 586817682 584604561 582385004 580286503 578264296 576099336 573774517
3143 573774517 571481287 569322824 567387223 565614760 563643098 561336696 559035003 556946337 554939449
3161.4 554939449 552897632 550874233 548955858 547106028 545223832 543283224 541375339 539548039
3177.7 539548039 537748277 535915494 534067750 532301128 530622244 528899312 527079225 525271475
3194E25271475j713395j666188j685321j640499j512706j466930j583338j673400j558543
3212.4E10771155j426816j459300j523018j483142j397491j353204j372457j384973
3228.7D99370754j237273j088441j286983j546264j429886j186669j121521j124143
3245D89349574j123279j192272j222968j123667j002729r85920j025677j005292r64642
3263.4D79703128r20146p67202n84363p10935j029462j105248r70960q84175r19938
3281.7D71810699r21637q37356p75904p29441p28876q20487r49800j076162j117766
3300.1D63853270r62854p20501p51793j083612j346797j378089j259923j194239j232952
3318.4D53922510j202822j115650j143395j325012j480221j449049j303315j169115
$$ plain form
3194 525271475 523558080 521891892 520206571 518566072 517053366 515586436 514003098 512329698 510771155
3212.4 510771155 509344339 507885039 506362021 504878879 503481388 502128184 500755727 499370754
3228.7 499370754 498133481 497045040 495758057 494211793 492781907 491595238 490473717 489349574
3245 489349574 488226295 487034023 485811055 484687388 483684659 482698739 481673062 480667770 479703128
3263.4 479703128 478782982 478015780 477431417 476720482 475691020 474585772 473614812 472730637 471810699
3281.7 471810699 470889062 470051706 469275802 468546361 467817485 466996998 466047198 464971036 463853270
3300.1 463853270 462890416 462169915 461418122 460334510 458987713 457609624 456349701 455155462 453922510
3318.4 453922510 452719688 451604038 450460643 449135631 447655410 446206361 444903046 443733931
3334.8D43733931j118869j237631j435131j557499j641780j536399j242221j299738
3351.1D32664663j699806j832544j614303j420975j440614j476437j320630j187623
3367.4D20671731j391291j773149j819700j506686j290292j268297j313776j304597
3383.7D09003943j120895p81804m72933n70685j013726j103073o47605l63231p48515
3402.1D02181476j146704r21845o07163n57542n69433o41882o65367n21689l87788
3420.4C96162063l14832j87337j6570J04487O8903J04785K84314J63525j61380j63078
3440.8C96044880J53780M42028N11766M44024M65274N61446O41465P99746R63956Q64476
3461.2D01892841P79122J061052J280934R81509M71771M12971P91848J199782J258641
$$ plain form
3334.8 443733931 442615062 441377431 439942300 438384801 436743021 435206622 433964401 432664663
3351.1 432664663 430964857 429132313 427518010 426097035 424656421 423179984 421859354 420671731
3367.4 420671731 419280440 417507291 415687591 414180905 412890613 411622316 410308540 409003943
3383.7 409003943 407883048 407101244 406628311 406057626 405043900 403940827 403293222 402929991 402181476
3402.1 402181476 401034772 400112927 399505764 398948222 398378789 397736907 397071540 396549851 396162063
3420.4 396162063 395847231 395659894 395643324 395747811 395816714 395921499 396205813 396369338 396207958 396044880
3440.8 396044880 396198660 396640688 397152454 397596478 398061752 398623198 399264663 400064409 401028365 401892841
3461.2 401892841 402671963 403733015 405013949 405995458 406467229 406880200 407672048 408871830 410130471
3479.6D10130471Q98778P61956J017094J094163J001685J064837J197309J263886J224697
3497.9D19654876J188815J188665J065523R28431R67950J153350J411289J451105J233250
3516.3D30243254J174628J382173J610904J465887J079738J052708J384735J663595
3532.6D41057622J765788J634419J438767J616090J888007J749754J410395J451105
3548.9D54011947J704633J796514J867592K010942K136677K165675K016604J834542
3565.2D69545126K144784K736836K800078K583712K576321K755016L026933L256708
3581.5D91425514L222466K946406K842397L247678L437340L296018L374696L661513
3597.9E17454028L710032L622174L612816L503621L422320L490627L622770L805876
$$ plain form
3479.6 410130471 411029249 411791205 412808299 413902462 414904147 415968984 417166293 418430179 419654876
3497.9 419654876 420843691 422032356 423097879 424026310 424994260 426147610 427558899 429010004 430243254
3516.3 430243254 431417882 432800055 434410959 435876846 436956584 438009292 439394027 441057622
3532.6 441057622 442823410 444457829 445896596 447512686 449400693 451150447 452560842 454011947
3548.9 454011947 455716580 457513094 459380686 461391628 463528305 465693980 467710584 469545126
3565.2 469545126 471689910 474426746 477226824 479810536 482386857 485141873 488168806 491425514
3581.5 491425514 494647980 497594386 500436783 503684461 507121801 510417819 513792515 517454028
3597.9 517454028 521164060 524786234 528399050 531902671 535324991 538815618 542438388 546244264
3614.2E46244264L728509L509521L818095M060745L739774L175319K953290L642798
3630.5E74872315L964662L745437L483832L286183L326774L473043L325403K831340
3646.8F02308989K735078L496289L657222L128529L140986L482401L237128K825320
3663.1F28011942K730548K521813K146125K417564K436936J877666K350211K929628
3679.4F47422433K810717K654731K485931K092540J634538J807094K224147K305925
3695.8F65438056K097368J641453J327157J603782J863003J539170R08196Q68917J682281
3714.1F78969383J959503J585722J214862J115024J149118J255333J452089J251280
3730.4F89952314P57813N64933R76741J570762J470208M78446o0081R11236R03248
$$ plain form
3614.2 546244264 549972773 553482294 557300389 561361134 565100908 568276227 571229517 574872315
3630.5 574872315 578836977 582582414 586066246 589352429 592679203 596152246 599477649 602308989
3646.8 602308989 605044067 608540356 612197578 615326107 618467093 621949494 625186622 628011942
3663.1 628011942 630742490 633264303 635410428 637827992 640264928 642142594 644492805 647422433
3679.4 647422433 650233150 652887881 655373812 657466352 659100890 660907984 663132131 665438056
3695.8 665438056 667535424 669176877 670504034 672107816 673970819 675509989 676418185 677287102 678969383
3714.1 678969383 680928886 682514608 683729470 684844494 685993612 687248945 688701034 689952314
3730.4 689952314 690710127 691275060 692251801 693822563 695292771 695771217 695711136 696622372 697525620
3748.8F97525620K77222J114905J811504J307666P23779R00686J096308Q43287O86943
3767.1G06287920O37949Q26478J150250J042247O90341N07355O38068O46412N48363
3785.5G12975383P48217R91702R92358P28249M62234N31256K70486o1690N92470P73310
3805.9G19003975O61612J090467J108289M72605J12891M60863R8527L1709R16720J048267
3826.3G25005925Q02934N44786M06206N71310L06249j45614K20597P18474R46164J070679
3846.7G30447710R12368Q7917j289070n21481J361251J356363O90997J91331K28524
3865G33465910M07636P5519J28567N75066P30276P37906L37124J97410L92914J60396
3885.4G37208724L15905M73082J46925L42250O79255M18007K9564j30356j18792L05713
$$ plain form
3748.8 697525620 697802842 698917747 700729251 702036917 702760696 703661382 704757690 705600977 706287920
3767.1 706287920 706925869 707752347 708902597 709944844 710635185 711142540 711780608 712427020 712975383
3785.5 712975383 713723600 714715302 715707660 716435909 716898143 717429399 717699885 717638195 718230665 719003975
3805.9 719003975 719665587 720756054 721864343 722336948 722449839 722910702 723009229 723040938 723957658 725005925
3826.3 725005925 725808859 726353645 726759851 727331161 727637410 727491796 727712393 728430867 729377031 730447710
3846.7 730447710 731360078 731447995 730158925 729637444 730998695 732355058 733046055 733237386 733465910
3865 733465910 733873546 733949065 734077632 734652698 735382974 736120880 736458004 736655414 737048328 737208724
3885.4 737208724 737524629 737997711 738144636 738486886 739166141 739584148 739613712 739483356 739364564 739670277
3905.8G39670277P23242O11902L79622L02791J36912N5611K45214K28941N3168K04980
3926.2G42612660L60608J47879O1095L28958M52995K98918P3552K9921K65002L21150
3946.6G44952738J33336J20163K16126K52068K57612K45154K14278J97351J44720K1398
3967G46754944P4208L03507L32773J67191R9539J72437K46048J74105M9889O3360J47402
3989.5G48585403J82033J61588J59263J80900
3997.6G49269187
$$ plain form
3905.8 739670277 740393519 741005421 741385043 741687834 741824746 741880357 742125571 742354512 742407680 742612660
3926.2 742612660 742973268 743121147 743182242 743511200 743964195 744263113 744336665 744366586 744631588 744952738
3946.6 744952738 745086074 745206237 745422363 745674431 745932043 746177197 746391475 746588826 746733546 746754944
3967 746754944 746829152 747132659 747465432 747632623 747732162 747904599 748150647 748324752 748374641 748438001 748585403
3989.5 748585403 748767436 748929024 749088287 749269187
3997.6 749269187
##END=$$ End of the data block
