##TITLE=$$ Begin of the data block
##JCAMP-DX=5.00 $$ ACD/SpecManager v 10.08
##SPECTROMETER/DATA SYSTEM=Alpha
##DATE=26 Dec 2014 10:25:20
##DATA TYPE=INFRARED SPECTRUM
##DATA CLASS=XYDATA
##ORIGIN=
##OWNER=
##NPOINTS=1765
##FIRSTX=399.76428223
##LASTX=3997.64306641
##MAXX=3997.64306641
##MINX=399.76428223
##MAXY=0.82724404
##MINY=0.25416297
##XFACTOR=1.0000000000
##YFACTOR=1.000000000000000e-9
##FIRSTY=0.54711866
##DELTAX=2.03961372
##XUNITS=1/CM
##YUNITS=ARBITRARY UNITS
##XYDATA=(X++(Y..Y))
399.8 547118664 543582559 540295780 537311137 536257565 537713468 540448844 542687535 543196023 542362094
418.1 542362094 541498303 540720284 539283037 536852419 533645034 530283332 527291179 524901509 523477554
436.5 523477554 523338675 524727821 528006732 532869339 538119495 542474031 544846773 545304358 545092404
454.8 545092404 544908702 544672489 543965280 542135715 539075911 535464942 532277048 529592931 526724160
473.2 526724160 523735821 521095455 519303203 518792212 519191146 519489646 519058347 518092275 517078638
491.5 517078638 516383886 515820920 514585316 512224972 509160459 506345212 504247427 502245426 499407649
509.9 499407649 495375276 490595460 485885412 481849045 478417784 475169241 472049892 469668686
526.2 469668686 468921840 469761223 471544743 473892242 476898730 480992794 486355454 492192358 496807724
544.6 496807724 498880297 498535216 496950209 495208591 493534684 491220146 487532437 482478380 476591140
562.9 476591140 470519334 464365035 457997769 451970607 447390825 445501179 447070211 451750278
579.3 451750278 458340675 465403020 472020775 477936447 483027130 487135053 489852190 490786612 490168691
597.6 490168691 489052325 488561958 488911361 489445478 489420593 489060432 489377260 491046309 493970454
616 493970454 497426301 500596941 503364027 506369293 510186970 514475048 518208623 520600021 521718800
634.3 521718800 522590220 524205983 526516676 528601587 529650152 529766202 529947758 531170249 533312738
652.7 533312738 535263538 536011517 535722256 535518169 536378384 538470328 541351140 542840183 542286932
671 542286932 542398095 544129312 547004521 549671471 550992489 551121533 551239729 552220643 553741932
689.4 553741932 554602385 553780675 551323175 548227370 545569181 543481112 541232765 538467944 535897195
707.7 535897195 534868300 536376178 540128529 544725895 549016595 552987158 557452977 563253403
724.1 563253403 570211530 576842010 581721961 584836304 587398171 590583444 594221294 596946716
740.4 596946716 597513378 595925748 593354523 590932190 588654697 585508585 580705166 574768245 569292247
758.7 569292247 565722764 564316273 564208150 564720988 566366255 570304394 577151656 586300850 596026063
777.1 596026063 604538918 611259103 616999209 622828603 628844202 634172976 637909293 640326440
793.4 640326440 642912149 646986544 652516961 658037603 661998987 664250791 665972173 668399394
809.7 668399394 671582818 674273074 675339818 674940109 674231708 674242258 674780250 674391925 671755552
828.1 671755552 667063117 661771655 657177746 653304458 649212241 644226134 638744414 633909523
844.4 633909523 630545914 628326893 625919640 622092426 616797328 611186147 606895328 605540693
860.7 605540693 608070552 614067376 622489333 632990360 645327866 657999039 668499053 674937487
877 674937487 677248478 676766872 674809456 671696305 667018712 660663188 653486729 646980584 642079473
895.4 642079473 638331175 634403527 629348040 623247027 616751015 610157609 602988005 594419122
911.7 594419122 584127128 572873294 562303543 553879082 547945082 543933451 541137099 539353490
928 539353490 539059341 540715694 543971896 547911525 551986337 556440830 561537027 566265523 568371594
946.4 568371594 565983772 558804631 547931790 534989655 521050930 506139755 489830583 472022146
962.7 472022146 453128904 433763236 414217830 394303322 373781621 352917612 332563967
977 332563967 313758701 297329485 283690095 272851437 264680505 259036303 255686790 254239857
993.3 254239857 254162967 254838675 255791992 256786734 257673204 258308947 258540481 258229107 257456124 256665200
1013.7 256665200 256414413 257101983 258757830 261123985 264000058 267302424 270983905 274996549 279090345
1032 279090345 282714248 285345376 286843419 287605464 288251400 289115876 290242374 291713297 293881476
1050.4 293881476 297337472 302497566 309271723 317308933 326425791 336584717 347136825 355972826
1066.7 355972826 359632522 355614722 345304936 333479613 324554503 320055664 319357783 321258307
1083 321258307 324696273 329046488 334224075 340325356 347031593 353487015 358655453 361889243 363392830
1101.4 363392830 364102542 365125805 367196888 370336920 374119014 378193319 382357210 386297107
1117.7 386297107 389550745 391851544 393480688 395319968 398383290 403041571 408424020 412735909
1134 412735909 414353609 412594378 407775819 400777251 392572641 383980781 375672758 368340641 362674177
1152.4 362674177 358984083 357061356 356570363 357429445 359914333 364522696 371614665 381058484 392298281
1170.7 392298281 404726654 417968959 431843340 446158856 460516155 474286705 486886322
1185 486886322 497986466 507521629 515509784 521857142 526390433 529171526 530787468 532165945
1201.3 532165945 534016967 536520422 539520741 542926192 546870172 551541865 556883335 562296391
1217.7 562296391 566795468 569651186 570825279 570843339 570298493 569408059 568037808 566101074 563856840
1236 563856840 561817825 560451031 559908509 560005724 560550451 561555266 563130915 565268815 567670465
1254.4 567670465 569788754 571191132 571958542 572614670 573753774 575648606 577994347 580169380 581733048
1272.7 581733048 582627654 583026290 583035171 582610846 581762552 580671906 579603553 578732669 577941358 576830029
1293.1 576830029 575100005 572858214 570507944 568431199 566710472 565056086 563207448 561336339
1309.4 561336339 559750319 558533192 557555318 556509793 555058718 552956700 549987316 546021402
1325.8 546021402 541202664 535905004 530566037 525638878 521551788 518649280 517206669 517047346
1342.1 517047346 517429829 517806172 517996371 517953932 517674208 517081201 516130626 514877677 513389230
1360.4 513389230 511940777 511082590 510666430 510265410 510038435 510165513 510778129 511847317 512949586
1378.8 512949586 513890743 515056670 517107487 520545661 524737418 528174758 530215979 530857265 530518234
1397.1 530518234 529636264 528606534 527317166 525431871 523324966 521185637 518998623 517117202
1413.5 517117202 515635431 514158249 512886465 512603104 513060331 513975441 515202761 516559601 518116355
1431.8 518116355 519780338 521612346 523954511 526359558 528478146 530146420 531182349 531552196
1448.1 531552196 531396091 530779958 529608071 527264774 525004148 525165856 526494503 528646708 532150328
1466.5 532150328 536732018 542670310 551443696 561612785 570781529 578947604 586520970 593737960
1482.8 593737960 600168943 606009543 611978650 618123293 623209774 627384901 631641030 635951400
1499.1 635951400 639751136 642719507 644978404 647642493 650989652 653913677 656290591 658198953
1515.4 658198953 660007894 661681473 663350999 665263951 667004526 668579757 669928789 670746386
1531.8 670746386 671204984 671837449 672107399 671450973 670947850 671110630 671286106 671130061 670548081 669745147
1552.2 669745147 668727696 667337358 664754450 662463725 662076652 661357045 659937322 657989979 655937016
1570.5 655937016 654726863 653430104 651385367 649918199 648869336 647531092 646101117 644702852
1586.8 644702852 643271148 641703486 639965117 638135970 636391103 634664237 632664204 630321860
1603.2 630321860 627751231 625015974 622194290 619565725 617073357 613817513 609770656 607019722
1619.5 607019722 604843795 602082908 599525273 597149551 594788432 592943370 591051221 588546336
1635.8 588546336 587154865 586904407 586720288 586452067 586204946 586937904 588447034 589700878 591656387
1654.1 591656387 594598114 597531855 600547314 603997886 607820272 611253977 614726067 619159222
1670.5 619159222 623793900 628610969 633784950 638320744 642221987 646368325 652245104 658064604
1686.8 658064604 662741542 667194307 670987666 674507499 678296626 681985140 685929954 689192951
1703.1 689192951 691667438 694263220 696914971 699271739 701144159 702594280 704422176 707096696
1719.4 707096696 709750175 712100267 714223742 715894997 717197120 718360841 719892621 722142696
1735.7 722142696 724096179 725615144 727207601 729123235 731319189 733673692 736299932 739175260
1752 739175260 741696715 743914008 746216655 748427212 750527799 752414048 753810346 754916608 756056726
1770.4 756056726 757487416 759166896 760531843 761461318 762316525 763405859 764660597 765843332 766620696
1788.8 766620696 766955018 767566800 768788755 770038784 770954072 771624744 772370458 773215890 774039805
1807.1 774039805 774845421 775688112 776485980 777104020 777632773 778318405 779067397 779611528 779989958 780252337
1827.5 780252337 780513883 781217456 782167435 782854378 783239007 783426285 783448637 783533990 784084201 784799159
1847.9 784799159 785243392 785420537 785515606 785753191 786157846 786547303 786731303 786688209 786500812 786488771
1868.3 786488771 787060678 787822247 788228989 788324356 788437605 788759291 789247870 789710641 789967299 790021122
1888.7 790021122 790189385 790610611 791065454 791457355 791708350 791773021 791804969 791966677 792188883 792355001
1909.1 792355001 792472601 792531252 792532265 792603791 792864680 793084800 793143928 793241918 793415725 793613076 793832362
1931.5 793832362 794028282 794121027 794111371 794074655 794119656 794356465 794671357 794870853 794976234 795100927
1951.9 795100927 795308590 795586526 795823514 795933485 795992255 796113670 796289027 796523333 796783686 796941996
1972.3 796941996 797019184 797125280 797273874 797421336 797544062 797590196 797529161 797434330 797400355 797495008 797672033
1994.8 797672033 797763586 797730505 797690749 797703028 797697186 797580600 797345519 797047675 796753109 796469212 796167970
2017.2 796167970 795812726 795310438 794594884 793921649 793707550 793773055 793638885 793267548 792827427 792402565
2037.6 792402565 792027295 791725993 791491151 791266441 791020632 790792048 790624082 790524185 790471137 790446579
2058 790446579 790424287 790381789 790385485 790489435 790611863 790640652 790593088 790571988 790620089 790676177 790682852 790669203
2082.5 790669203 790664077 790662646 790695369 790792167 790919721 791048110 791164637 791259289 791347265 791458011 791597843
2104.9 791597843 791750848 791869521 791915476 791953266 792038560 792135656 792198420 792206645 792144239 792061210 792060852 792114735
2129.4 792114735 792120039 792087972 792090356 792130351 792175651 792221844 792264521 792278230 792257845 792245269 792278588 792364955
2153.9 792364955 792517543 792725503 792915702 793063939 793253183 793554068 793953896 794410586 794857800 795236588
2174.3 795236588 795588851 795987725 796447396 796926975 797376990 797746718 798048496 798398197 798829854 799275219
2194.6 799275219 799685955 800017416 800270557 800551534 800951540 801419139 801837623 802167952 802452862 802774370
2215 802774370 803200722 803663194 804004610 804200113 804368794 804622531 804993629 805399597 805708766 805880666
2235.4 805880666 805993378 806161940 806437671 806784987 807097197 807270885 807334661 807443678 807712197 808070302
2255.8 808070302 808350682 808493912 808569133 808711529 809025288 809428811 809750497 809905410 809925079 809962928
2276.2 809962928 810155332 810467303 810744286 810907543 811028957 811241031 811653435 812221587 812724352 812998414
2296.6 812998414 813132167 813345909 813801467 814525127 815350831 816034973 816506505 816936076 817547500 818430841
2317 818430841 819466770 820360243 820944309 821430922 822116792 822957397 823555231 823651910 823521972 823570728
2337.4 823570728 823866069 824056625 823485732 821741462 820000947 819793344 821319222 823723197 825837731
2355.8 825837731 827044964 827244043 826761782 825882137 824542642 822738349 820608735 818306446 816145182
2374.1 816145182 814395070 812959671 811606288 810303092 809189498 808432341 808074176 807984531 807953417
2392.5 807953417 807768881 807386577 806976974 806711733 806625187 806573272 806349874 805907190 805407643 805060446
2412.9 805060446 804879844 804668844 804242849 803620875 802992523 802501917 802140951 801807404 801360190 800729036
2433.3 800729036 800053477 799526989 799126387 798704863 798160911 797482073 796781123 796200097 795766950 795373797
2453.7 795373797 794875860 794222295 793560207 793052614 792661667 792260468 791767597 791194856 790623367 790138960
2474.1 790138960 789766014 789403081 788925231 788357854 787829220 787400246 787062705 786771417 786446393 786057532
2494.5 786057532 785647869 785302758 785079539 784913480 784676135 784309089 783919692 783651471 783462703 783214271
2514.9 783214271 782855690 782414556 781948090 781529784 781154573 780748427 780252635 779667318 779064178 778504729
2535.3 778504729 778012276 777523994 776920259 776196480 775470555 774837613 774295747 773782790 773218274 772582591
2555.6 772582591 771954536 771417558 770930707 770389140 769798517 769215524 768640399 768057287 767485559 766947806
2576 766947806 766416192 765866399 765341461 764865756 764392138 763933063 763532281 763116121 762649417 762237489
2596.4 762237489 761909008 761556089 761122763 760637105 760117948 759586871 759040356 758427858 757723033 756936371
2616.8 756936371 756111085 755289733 754443765 753536761 752588689 751589537 750508010 749392867 748304784
2635.2 748304784 747227311 746129394 744993508 743813634 742642581 741524994 740437329 739338636
2651.5 739338636 738219261 737095892 735978544 734912992 733904302 732869387 731812000 730788112
2667.8 730788112 729785383 728812575 727902532 727027535 726133645 725207150 724297345 723447204 722625852
2686.2 722625852 721767306 720856607 719932020 719006419 718081713 717158854 716189206 715142071 714047909
2704.5 714047909 712957144 711912334 710895240 709850550 708779275 707745016 706792712 705936074 705131650
2722.9 705131650 704267979 703324497 702383161 701518774 700777292 700136423 699491978 698763847 697991908 697237134
2743.3 697237134 696519673 695856810 695228457 694575369 693878651 693199158 692597449 692049861 691503346 690938532
2763.7 690938532 690348327 689736605 689134955 688561976 687930882 687141418 686253488 685382068 684527755 683622122
2784.1 683622122 682632506 681557000 680399120 679195583 677988827 676743746 675393641 673936427
2800.4 673936427 672381103 670732021 669044137 667369425 665680349 663878143 661924839 659891427
2816.7 659891427 657846034 655785978 653652430 651408672 649068356 646658301 644190490 641672134
2833 641672134 639083683 636350691 633391857 630184174 626790106 623237014 619489253 615644455 611995220
2851.4 611995220 608798802 606082499 603694439 601359725 598773062 595748067 592235625 588251710
2867.7 588251710 583885670 579240859 574335217 569268227 564288974 559646785 555544615 552100420
2884 552100420 549318254 547172844 545640111 544593453 543828368 543164253 542446613 541594326 540593684
2902.4 540593684 539412081 537965834 536161721 533939302 531230092 527989209 524344742 520558417
2918.7 520558417 516820431 513346791 510408580 508161187 506741703 506283104 506902218 508704901 511649191
2937 511649191 515552461 520183742 525298178 530647457 536039591 541433096 546876967 552340984 557729304
2955.4 557729304 563008189 568204165 573269486 578016043 582329214 586274147 589940846 593433619
2971.7 593433619 596848488 600183070 603447556 606617808 609518111 612078190 614398479 616528809
2988 616528809 618471324 620123446 621361911 622288764 623002231 623481274 623718321 623660505 623283207 622717500
3008.4 622717500 622066438 621197999 619976997 618453503 616730511 614891827 613007247 611061275 608987510
3026.8 608987510 606831610 604638457 602395594 600058615 597604156 595174491 592786849 590261519
3043.1 590261519 587587178 584883988 582225561 579584062 576860309 574057579 571241379 568464458
3059.4 568464458 565759897 563082874 560408354 557714462 554930627 552089453 549345016 546779096
3075.7 546779096 544254899 541552246 538723052 535959125 533224940 530482531 527770162 524976134
3092.1 524976134 522093773 519363642 516842067 514277220 511556268 508851588 506309628 503861547
3108.4 503861547 501341283 498795033 496374696 493990958 491520733 488906950 486141205 483431131
3124.7 483431131 480955899 478645086 476263642 473734438 471300423 469075590 466854960 464452296
3141 464452296 461962014 459595770 457405508 455374420 453434855 451353192 449041158 446744561 444594681
3159.4 444594681 442524850 440516084 438500792 436404586 434317708 432351530 430477470 428618312
3175.7 428618312 426725239 424839258 423016787 421222419 419447064 417740166 416074663 414387107
3192 414387107 412697434 411045313 409449577 407906979 406409711 404959500 403535217 402105004 400650561
3210.3 400650561 399189949 397773504 396422058 395100832 393797964 392513663 391237020 389981598
3226.7 389981598 388794065 387758255 386808276 385676146 384341359 383076191 381999046 381042272 380104512
3245 380104512 379097164 378009319 376948327 376032114 375206560 374303013 373312563 372355193 371469676
3263.4 371469676 370691359 370100230 369625300 368978053 368080676 367130488 366209954 365355611 364566892 363794625
3283.8 363794625 363088936 362487406 361970216 361472726 360886037 360178590 359405369 358661711 358066052 357624203
3304.2 357624203 357103318 356298774 355333447 354398072 353530347 352746397 352042228 351359457 350694418 350033075
3324.6 350033075 349256456 348360002 347493500 346749693 346149892 345635593 345001072 344171673 343347490 342585623
3345 342585623 341884106 341326863 340666384 339714646 338777840 338093489 337523252 336879700 336251050 335838616
3365.4 335838616 335499227 334912509 334044307 333189607 332559168 332022548 331452698 330830455 330222517 329784423
3385.7 329784423 329625279 329658061 329501152 328983575 328456551 328275681 328305304 328043252 327437907 326986313
3406.1 326986313 326817513 326701880 326541245 326291859 326020598 325872779 325756848 325587809 325541466 325716972
3426.5 325716972 326014817 326262414 326501548 326850742 327062786 326926291 326716155 326781213 327068180 327334344
3446.9 327334344 327591181 327965856 328412175 328868359 329387754 330001593 330511391 330970258 331750393 332706809
3467.3 332706809 333326101 333544850 333779663 334292710 335097373 335908234 336378425 336787790 337481439 338249683
3487.7 338249683 338948786 339721590 340570241 341414362 342254370 343111157 343858778 344419539 344979763 345630705
3508.1 345630705 346435428 347494453 348533094 349315405 350066364 351008594 352081120 352979183 353611708
3526.5 353611708 354295373 355265141 356434137 357609898 358642995 359656572 360948294 362351537 363435656
3544.8 363435656 364268541 365333229 366579026 367807090 369207144 370791972 372437358 374163449
3561.1 374163449 375789106 376983047 378326476 380646944 383233458 385449618 387571633 389840335
3577.5 389840335 392295361 395004660 397755533 399982244 401857436 404521525 407599837 410375088
3593.8 410375088 413247377 416446954 419588417 422742367 425998122 428890973 431528121 434546232
3610.1 434546232 437903196 441423804 444869816 448048055 451678067 455756962 459494203 462355494
3626.4 462355494 464825809 468569875 472780526 476581246 480237901 483804762 487346143 490954041
3642.7 490954041 494306654 496994108 499758750 503963351 508401871 512009203 515706658 519772053
3659 519772053 523373306 526585639 529781818 532526314 534793675 537795782 540763259 543124437 546385348
3677.4 546385348 549960136 553140163 556179583 558906913 561003983 562862456 565346479 568150342
3693.7 568150342 570713699 572908938 574644923 576249778 578319788 580418885 581902623 582757473
3710 582757473 583938956 586216509 588598251 590427697 591818333 593104601 594428778 595909953 597621500
3728.4 597621500 598981977 599643767 600121200 601414800 603496134 605139434 605453551 605499506 606790185
3746.7 606790185 607742190 608147860 609713376 611780345 613112450 613953292 615216434 616622925 617671609
3765.1 617671609 618548334 619346559 620434046 621843338 623019397 623730421 624304831 625183225 626054883
3783.5 626054883 626882732 627898693 628904164 629816771 630472064 630910754 631525755 631785035 632012308
3801.8 632012308 633115947 633909166 634598792 635932326 637135625 637517691 637596667 638093770 638208628
3820.2 638208628 638716161 640002847 641007662 641828835 642416239 642849267 643425047 643615723 643543541
3838.5 643543541 644134223 645183921 646352351 647492588 648219764 647872746 646475613 646762848 648690879
3856.9 648690879 650064290 650543451 650531530 650904238 651466787 651545823 651911557 652686357 653578281 654355526
3877.3 654355526 654485643 654744744 655271113 655577660 656195164 656576574 656592667 657244802 658131778 658355057
3897.7 658355057 658029377 657776773 657974184 658787668 659770250 660389304 660720289 660892963 660898387 661036193
3918.1 661036193 661449730 661731720 661820114 662141562 662535548 662609220 662746608 663244247 663686335 663894236
3938.5 663894236 663963079 664050579 664361894 664652109 664748132 664926708 665269017 665603936 665822685 665988624
3958.9 665988624 666212857 666542768 666884303 667076886 667164743 667301118 667505622 667699695 667854249 668000042
3979.3 668000042 668218195 668499231 668703318 668831348 668981791 669149756 669306576 669502676 669740677
3997.6 669740677
##END=$$ End of the data block
