##TITLE=$$ Begin of the data block
##JCAMP-DX=5.00 $$ ACD/SpecManager v 10.08
##SPECTROMETER/DATA SYSTEM=Alpha
##DATE=26 Dec 2014 10:25:20
##DATA TYPE=INFRARED SPECTRUM
##DATA CLASS=XYDATA
##ORIGIN=
##OWNER=
##NPOINTS=1765
##FIRSTX=399.76428223
##LASTX=3997.64306641
##MAXX=3997.64306641
##MINX=399.76428223
##MAXY=0.82759047
##MINY=0.25418910
##XFACTOR=1.0000000000
##YFACTOR=1.000000000000000e-9
##FIRSTY=0.54736984
##DELTAX=2.03961372
##XUNITS=1/CM
##YUNITS=ARBITRARY UNITS
##XYDATA=(X++(Y..Y))
399.8 547369838 544155777 540645421 537752628 536747456 537951648 540469229 542800725 543630540 542599022
418.1 542599022 540913999 539884865 538996458 537178218 533824742 529841483 526665747 524702489 523664832
436.5 523664832 523626149 525016487 528194368 532890022 537964046 542154670 544609070 545464337 545427680
454.8 545427680 544949114 544449151 543735445 541990876 539110124 535684824 532442510 529493928 526512086
473.2 526512086 523613691 521057189 519266963 518597722 518839836 519293010 519032478 517819166 516529143
491.5 516529143 515890718 515408516 514197469 511916757 508957088 506283641 504299045 502308965 499378324
509.9 499378324 495202929 490405232 485760480 481739819 478356659 475130916 471995175 469684780
526.2 469684780 469061375 469984889 471747369 474024594 477073997 481251210 486554682 492265135 496766657
544.6 496766657 498740226 498363823 496742070 494951040 493331105 491173327 487566680 482422888 476454139
562.9 476454139 470353097 464142829 457771569 451817513 447308034 445427328 446948230 451628387
579.3 451628387 458357811 465565890 472143352 477878779 482868761 487075150 489860147 490693003 490069121
597.6 490069121 489104152 488724798 489075422 489581734 489581585 489246249 489498585 491086870 494056851 497542620
618 497542620 500571251 503226757 506272137 510179281 514571249 518391311 520806313 521986485 522986352
636.4 522986352 524653316 526898146 528903067 529879630 529899836 530005395 531198800 533344269 535299718
654.7 535299718 536036134 535761595 535638928 536598563 538703680 541487813 542923748 542416930 542540014
673.1 542540014 544277251 547175229 549864113 551255524 551468134 551611662 552598655 554069519 554789484
691.4 554789484 553899407 551508546 548433840 545715034 543667555 541515768 538775027 536232769 535219312
709.8 535219312 536634684 540302694 544951141 549331844 553356409 557850361 563638270 570611060
726.1 570611060 577302456 582173645 585211277 587738454 590945184 594638169 597415030 597981691 596394420
744.5 596394420 593861878 591431737 589051902 585787058 580945373 575082958 569702566 566119611
760.8 566119611 564613461 564460993 565044403 566769779 570733249 577586949 586733460 596488357 605073929
779.1 605073929 611836433 617548525 623343647 629382014 634728968 638432026 640799224 643381655
795.4 643381655 647514939 653065681 658524752 662436903 664660394 666318774 668714881 671939969
811.8 671939969 674690843 675749958 675267220 674581885 674749315 675320089 674794436 672063470 667356908
830.1 667356908 662066102 657461762 653538883 649385929 644357681 638831735 633940399 630570829
846.4 630570829 628402889 626002133 622130573 616837978 611314833 607142031 605850875 608366191
862.8 608366191 614368558 622837603 633351445 645683050 658289552 668654561 674989522 677235067
879.1 677235067 676722944 674788892 671706557 667013228 660601616 653407335 646950901 642090261 638323605
897.4 638323605 634328365 629218817 623136163 616647124 610005200 602798462 594187975 583867252
913.7 583867252 572647691 562092304 553628206 547700763 543749571 540987134 539215505 538939714
930.1 538939714 540596187 543832004 547764778 551874995 556371331 561431706 566081941 568169534
946.4 568169534 565790594 558583856 547691703 534760714 520807862 505866170 489552110 471743077
962.7 471743077 452828586 433442682 413889319 393942922 373405367 352608889 332358658
977 332358658 313633114 297246099 283618897 272800624 264676005 259068668 255724192 254268497
993.3 254268497 254189104 254880875 255849123 256834954 257733524 258421659 258663744 258290857 257452130 256646574
1013.7 256646574 256451488 257193536 258844644 261210054 264085233 267357320 271011621 275001287 279096007
1032 279096007 282730788 285311222 286745310 287496567 288153440 289065927 290260762 291757613 293931454
1050.4 293931454 297394246 302538842 309290409 317345589 326472163 336586744 347112328 355942696
1066.7 355942696 359577537 355561972 345294714 333517939 324637264 320152849 319401979 321219265
1083 321219265 324639529 329026401 334229618 340333372 347014427 353445441 358618617 361876011 363403678
1101.4 363403678 364122659 365129650 367181361 370317280 374094814 378171265 382340759 386273295
1117.7 386273295 389508039 391792923 393419534 395270914 398375958 403078973 408456624 412729383
1134 412729383 414314359 412540913 407738686 400774777 392580688 383961052 375634074 368347257 362746060
1152.4 362746060 359069347 357144296 356674850 357548624 360036671 364638895 371706277 381146610 392425656
1170.7 392425656 404882044 418104321 431934357 446232200 460629344 474453062 487055868
1185 487055868 498127699 507661402 515667439 522026598 526571512 529361725 530975342 532334208
1201.3 532334208 534153998 536631942 539630294 543042183 546996832 551708877 557075202 562455535
1217.7 562455535 566904187 569720149 570872724 570906520 570398867 569516957 568116009 566152692 563913286
1236 563913286 561904788 560573816 560045183 560144722 560702562 561714590 563290715 565449297 567863762
1254.4 567863762 569958091 571321011 572059393 572727859 573894978 575786233 578118622 580284417 581834078
1272.7 581834078 582736909 583176076 583211184 582779169 581918299 580813646 579732776 578867912 578085780
1291.1 578085780 576986134 575281560 573060155 570715606 568629801 566882551 565209270 563370824
1307.4 563370824 561507165 559909821 558692396 557721317 556667864 555197656 553080499 550111353
1323.7 550111353 546160102 541371047 536110044 530785680 525844455 521740139 518840790 517417669
1340 517417669 517277658 517659783 518010914 518175662 518119931 517835557 517251134 516321182 515070140 513557613
1360.4 513557613 512099147 511241257 510816038 510400951 510145009 510251880 510900319 512017906 513119638
1378.8 513119638 514046609 515229940 517305136 520725608 524868071 528269351 530279934 530885458 530529857
1397.1 530529857 529667437 528679311 527421296 525560260 523464382 521309793 519121110 517258584 515779197
1415.5 515779197 514273584 512974322 512697875 513169408 514092445 515312135 516666472 518244863 519908309
1433.9 519908309 521717727 524078488 526526988 528657138 530306220 531313419 531671345 531558394 530995846
1452.2 530995846 529820800 527418613 525131285 525321782 526656568 528809667 532354295 536965787
1468.5 536965787 542896986 551653683 561796725 570960343 579194248 586849988 594081044 600481868
1484.9 600481868 606292665 612219095 618324280 623401999 627567708 631827533 636192262 640032470
1501.2 640032470 642960668 645096302 647673607 651097178 654130220 656560779 658452690 660238028
1517.5 660238028 661919713 663571954 665454388 667231858 668882966 670248747 671011567 671448946 672103405
1535.8 672103405 672306299 671507418 670990407 671270549 671580553 671478927 670875132 670069754 669053137
1554.2 669053137 667571306 664883733 662676930 662388563 661726534 660332680 658361673 656291127 655067980
1572.6 655067980 653730869 651676476 650254309 649241567 647910297 646471381 645066798 643637002
1588.9 643637002 642063379 640294611 638423085 636655748 634943306 632971585 630654395 628099740
1605.2 628099740 625339091 622464359 619815707 617317140 614022672 609972358 607267678 605105460
1621.5 605105460 602335691 599769533 597390115 595045328 593208730 591279089 588738501 587389648
1637.8 587389648 587200046 587075770 586865783 586658895 587427914 588943601 590151548 592139363 595183790
1656.2 595183790 598166049 601192117 604653835 608506560 611959994 615430951 619881034 624553978
1672.5 624553978 629383981 634548426 639094055 642993391 647073507 652919233 658827305 663552523
1688.8 663552523 667973578 671721816 675196707 678911269 682550669 686526895 689812660 692299128
1705.1 692299128 694943368 697622538 699970186 701816142 703191876 704964101 707706153 710422873
1721.5 710422873 712772727 714880347 716547370 717848539 718999267 720514655 722785115 724764168
1737.8 724764168 726290822 727887273 729785264 731934607 734234631 736825645 739726961 742307484
1754.1 742307484 744569600 746902704 749129355 751231492 753099978 754444122 755489886 756595910
1770.4 756595910 758029640 759760141 761189103 762154698 763025284 764135718 765393555 766545355 767271936
1788.8 767271936 767536044 768116951 769378245 770665526 771596849 772273481 773020864 773887455 774738193
1807.1 774738193 775546253 776387691 777186155 777801394 778340936 779037833 779789865 780338705 780711889 780955672
1827.5 780955672 781230927 781985283 782951295 783605576 783967018 784160852 784150422 784175813 784727633 785475552
1847.9 785475552 785929263 786082983 786172211 786437929 786838055 787201464 787392259 787358999 787142694 787099183
1868.3 787099183 787703753 788529038 788965940 789068699 789190829 789513886 790002286 790476918 790722311 790717304
1888.7 790717304 790838718 791264176 791751146 792167306 792421579 792498112 792540073 792683005 792885065 793057144
1909.1 793057144 793209672 793303370 793281198 793288708 793527186 793754160 793824196 793960333 794162095 794363201
1929.5 794363201 794590235 794783473 794864774 794858098 794829190 794857562 795066178 795369387 795562506 795663774
1949.9 795663774 795793653 796024561 796337843 796593547 796709895 796767414 796846986 796970069 797213018 797505200
1970.3 797505200 797667563 797739029 797846794 798011899 798173070 798283219 798313439 798260391 798196256 798202634 798324049
1992.7 798324049 798494101 798560143 798517823 798473358 798455775 798402607 798265755 798073947 797827482 797535181
2013.1 797535181 797235310 796935081 796577573 796057403 795340002 794675231 794454932 794512212 794393063 794058859
2033.5 794058859 793669462 793294787 792935312 792609811 792336702 792089283 791831255 791594803 791437387 791346371
2053.9 791346371 791289628 791260719 791245043 791222036 791236877 791336358 791452587 791481733 791435003 791392446 791402638
2076.4 791402638 791449189 791483283 791505873 791517556 791513801 791558862 791682899 791831970 791963339 792052150 792118967
2098.8 792118967 792220771 792360783 792498112 792614639 792702258 792743206 792786062 792891920 793024421 793091536
2119.2 793091536 793061733 792989016 792948365 792964160 793005526 793041229 793066978 793092847 793102980 793088496 793078065
2141.6 793078065 793101907 793149710 793183744 793207705 793256819 793345809 793486178 793670595 793841481 793998480 794218004
2164.1 794218004 794530869 794911087 795340240 795767784 796132743 796488225 796905458 797372997 797862470 798341215
2184.5 798341215 798744678 799064338 799398959 799808621 800242126 800632775 800946355 801206768 801516354 801927447
2204.8 801927447 802389383 802828312 803180516 803446591 803736567 804156184 804651976 805038750 805224836 805363357
2225.2 805363357 805628479 806007743 806403518 806719899 806897461 806990504 807147443 807444274 807799876 808091879
2245.6 808091879 808267236 808345079 808454096 808736444 809126019 809426904 809558451 809595823 809706151 810027301
2266 810027301 810463011 810786307 810896516 810885429 810941041 811135709 811430812 811731994 811939359 812080801
2286.4 812080801 812289894 812683642 813214242 813677192 813941061 814088643 814302683 814747810 815484703 816311121
2306.8 816311121 816920936 817284465 817669213 818342566 819333673 820386767 821186602 821674347 822080851
2325.2 822080851 822717190 823573291 824185491 824290633 824172676 824152231 824337363 824554145 824113369 822429299
2345.6 822429299 820716977 820527077 821999073 824332774 826394558 827477694 827590466 827098012 826214612
2363.9 826214612 825012445 823415041 821386874 819116354 816983461 815254867 813847184 812565625
2380.2 812565625 811338127 810248852 809469402 809074521 808955669 808906913 808738708 808415174 808073580
2398.6 808073580 807851493 807749271 807622552 807331085 806877971 806398749 806068838 805906236 805710316 805285275
2419 805285275 804655731 804023206 803561926 803265035 802951932 802447021 801764727 801079035 800531626 800113618
2439.4 800113618 799697042 799156249 798497736 797836542 797273338 796824694 796398461 795888722 795270801 794635117
2459.8 794635117 794132233 793777466 793411911 792894602 792249978 791619122 791134119 790799856 790475786 790022850
2480.2 790022850 789450884 788895011 788458526 788149416 787891626 787577868 787175655 786754429 786412418 786165416
2500.6 786165416 785931110 785654008 785336852 785026371 784779191 784563839 784305811 783952236 783505976 783046007
2521 783046007 782642365 782303870 781951427 781465828 780855000 780248880 779689968 779136181 778587341 778010011
2541.4 778010011 777340114 776636064 776006103 775449514 774912715 774345338 773714423 773074031 772509396 771997511
2561.8 771997511 771449924 770852506 770254612 769669175 769094169 768569231 768076479 767533898 766941369 766379476
2582.2 766379476 765893102 765445888 765002728 764573574 764136732 763690412 763291717 762959659 762632549 762224853
2602.6 762224853 761726618 761195600 760678172 760153949 759558439 758859336 758076668 757243037 756368935 755493343
2623 755493343 754629731 753701508 752674282 751588762 750488758 749394119 748285949 747147977 746002674
2641.3 746002674 744868219 743748963 742647827 741563916 740484178 739368320 738207579 737065494
2657.6 737065494 736009359 735019803 734017015 732976496 731920302 730875731 729909003 729035258 728161097
2676 728161097 727227092 726280928 725405216 724609613 723811030 722928882 721986651 721057117 720140457 719217122
2696.4 719217122 718289793 717309475 716240942 715129554 714032590 713007271 712028027 710998654 709918141
2714.7 709918141 708866954 707905650 707031250 706178844 705290020 704372048 703467011 702622235 701886117
2733.1 701886117 701254547 700625241 699898958 699107111 698339105 697631776 696978569 696336687 695648074 694943070
2753.5 694943070 694302499 693729043 693186283 692641973 692058504 691428423 690793633 690201342 689642370 689026713
2773.9 689026713 688261151 687369943 686460555 685597539 684740841 683796823 682726741 681543946 680291533
2792.2 680291533 679031849 677756548 676416337 674987018 673454821 671836495 670170367 668476820
2808.6 668476820 666732252 664891541 662965834 660976887 658935905 656871557 654747665 652510881
2824.9 652510881 650180161 647792518 645333707 642774045 640125334 637377501 634440601 631229699
2841.2 631229699 627793789 624205649 620443761 616601467 612978756 609805942 607079804 604650676
2857.5 604650676 602275610 599667013 596628249 593104661 589124322 584788382 580169022 575241745
2873.8 575241745 570094526 565018415 560327888 556225061 552777171 549984574 547876060 546406031
2890.1 546406031 545381904 544613659 543933332 543182671 542316914 541309178 540100276 538650811 536881268
2908.5 536881268 534683645 531973422 528739870 525087476 521230280 517429352 513941407 510995686
2924.8 510995686 508759618 507377088 506962776 507604897 509393275 512306094 516161919 520766020 525902212
2943.2 525902212 531269908 536667407 542097628 547607064 553133905 558562756 563843369 569006443
2959.5 569006443 574026883 578760684 583127558 587141514 590839684 594354033 597816765 601215541
2975.8 601215541 604510188 607672215 610577703 613171577 615547538 617728055 619673133 621315956
2992.1 621315956 622586071 623569071 624314189 624777913 625006557 624984205 624644339 624061823 623345256 622458100
3012.5 622458100 621282876 619795322 618079305 616237283 614362597 612446606 610387802 608210981
3028.8 608210981 605999351 603738308 601357520 598886073 596489012 594127595 591597855 588904679
3045.1 588904679 586191177 583549142 580911219 578157306 575333834 572492957 569662094 566946149
3061.5 566946149 564336240 561722517 559013963 556170523 553279877 550487280 547884822 545381188
3077.8 545381188 542737663 539934516 537147105 534394145 531643689 528909564 526102424 523218036
3094.1 523218036 520446420 517876863 515335500 512668431 509991169 507433474 504910588 502307475
3110.4 502307475 499751121 497392446 495066851 492592990 489955634 487195313 484474719 481948435
3126.7 481948435 479564309 477136910 474629015 472230345 470029324 467827350 465431154 462948292
3143 462948292 460555136 458287418 456187874 454223961 452140063 449812531 447460145 445255548 443180472
3161.4 443180472 441140383 439077526 437039018 435063064 433112293 431169361 429278761 427415460
3177.7 427415460 425558507 423740655 421943069 420170635 418474674 416807830 415114671 413445950
3194 413445950 411789060 410121560 408517808 406997085 405495644 404002011 402533829 401086897 399669737
3212.4 399669737 398282230 396922410 395571232 394229382 392951459 391711533 390451998 389248908
3228.7 389248908 388195574 387214512 386079252 384761184 383514047 382437736 381426513 380457371 379486769
3247.1 379486769 378386766 377237052 376240104 375390112 374508440 373561710 372658104 371818483 371033072
3265.4 371033072 370352298 369779199 369089276 368162334 367210656 366350114 365555704 364811003 364083171 363378286
3285.8 363378286 362723351 362178177 361699820 361119390 360392481 359563142 358762920 358169615 357767433 357272029
3306.2 357272029 356469095 355516344 354587555 353689015 352850556 352121741 351483673 350884825 350235373 349394470
3326.6 349394470 348449320 347620904 346886724 346221894 345709264 345163375 344383717 343486041 342607021 341851354
3347 341851354 341233730 340530366 339626312 338736385 338084728 337568790 336977005 336354792 335864663 335439116
3367.4 335439116 334807754 333896339 333017468 332413465 331924260 331385046 330777794 330168396 329719126 329526782
3387.8 329526782 329517066 329355925 328818232 328249872 328090727 328151941 327878445 327286869 326845944 326646805
3408.2 326646805 326522887 326368451 326102287 325787127 325561106 325407624 325334609 325409085 325600296 325863421
3428.6 325863421 326083601 326303333 326626420 326782763 326627463 326512873 326706380 327028722 327252954 327484369
3449 327484369 327871352 328314751 328743666 329271883 329890579 330344856 330775321 331587613 332599849 333253413
3469.4 333253413 333436549 333616674 334123522 334961802 335798919 336273640 336718678 337452710 338156313 338749588
3489.8 338749588 339494050 340368807 341278583 342166841 342997402 343746960 344382435 344976515 345576406 346329868
3510.2 346329868 347411454 348500729 349285513 350018322 350978523 352085173 353029132 353717893 354398549
3528.5 354398549 355305284 356441408 357680619 358833700 359884501 361091018 362421453 363504052
3544.8 363504052 364324301 365392238 366704702 368009686 369450986 371037930 372663647 374387860
3561.1 374387860 376074284 377327770 378646463 380917698 383484215 385747313 387966275 390282810
3577.5 390282810 392750680 395471841 398200840 400399059 402292013 405020058 408170402 411005825
3593.8 411005825 413924783 417156845 420298517 423421055 426653266 429538220 432177216 435163647
3610.1 435163647 438424438 441913217 445445091 448723316 452428937 456575900 460361332 463238537
3626.4 463238537 465707451 469466925 473724365 477561563 481216192 484796971 488405138 492078096
3642.7 492078096 495446503 498138160 500899315 505037189 509423256 513043702 516787052 520902455
3659 520902455 524527848 527716041 530891240 533646345 535958648 539031327 541972220 544224143 547468245
3677.4 547468245 551117539 554401040 557521343 560223758 562199175 563993633 566541970 569438517
3693.7 569438517 572046638 574212670 575910866 577531278 579655945 581817448 583301127 584069669
3710 584069669 585181355 587457240 589889109 591800153 593228877 594451964 595698953 597235799 599067688
3728.4 599067688 600442827 601020932 601456285 602774382 604864001 606475949 606712520 606734633 608108580
3746.7 608108580 609063447 609399438 611017287 613184392 614550769 615419388 616712451 618075907 619069219
3765.1 619069219 619958520 620757997 621812284 623231351 624428749 625104368 625633717 626550913 627488554
3783.5 627488554 628345072 629377723 630404651 631319821 631946146 632340789 632917166 633162618 633424163
3801.8 633424163 634580374 635389626 636100471 637474775 638652444 638922572 638915598 639444411 639638960
3820.2 639638960 640258014 641656697 642666578 643362641 643845439 644293249 644858360 644959629 644901395
3838.5 644901395 645601153 646677852 647818685 648955524 649680257 649269342 647726953 648006380 650086343
3856.9 650086343 651564896 652093112 652130187 652527630 653062940 653050959 653327107 654133558 655102253 655901313
3877.3 655901313 655968726 656117320 656622469 657017648 657763541 658240974 658272743 658880055 659670472 659765840
3897.7 659765840 659384191 659189999 659494698 660408139 661433816 662063777 662453651 662683129 662629962 662661254
3918.1 662661254 663048565 663352311 663444817 663734972 664093673 664187789 664385557 664922059 665383875 665607512
3938.5 665607512 665684879 665772140 666048527 666294575 666422427 666658461 666978180 667287052 667547047 667740285
3958.9 667740285 667926311 668192089 668494344 668673754 668771088 668942571 669169605 669377983 669568598 669742465
3979.3 669742465 669930518 670156598 670355141 670514524 670701504 670886636 671032250 671208143 671408534
3997.6 671408534
##END=$$ End of the data block
