##TITLE=$$ Begin of the data block
##JCAMP-DX=5.00 $$ ACD/SpecManager v 10.08
##SPECTROMETER/DATA SYSTEM=Alpha
##DATE=26 Dec 2014 10:25:20
##DATA TYPE=INFRARED SPECTRUM
##DATA CLASS=XYDATA
##ORIGIN=
##OWNER=
##NPOINTS=1765
##FIRSTX=399.76428223
##LASTX=3997.64306641
##MAXX=3997.64306641
##MINX=399.76428223
##MAXY=0.82832807
##MINY=0.25441206
##XFACTOR=1.0000000000
##YFACTOR=1.000000000000000e-9
##FIRSTY=0.55165344
##DELTAX=2.03961372
##XUNITS=1/CM
##YUNITS=ARBITRARY UNITS
##XYDATA=(X++(Y..Y))
399.8E51653445l963888l732204k880991r76086J209677K253711J660347M30107m14491
418.1E45239627q30471j073837j448751k255797l187299l587842l081977k144158j281023
436.5E26348472k24948J415252L446877M892052M915237L831506K211451P13468m4823
454.8E47504544k73466m74870j093268k033413k710760l070175l036440k946615l144145
473.2E28721392l004432k494573j777888p70866J79708K93254n03242j138210j076817
491.5E18428326o50347n36143j274407k376616k974987k734721k203584k201140k839088
509.9E00637293l861129m598618m581869m075557l537178l334552l291785k537311
526.2D70819294p23898R70393J859010K360195L071338M079699N208165N721300M483849
$$ y = [551653445, 547689557, 543957353, 541076362, 540100276, 541309953, 543563664, 545224011, 545654118, 545239627, 544409156, 543335319, 541886568, 539630771, 536443472, 532855630, 529773653, 527629495, 526348472, 526123524, 527538776, 530985653, 535877705, 540792942, 544624448, 546835899, 547549367, 547504544, 547231078, 546756208, 545662940, 543629527, 540918767, 537848592, 534812152, 531865537, 528721392, 525716960, 523222387, 521444499, 520673633, 520853341, 521146595, 520643353, 519505143, 518428326, 517777979, 517241836, 515967429, 513590813, 510615826, 507881105, 505677521, 503476381, 500637293, 496776164, 492177546, 487595677, 483520120, 479982942, 476648390, 473356605, 470819294, 470095396, 471065789, 472924799, 475284994, 478356332, 482436031, 487644196, 493365496, 497849345]
544.6D97849345J932204l27647j481235j641571j494766k095848l688872n263567o042957
562.9D77745086o221890o297023o292343n889654m492342j770735J580983M542977
579.3D52905059O447285O971807O603390O007105N171716M132449K743632R42588n41747
597.6D91383284r87321m54217K78920M52071k2381l70383K58058J700520K977372L379434
618D98595357L050566K723634K990961L789425M381597L942668K481282J135707R37462
636.4E24028659J659751K343893K119124J008153J1384J13011J210689K144158J921177
654.7E36559999O84977l20375j35780R75609K103627K820909J513719n43296P1943
673.1E43731332J744091K887011K621949J342237K44081K32398J023531J470685Q11160
$$ y = [497849345, 499781549, 499453902, 497972667, 496331096, 494836330, 492740482, 489051610, 483788043, 477745086, 471523196, 465226173, 458933830, 453044176, 448551834, 446781099, 448362082, 452905059, 459352344, 466324151, 472927541, 478934646, 484106362, 488238811, 490982443, 491925031, 491383284, 490395963, 489941746, 490220666, 490672737, 490650356, 490279973, 490538031, 492238551, 495215923, 498595357, 501645923, 504369557, 507360518, 511149943, 515531540, 519474208, 521955490, 523091197, 524028659, 525688410, 528032303, 530151427, 531159580, 531170964, 531283975, 532494664, 534638822, 536559999, 537244976, 536924601, 536788821, 537764430, 539868057, 542688966, 544202685, 543659389, 543731332, 545475423, 548362434, 550984383, 552326620, 552570701, 552803099, 553826630, 555297315, 556108475]
691.4E56108475q58069k599537l231108k627194j967371k162695k739668k528965r85265
709.8E36408603J443744L627062M550218M339397M040897M552901N928814P034481
726.1E71926117O589413M808008L099144K628445L269971L654480K706170N53906j619101
744.5E97616553k607941k456487k351224l230751m847586n946994n448043l575325
760.8E67152202j546144k47598N57244J800656M054368O890773R158075R766221Q564651
779.1F06150448O719888N754411N925715O104886N308330L687799K380789K516329
795.4F44548595M097223N653620N523264L840506K205253J800239K533317L219366
811.8F73421383K661288R81271n48005p86305M1128N19514n17905k781510m770220
$$ y = [556108475, 555250406, 552650869, 549419761, 546792567, 544825196, 542662501, 539922833, 537393868, 536408603, 537852347, 541479409, 546029627, 550369024, 554409921, 558962822, 564891636, 571926117, 578515530, 583323538, 586422682, 589051127, 592321098, 595975578, 598681748, 599235654, 597616553, 595008612, 592552125, 590200901, 586970150, 582122564, 576175570, 570727527, 567152202, 565606058, 565358460, 565915704, 567716360, 571770728, 578661501, 587819576, 597585797, 606150448, 612870336, 618624747, 624550462, 630655348, 635963678, 639651477, 642032266, 644548595, 648645818, 654299438, 659822702, 663663208, 665868461, 667668700, 670202017, 673421383, 676082671, 677063942, 676515937, 675729632, 675770760, 676290274, 675772369, 672990859, 668220639]
830.1F68220639n314231m598558l912270m199862n075455n496085m807770l321647
846.4F31494761k242208k497435l849923n231858n528390m201531j288176K545774
862.8F09201014N994499Q418441J0488867J2331128J2618304J0354101O247461K128125
879.1F77781940n98729j997233l119647m707337o429255p206916o482363m930496l831506
897.4F38478458m019737n124271o072343o420970o593823p217884q602917j0289908
913.7E84136605j1218190j0573864q458197n887270l916502k748132j755357k82943
930.1E39296150J608432L186881L903389M106581M512847N074858M640282K045512
946.4E68374932k425194p229030j0906398j2971163j4003992j4988601j6354412j7814845
$$ y = [668220639, 662906408, 658307850, 654395580, 650195718, 645120263, 639624178, 634816408, 631494761, 629252553, 626755118, 622905195, 617673337, 612144947, 607943416, 606655240, 609201014, 615195513, 623613954, 634102821, 646433949, 659052253, 669406354, 675653815, 677781940, 677183211, 675185978, 672066331, 667358994, 660929739, 653722823, 647240460, 642309964, 638478458, 634458721, 629334450, 623262107, 616841137, 610247314, 603029430, 594426513, 584136605, 572918415, 562344551, 553886354, 547999084, 544082582, 541334450, 539579093, 539296150, 540904582, 544091463, 547994852, 552101433, 556614280, 561689138, 566329420, 568374932, 565949738, 558720708, 547814310, 534843147, 520839155, 505850554, 489496142, 471681297]
962.7D71681297j8881142j9353360j9552917j9929736k0483882k0758926k0218075
977C32503259j8689275j6377240j3622195j0792106q090973n586356l345400j476198
993.3B54523516j11461O56813R55075J021952R43154O78897K20090l48270p80642p51108
1013.7B57008016k15918O61254J602352K341807K864420L293187L698915M009425M045815
1032B79309273L591239K630234J510411P83086O69420Q92967J169413J519442K197534
1050.4B94273019L453910N126774O712318P993221R106815J0131627J0505587Q795142
1066.7C56098413L644646l978700j0201156j1677623q831083m522294p94053J845657
1083C21583807L454835M374176N180538O084025O679505O431937N171031L280669J537860
$$ y = [471681297, 452800155, 433446795, 413893878, 393964142, 373480260, 352721334, 332503259, 313813984, 297436744, 283814549, 273022443, 264931470, 259345114, 255999714, 254523516, 254412055, 255068868, 256023943, 257045895, 257989049, 258667946, 258888036, 258539766, 257759124, 257008016, 256792098, 257453352, 259055704, 261397511, 264261931, 267555118, 271254033, 275263458, 279309273, 282900512, 285530746, 287041157, 287824243, 288493663, 289386630, 290556043, 292075485, 294273019, 297726929, 302853703, 309566021, 317559242, 326666057, 336797684, 347303271, 356098413, 359743059, 355764359, 345563203, 333885580, 325054497, 320532203, 319738150, 321583807, 325038642, 329412818, 334593356, 340677381, 347356886, 353788823, 358959854, 362240523, 363778383]
1101.4C63778383P15285J051664K102793L121823L713041M019350M150599L915429
1117.7C86568367L223420K308130J664579J871168L079087M656494N341619M235744
1134D12948608J548559j783073m768819o902188q152574q609474q307338p269024n601168
1152.4C63103509l658563j895755m58956Q61615K466678M596889P062674R405255J1234135
1170.7C92717481J2449622J3253331J3869107J4331043J4402717J3801575J2580275
1185D87405151J1062205R530097Q009017O354511M520595K783596J635194J373172
1201.3E32673538J824081K492904L018380L428161L947138M682065N365550N399048
1217.7E62830865M438341K792537J154661N8711m80711q76368j425683j991570k245069
$$ y = [363778383, 364493668, 365545332, 367648125, 370769948, 374482989, 378502339, 382652938, 386568367, 389791787, 392099917, 393764496, 395635664, 398714751, 403371245, 408712864, 412948608, 414497167, 412714094, 407945275, 401043087, 392890513, 384281039, 375973701, 368704677, 363103509, 359444946, 357549191, 357090235, 357951850, 360418528, 365015417, 372078091, 381483346, 392717481, 405167103, 418420434, 432289541, 446620584, 461023301, 474824876, 487405151, 498467356, 507997453, 516006470, 522360981, 526881576, 529665172, 531300366, 532673538, 534497619, 536990523, 540008903, 543437064, 547384202, 552066267, 557431817, 562830865, 567269206, 570061743, 571216404, 571275115, 570794404, 569918036, 568492353, 566500783, 564255714]
1236E64255714j989245j322329n51701O5923N26071R98437J592755K184630K434075
1254.4E68194330K110719J372457P32660O75619J205146J900077K307415K161205J545370
1272.7E82204998Q84056M28021M9769l88026q31723j102924j076520q56697p78079
1291.1E78532875j104415j718223k236426k338648k038717j694500j658082j847327
1307.4E63896537j877427j607538j226425j002848j089156j461386k086342k950966
1323.7E50594449l938794m803002n310297n350232m907310m054427k892554j447141
1340E17890692j44661M09007L77238J50740r0778k96771n86450r52721j269400j504719
1360.4E13982177j451791q55684m13835m06265k59996J01865O40094J091719J089036
$$ y = [564255714, 562266469, 560944140, 560392439, 560458362, 560984433, 561982870, 563575625, 565760255, 568194330, 570305049, 571677506, 572410166, 573085785, 574290931, 576191008, 578498423, 580659628, 582204998, 583089054, 583517075, 583566844, 583178818, 582347095, 581244171, 580167651, 579310954, 578532875, 577428460, 575710237, 573473811, 571135163, 569096446, 567401946, 565743864, 563896537, 562019110, 560411572, 559185147, 558182299, 557093143, 555631757, 553545415, 550594449, 546655655, 541852653, 536542356, 531192124, 526284814, 522230387, 519337833, 517890692, 517746031, 518155038, 518532276, 518683016, 518592238, 518295467, 517709017, 516756296, 515486896, 513982177, 512530386, 511674702, 511260867, 510854602, 510594606, 510696471, 511336565, 512428284, 513517320]
1378.8E13517320R36866J169622K023160L382028M153251L416300J991153N63025l88622
1397.1E30764103q53062r51051j243353j857818k098202k167166k169728j835525j502752
1415.5E16085446j537979j263499k16782N09381R43184J214922J344263J584947J669347
1433.9E20333230J794100K334476K434492K139687J672805J015663L40641j49012n94080
1452.2E31322002j179814k379715k260864J96159J326441K156497L594338M641891
1468.5E37416935N868852Q684456J0200859R245276Q230031P600009P191479O372690
1484.9F00810587N783856N964279O180704N087435M136503M249692M371464L836394
1501.2F40420914K910495K116799K621889L508449L078579K446771J861692J696050
$$ y = [513517320, 514454186, 515623808, 517646968, 521028996, 525182247, 528598547, 530589700, 531152725, 530764103, 529911041, 528959990, 527716637, 525858819, 523760617, 521593451, 519423723, 517588198, 516085446, 514547467, 513283968, 513067186, 513576567, 514519751, 515734673, 517078936, 518663883, 520333230, 522127330, 524461806, 526896298, 529035985, 530708790, 531724453, 532065094, 531916082, 531322002, 530142188, 527762473, 525501609, 525697768, 527024209, 529180706, 532775044, 537416935, 543285787, 551970243, 562171102, 571416378, 579646409, 587246418, 594437897, 600810587, 606594443, 612558722, 618739426, 623826861, 627963364, 632213056, 636584520, 640420914, 643331409, 645448208, 648070097, 651578546, 654657125, 657103896, 658965588, 660661638]
1517.5F60661638J622021J709759J972556J804173J643539J349330P54595M46677O29961
1535.8F72594249J21594q34823m01616L79384L44216p9989n79715q21352j099229j617551
1556.2F68005168k809763k108335j54436o39975j430332j986981k022862j178265j359224
1574.6F54314995k116740j452565j003385j295924j394510j369894j424134j591324
1590.9F42666519j780808j871884j770198j707256j948893k324999k598047k780676
1607.2F25883758k852797k617896k516925l354788m055023k651215k125084k747715
1623.5F02962315k545297k351403k311945j846850j971305k487480j225174j53243
1639.9E88069618j53423k55704k36928P92503J539827J184940K015770L134310L024459
$$ y = [660661638, 662283659, 663993418, 665965974, 667770147, 669413686, 670763016, 671517611, 671964288, 672594249, 672715843, 671881020, 671479404, 671858788, 672203004, 672123015, 671543300, 670721948, 669622719, 668005168, 665195405, 663087070, 662932634, 662292659, 660862327, 658875346, 656852484, 655674219, 654314995, 652198255, 650745690, 649742305, 648446381, 647051871, 645681977, 644257843, 642666519, 640885711, 639013827, 637243629, 635536373, 633587480, 631262481, 628664434, 625883758, 623030961, 620413065, 617896140, 614541352, 610486329, 607835114, 605710030, 602962315, 600417018, 598065615, 595753670, 593906820, 591935515, 589448035, 588222861, 588069618, 587916195, 587660491, 587423563, 588216066, 589755893, 590940833, 592956603, 596090913, 599115372]
1658.2E99115372L029108L471672L882170L477871L474832M446983M666269M837334
1674.5F30401611N208373M545212L856301M097701N932629N946219M737258M423260
1690.9F69148564L697813L401399L706634L640830L919363L259719K501905K677679
1707.2F95953906K702534K320647J783073J339614J773000K742827K735078K391816
1723.5G13742495K137601J651108J252890J097739J489937K283931J973986J528263
1739.8G27157950J629413J898706K123653K306343K624988K937794K610922K253353
1756.1G45543122K285958K207219K137423J921952J364946J006067J045882J453460
1772.4G58966029J816928J455247R35376Q62122J127124J275658J172960P37190K62678
$$ y = [599115372, 602144480, 605616152, 609498322, 612976193, 616451025, 620898008, 625564277, 630401611, 635609984, 640155196, 644011497, 648109198, 654041827, 659988046, 664725304, 669148564, 672846377, 676247776, 679954410, 683595240, 687514603, 690774322, 693276227, 695953906, 698656440, 700977087, 702760160, 704099774, 705872774, 708615601, 711350679, 713742495, 715880096, 717531204, 718784094, 719881833, 721371770, 723655701, 725629687, 727157950, 728787363, 730686069, 732809722, 735116065, 737741053, 740678847, 743289769, 745543122, 747829080, 750036299, 752173722, 754095674, 755460620, 756466687, 757512569, 758966029, 760782957, 762238204, 763173580, 764035702, 765162826, 766438484, 767611444, 768348634, 768611312]
1790.8G68611312N70357J242459J262486Q95798O65247P64430Q70049Q50975Q06094
1809.2G76539207Q17835P89940O45936N71966P02202P38979N24580L50237K34783K74121
1829.6G82189786P76887J002312O85930L84748K03073j0132J5974N63383P68363M31597
1850G87011921J41740J20402K80201M03047L74138J74761n2452k11299l4749O06477
1870.3G88814187Q21650M45485J19269J32203L42369M93467M32968K03431J3649J82748
1890.7G92001426M46677M51208L86893K61486P8142J9252J28329K03848J78873J48535
1911.1G94304669Q6546l696K3604K24352K26080Q6188J34588K05755K23935K44617
1931.5G95756638J97709P7784j5021n3763N424K28822L39926K11179J11818J35899
$$ y = [768611312, 769181669, 770424128, 771686614, 772582412, 773247659, 774012089, 774882138, 775733113, 776539207, 777357042, 778146982, 778792918, 779364884, 780067086, 780806065, 781330645, 781680882, 781915665, 782189786, 782966673, 783968985, 784654915, 785039663, 785242736, 785232604, 785248578, 785811961, 786580324, 787011921, 787153661, 787274063, 787554264, 787957311, 788331449, 788506210, 788453758, 788242459, 788207710, 788814187, 789635837, 790081322, 790200591, 790332794, 790675163, 791168630, 791601598, 791805029, 791818678, 792001426, 792448103, 792899311, 793286204, 793547690, 793625832, 793645084, 793773413, 793977261, 794156134, 794304669, 794391215, 794387519, 794411123, 794635475, 794861555, 794947743, 795082331, 795288086, 795512021, 795756638, 795954347, 796032131, 796017110, 795963347, 795968771, 796197593, 796537519, 796748698, 796860516, 796996415]
1951.9G96996415K29060L13282K45989R1374N1200J14262J73509K52724K63929J46628
1972.3G98878372P4923J05262J42633J35184J03712M4167k1577l3081k026R7454J87575
1994.8G99712598R0301n5670o2883j3888l6538j33574k10941k58982k91347k94209
2015.2G98444867l00169l57747m93407o89507o68287k30610P5161r1612l43621m44055
2035.6G94901013m29809l57032k74777k29359k24292k42948k44439j80185r2089m1008
2056G92585075k0385k5153m5657j4723Q1361J32799O1810k3425j2695M3153M7326K4319
2080.4G92833805K2650J3530J669M0710J31071J62124J01149M6254N2332R4533J44542
2102.9G93644369J72138J53541J10448N9187N2154R2030J00613N4001j3530m9889k9624
$$ y = [796996415, 797225475, 797538757, 797784746, 797876120, 797927320, 798041582, 798215091, 798467815, 798731744, 798878372, 798953295, 799058557, 799201190, 799336374, 799440086, 799484253, 799462676, 799429595, 799427569, 799525023, 799712598, 799802899, 799747229, 799684346, 799670458, 799633920, 799500346, 799289405, 799030423, 798739076, 798444867, 798144698, 797786951, 797293544, 796604037, 795935750, 795705140, 795780301, 795688689, 795345068, 794901013, 794471204, 794114172, 793839395, 793610036, 793385744, 793142796, 792898357, 792718172, 792626083, 792585075, 792564690, 792539537, 792493880, 792479157, 792560518, 792693317, 792755127, 792731702, 792719007, 792762160, 792809486, 792833805, 792856455, 792869985, 792871654, 792912364, 793043435, 793205559, 793306708, 793352962, 793405294, 793499827, 793644369, 793816507, 793970048, 794080496, 794139683, 794191837, 794283867, 794384480, 794438481, 794424951, 794375062, 794345438]
2125.3G94345438K7359N1796J7941k682J4246J9610M887J8358M8399L3260J371P272
2149.8G94587255N0187J00433J46389J92523J93060J61707K03073L03150L78191M29332
2170.2G96745300M32730L96013L95358M22180M61697M91500M61519L85165L36468L61443
2190.6H00889373M13060M24147L78906L08931K66791L12626M20392M69207M16518L25918
2211H04625869K77400L30329M47273M81963L66509K16365J62482K27154L69429M44949
2231.4H07949722L36647J55389Q4043J66237K95520L41892K71917J61469Q6069J24931
2251.8H09973836K87294L84271K90275J06931K5213J38163L49701M38571L05533J02997
2272.2H12402785Q523Q2374K30729L11852K74956J61886R9302K15590M44770N39124
$$ y = [794345438, 794372797, 794424593, 794442534, 794439852, 794454098, 794473708, 794478595, 794496953, 794545352, 794578612, 794579983, 794587255, 794637442, 794737875, 794884264, 795076787, 795269847, 795431554, 795634627, 795937777, 796315968, 796745300, 797178030, 797574043, 797969401, 798391581, 798853278, 799344778, 799806297, 800191462, 800527930, 800889373, 801302433, 801726580, 802105486, 802414417, 802681208, 802993834, 803414226, 803883433, 804299951, 804625869, 804903269, 805233598, 805680871, 806162834, 806529343, 806745708, 806908190, 807135344, 807504773, 807949722, 808286369, 808441758, 808525801, 808692038, 808987558, 809329450, 809601367, 809762836, 809848905, 809973836, 810261130, 810645401, 810935676, 811042607, 811067820, 811205983, 811555684, 811994255, 812299788, 812402785, 812411308, 812493682, 812724411, 813036263, 813311219, 813473105, 813572407, 813787997, 814232767, 814771891]
2292.5H14771891M11152K25366J65045K36452M12344O80566Q10147O32643L83914L64661
2312.9H19094181N87583Q89003J023650Q03292M52697M25577O86407P90954N13852
2331.3H25267196R1314r2149k9444J29461J71006m23551j613736j676619k08199J440823
2351.7H23056102K245188J927495J037061O2227n23329p74204j124323j567840j944542
2370.1H22393835k154708k010346j594782j285255j224160j234948j098395p52985
2386.4H11038256l48986q7857m0173j74046l52323l74615k23696o0737p2062k83540
2406.8H09020221m84049m82142l06845j53363k01523m49300o61492o34015m45664l14116
2427.2H04887712l36945m78089o48081o77943n30959l99649m07934n35488o80506p11561
$$ y = [814771891, 815183043, 815408409, 815573454, 815809906, 816222250, 816902816, 817712963, 818345606, 818729520, 819094181, 819681764, 820570767, 821594417, 822397709, 822850406, 823275983, 823962390, 824753344, 825267196, 825358510, 825266361, 825236917, 825366378, 825537384, 825113833, 823500097, 821823478, 821615279, 823056102, 825301290, 827228785, 828265846, 828328073, 827804744, 827030540, 825906217, 824338377, 822393835, 820239127, 818228781, 816633999, 815348744, 814124584, 812889636, 811791241, 811038256, 810689270, 810601413, 810561240, 810387194, 810034871, 809660256, 809436560, 809375823, 809303761, 809020221, 808536172, 808054030, 807747185, 807593822, 807392299, 806942999, 806281507, 805647492, 805201828, 804887712, 804550767, 804072678, 803424597, 802746654, 802215695, 801816046, 801408112, 800872624, 800192118, 799480557]
2447.6G99480557n95867m32193l88563n01454o39617o39439m72069l45051l93987n30362
2467.9G94541955o24537o05405m96507l80456l54350m29570n14388n18263m28498l23593
2488.3G89866388l03924l66748m15802m13775l15726j71125j71542k98381l99709l77237
2508.7G86632419k45333j74940k40504l51370m42326m76241m29809l53038l33727m43995
2529.1G83141136o03199o38306n73099n20229n26130o06060o81758o65665n99086n43654
2549.5G77183950n32389n95212o70135o58095n60462m92752n07056n52237n93484o11722
2569.9G71410406n94259n48839n35250n60760n50986n05864m68791m70221m74036m34756
2590.3G66266644m31418m52340m04716l47256l48270l83735m46319n24760n47290n25832
$$ y = [799480557, 798884690, 798452497, 798063934, 797562480, 796922863, 796283424, 795811355, 795466304, 795072317, 794541955, 793917418, 793312013, 792815506, 792435050, 792080700, 791651130, 791136742, 790618479, 790189981, 789866388, 789562464, 789195716, 788779914, 788366139, 788050413, 787879288, 787707746, 787409365, 787009656, 786632419, 786387086, 786212146, 785971642, 785620272, 785177946, 784701705, 784271896, 783918858, 783585131, 783141136, 782537937, 781899631, 781326532, 780806303, 780280173, 779674113, 778992355, 778326690, 777727604, 777183950, 776651561, 776056349, 775386214, 774728119, 774167657, 773674905, 773167849, 772615612, 772022128, 771410406, 770816147, 770267308, 769732058, 769171298, 768620312, 768114448, 767645657, 767175436, 766701400, 766266644, 765835226, 765382886, 764978170, 764630914, 764282644, 763898909, 763452590, 762927830, 762380540, 761854708]
2610.7G61854708n79417p12096q01742q15153q36909q89242r11117r17732r90093j100063
2631.1G53301144j124263j075030j061856j093447j139522j170516j163006j132548
2647.4G44340956j097977j087964j108229j134872j114130j038253j010955j047671
2663.7G35700905j059532j048863j029432r63091q94309q83340r12965r24170q84950
2682.1G27100253q38816q25763q53479q94606r23931r42707r35615r25302r59218j033246
2702.5G17967570j096189j093865j025438r76086j030922j109421j069188r60588q86500
2720.9G08719373q51274q61466r00566r04501q28862p31707o67452o52790p09773p60555
2741.2G00850427p50005p08282o68466o47485o64831p16328p02381n87941m90725n13315
$$ y = [761854708, 761275291, 760563195, 759761453, 758946300, 758109391, 757220149, 756309032, 755391300, 754401207, 753301144, 752176881, 751101851, 750039995, 748946548, 747807026, 746636510, 745473504, 744340956, 743242979, 742155015, 741046786, 739911914, 738797784, 737759531, 736748576, 735700905, 734641373, 733592510, 732563078, 731599987, 730705678, 729822338, 728909373, 727985203, 727100253, 726261437, 725435674, 724582195, 723687589, 722763658, 721820951, 720885336, 719960034, 719000816, 717967570, 716871381, 715777516, 714752078, 713775992, 712745070, 711635649, 710566461, 709605873, 708719373, 707868099, 707006633, 706106067, 705201566, 704372704, 703640997, 702973545, 702320755, 701610982, 700850427, 700100422, 699392140, 698723674, 698076189, 697411358, 696695030, 695992649, 695404708, 694913983, 694400668]
2761.6F94400668n98788o37651o26146n89073n76794o53982p80583q73089q91149q60095
2782F87313318q75890r61900j045882j132668j206815j237333j282990j356184j446545
2800.4F76767111j561582j660109j693845j687049j726926j836538j928210j974047
2816.7F62698805k013266k055526k152204k302110k385795k383829k441585k559900
2833F44404590k637029k744853k955854l208995l425479l604412l777563l847123l642320
2851.4F14560962l211081k763272k445995k386809k637684l085554l571808m021585
2867.7E90437174m401922m693568m929602n091191n053818m719794m135012l454864
2884E53957403k777338k130926j550794j076102p71284o74427p33137q49545r96709
$$ y = [694400668, 693801880, 693164229, 692538083, 691949010, 691372216, 690718234, 689937651, 689064562, 688173413, 687313318, 686437428, 685475528, 684429646, 683296978, 682090163, 680852830, 679569840, 678213656, 676767111, 675205529, 673545420, 671851575, 670164526, 668437600, 666601062, 664672852, 662698805, 660685539, 658630013, 656477809, 654175699, 651789904, 649406075, 646964490, 644404590, 641767561, 639022708, 636066854, 632857859, 629432380, 625827968, 622050405, 618203282, 614560962, 611349881, 608586609, 606140614, 603753805, 601116121, 598030567, 594458759, 590437174, 586035252, 581341684, 576412082, 571320891, 566267073, 561547279, 557412267, 553957403, 551180065, 549049139, 547498345, 546422243, 545650959, 544976532, 544243395, 543393850, 542397141]
2902.4E42397141j196146j453578j777351k192557k721369l272414l686786l881156
2918.7E22215784l817499l467441k920746k242148j382173m08709O29843J778066K938092
2937E13323069L914535M633605N111873N348444N412698N450845N507588N500317N414367
2955.4E59617341N321919N239070N081773M779637M389643M031778L757119L569543
2971.7E95787823L471852L403961L327966L206551K960861K652347K409637K204001
2988F19424999J972198J681745J295626R67980P45237N04911K65717j8060l40164n49614
3008.4F25950575o70433q60572j161873j480580j697719j806974j858235j923680k063155
3026.8F12427354k175093k231419k271295k345323k432048k393544k397478k558112
$$ y = [542397141, 541200995, 539747417, 537970066, 535777509, 533056140, 529783726, 526096940, 522215784, 518398285, 514930844, 512010098, 509767950, 508385777, 507977068, 508606911, 510384977, 513323069, 517237604, 521871209, 526983082, 532331526, 537744224, 543195069, 548702657, 554202974, 559617341, 564939260, 570178330, 575260103, 580039740, 584429383, 588461161, 592218280, 595787823, 599259675, 602663636, 605991602, 609198153, 612159014, 614811361, 617220998, 619424999, 621397197, 623078942, 624374568, 625342548, 626087785, 626592696, 626858413, 626840353, 626500189, 625950575, 625280142, 624419570, 623257697, 621777117, 620079398, 618272424, 616414189, 614490509, 612427354, 610252261, 608020842, 605749547, 603404224, 600972176, 598578632, 596181154, 593623042]
3043.1E93623042k692342k734482k687395k642035k725184k803683k823174k858222
3059.4E71656525k800763k677917k638578k723277k860904k888798k741397k545118
3075.7E49779773k532304k707123k803743k770126k767027k769172k774000k866864
3092.1E27789414k887786k743303k581418k580345k705156k702296k565742k523005
3108.4E06500363k612352k559364k367914k378672k533197k697111k822548k719432
3124.7D85809773k481580k373337k446235k520352k388150k177357k206922k463400
3141D66752440k565742k408355k244771k097398j988500k122730k346426k348394k215176
3159.4D46414948k121956k076625k054781k044410k036839j995117j932949j903325
$$ y = [593623042, 590930700, 588196218, 585508823, 582866788, 580141604, 577337921, 574514747, 571656525, 568855762, 566177845, 563539267, 560815990, 557955086, 555066288, 552324891, 549779773, 547247469, 544540346, 541736603, 538966477, 536199450, 533430278, 530656278, 527789414, 524901628, 522158325, 519576907, 516996562, 514291406, 511589110, 509023368, 506500363, 503888011, 501328647, 498960733, 496582061, 494048864, 491351753, 488529205, 485809773, 483328193, 480954856, 478508621, 475988269, 473600119, 471422762, 469215840, 466752440, 464186698, 461778343, 459533572, 457436174, 455447674, 453324944, 450978518, 448630124, 446414948, 444292992, 442216367, 440161586, 438117176, 436080337, 434085220, 432152271, 430248946]
3175.7D30248946j894206j847625j806199j808703j770526j715303j739234j773655
3192D15893495j721173j636208j597315j585394j548797j504570j492560j511425j498907
3210.3D01797146j441271j396775j350492j312405j340121j370877j307100j227558
3226.7C91050547j199573j119375j044184j134247j264304j245975j132548j063913
3243C81846428j016468r69857j018256j057595r88155r15885r16928r26763q79556
3261.3C73156965q33571p98673p10100o18904o83010q50737r18955q87423q48413q08418
3281.7C65198761p51227o90699o32703n52505n00143n81234p57218q57025p72715n66154
3302.1C58537138m36396n49257p96646r63687r92746q98122p72596p08729o91742o59555
$$ y = [430248946, 428354740, 426507115, 424700916, 422892213, 421121687, 419406384, 417667150, 415893495, 414172322, 412536114, 410938799, 409353405, 407804608, 406300038, 404807478, 403296053, 401797146, 400355875, 398959100, 397608608, 396296203, 394956082, 393585205, 392278105, 391050547, 389850974, 388731599, 387687415, 386553168, 385288864, 384042889, 382910341, 381846428, 380829960, 379860103, 378841847, 377784252, 376796097, 375880212, 374963284, 374036521, 373156965, 372323394, 371524721, 370814621, 370195717, 369512707, 368661970, 367743015, 366855592, 366007179, 365198761, 364447534, 363756835, 363124132, 362571627, 362071484, 361490250, 360733032, 359876007, 359103292, 358537138, 358100742, 357551485, 356754839, 355791152, 354798406, 353900284, 353127688, 352418959, 351727217, 351067662]
3322.5C51067662o55621q03381r32306q60602p43300o34759n46396o36518q04126q46595
3342.9C43604058q35061p42376n64396o32614r01491r40591p27027n87553o37680o51300
3363.3C36383969m70490l73751n91367q66026q66115o64115n66095n83202o02364n68748
3383.7C30231696m56273k52724l5882j31339m66346n11289j66059L0846k86997o40004
3404.1C27315629n13852k05487j21713j55747k09450k97815k89798k28882j27464J13904
3424.5C25279325L49492L72022K04891J85430K90514J25944j62482j33544J62691K89946
3444.9C26964229J87368K58505M51684M20928L81291N17458N84125M68850N26399Q69661
3465.3C31630498J006603O52105K16812K31266N05030P47115P48962M60893M85241
$$ y = [351067662, 350412041, 349608660, 348676354, 347815752, 347072452, 346437693, 345891297, 345254779, 344450653, 343604058, 342768997, 342026621, 341462225, 340829611, 339928120, 338987529, 338260502, 337672949, 337035269, 336383969, 335913479, 335539728, 334948361, 334082335, 333216220, 332552105, 331986010, 331402808, 330800444, 330231696, 329775423, 329522699, 329486817, 329355478, 328889132, 328377843, 328211784, 328242630, 327955633, 327315629, 326801777, 326596290, 326474577, 326318830, 326109380, 325811565, 325521767, 325292885, 325165421, 325279325, 325628817, 326000839, 326205730, 326391160, 326681674, 326807618, 326645136, 326511592, 326674283, 326964229, 327151597, 327410102, 327861786, 328282714, 328664005, 329181463, 329765588, 330234438, 330760837, 331630498, 332637101, 333289206, 333506018, 333737284, 334242314, 334989429, 335738391, 336199284, 336684525]
3483.6C36684525P87199P46905O51539P79062Q17269Q27134Q87096Q82953P40856N70566
3504C44375104O17355O96242P64995J033038J112968Q76725P71820R15945J086533
3522.4C52250725R54568O60688O54906R31859J170516J238018J120717J048594J275540
3540.8C61306131J409888J145572R24885J149952J265884J215636J425773J608521
3557.1C71452242J669020J789063J696169J227647J318157K263635K574861K284468
3573.4C86275262K209156K323270K518505K781034K797424K262861J934528K759010
3589.7D05861050L174901K865463K957195L278405L216684L164917L194094K850592
3606D30563301K660870L072113L411740L591419L497898L201723L709674M170120L725886
$$ y = [336684525, 337471724, 338218629, 338870168, 339649230, 340466499, 341293633, 342180729, 343063682, 343804538, 344375104, 344992459, 345688701, 346453696, 347486734, 348599702, 349476427, 350248247, 351164192, 352250725, 353205293, 353865981, 354520887, 355452746, 356623262, 357861280, 358981997, 360030591, 361306131, 362716019, 363861591, 364786476, 365936428, 367202312, 368417948, 369843721, 371452242, 373121262, 374910325, 376606494, 377834141, 379152298, 381415933, 383990794, 386275262, 388484418, 390807688, 393326193, 396107227, 398904651, 401167512, 403102040, 405861050, 409035951, 411901414, 414858609, 418137014, 421353698, 424518615, 427712709, 430563301, 433224171, 436296284, 439708024, 443299443, 446797341, 449999064, 453708738, 457878858, 461604744]
3624.4D61604744K791256K486676L869206M365503L965170L767818L608137L569395
3640.7D90027905L601372L239572K520621K711415M315734M574001L685295L727377
3657E18403292M128873L687620L229678L155112K703309K261579L031910K931356K307415
3675.4E45840144L347457L710091L298282L111720K675593J964748J801670K550781
3691.7E68300486K911806K644539K204299J716792J640916K136171K110720J393139
3708E85058868P38263J199484K384782K435803J815319J384974J309871J335144J491249
3726.4E99153757J688540J274407N58436M46141J377046K156853J607120J65999l2246
3744.7F08396053J423776J022876L50833J614272K179563J423777R68754J362145J378536
$$ y = [461604744, 464396000, 466882676, 470751882, 475117385, 479082555, 482850373, 486458510, 490027905, 493629277, 496868849, 499389470, 502100885, 506416619, 510990620, 514675915, 518403292, 522532165, 526219785, 529449463, 532604575, 535307884, 537569463, 540601373, 543532729, 545840144, 549187601, 552897692, 556195974, 559307694, 561983287, 563948035, 565749705, 568300486, 571212292, 573856831, 576061130, 577777922, 579418838, 581555009, 583665729, 585058868, 585797131, 586996615, 589381397, 591817200, 593632519, 595017493, 596327364, 597662508, 599153757, 600842297, 602116704, 602675140, 603121281, 604498327, 606655180, 608262300, 608428299, 608396053, 609819829, 610842705, 611193538, 612807810, 614987373, 616411150, 617379904, 618742049, 620120585]
3763.1F20120585R90093Q67128P73311J079380J459480J188159O59644N19693Q80063
3781.4F28537536R40203Q94249J055598J042485R07779O04987L89815N47468J57714
3799.8F35077834K44498J254440Q70228P24315J384795J195073L27528J0371L78549
3818.1F41467631N2988O55294J478791J064897P76648N41330M04179N06580J14440
3836.5F47062778o9081O85274J148224J188338J106083O76752m70341j608908K65777
3854.8F49984896K131462J558006N57840l2127L36886N61296L4810K90811P89106R44256
3875.2F57157242P60258N7220K35140N97179L93033O62864M33445J10507O87122P93576
3895.6F61887586R4891l91364k96355K02358R87649J179218O91295L49998J84656m7088
$$ y = [620120585, 621110678, 621977806, 622751117, 623830497, 625289977, 626478136, 627137780, 627657473, 628537536, 629477739, 630371988, 631427586, 632470071, 633377850, 633982837, 634372652, 634920120, 635077834, 635322332, 636576772, 637447000, 638171315, 639556110, 640751183, 641078711, 641089082, 641467631, 641520619, 642175913, 643654704, 644719601, 645496249, 646037579, 646441758, 646948338, 647062778, 646993697, 647678971, 648827195, 650015533, 651121616, 651798368, 651328027, 649719119, 649984896, 652116358, 653674364, 654232204, 654200077, 654536963, 655098259, 655133069, 655423880, 656212986, 657157242, 657917500, 657974720, 658209860, 658807039, 659200072, 659862936, 660296381, 660406888, 661094010, 661887586, 661982477, 661591113, 661294758, 661497116, 662484765, 663663983, 664355278, 664705276, 664889932, 664842844]
3916F64842844P8559M16219K55585M0233L13699L93033R0599J80900N59986N39005
3936.4F67710662K55108j4305m5658K39373K91288J77025L34800M34875K85030J54137
3956.8F69822335J56701K16544L17335L35574J89483R5963J48535J86503J94550K44558
3977.2F71908081K20179J70648J83821J60754J48236J89126J90139J54614J73033J99794
3997.6F73698425
$$ y = [664842844, 664921403, 665337622, 665593207, 665633440, 665947139, 666340172, 666430771, 666611671, 667171657, 667710662, 667965770, 667951465, 667905807, 668145180, 668436468, 668613493, 668948293, 669383168, 669668198, 669822335, 669979036, 670195580, 670512915, 670848489, 671037972, 671133935, 671282470, 671468973, 671663523, 671908081, 672128260, 672298908, 672482729, 672643483, 672791719, 672980845, 673170984, 673325598, 673498631, 673698425]
##END=$$ End of the data block
