##TITLE=$$ Begin of the data block
##JCAMP-DX=5.00 $$ ACD/SpecManager v 10.08
##SPECTROMETER/DATA SYSTEM=Alpha
##DATE=26 Dec 2014 10:25:20
##DATA TYPE=INFRARED SPECTRUM
##DATA CLASS=XYDATA
##ORIGIN=
##OWNER=
##NPOINTS=1765
##FIRSTX=399.76428223
##LASTX=3997.64306641
##MAXX=3997.64306641
##MINX=399.76428223
##MAXY=0.79645509
##MINY=0.23592561
##XFACTOR=1.0000000000
##YFACTOR=1.000000000000000e-9
##FIRSTY=0.50376904
##DELTAX=2.03961372
##XUNITS=1/CM
##YUNITS=ARBITRARY UNITS
##XYDATA=(X++(Y..Y))
$$ plain form
399.8 503769040 500448644 498200923 496600330 495992601 497076303 499683529 502024472 502816558 502565742
418.1 502565742 502051651 501334369 500047922 497753173 494753629 492020398 489882112 487847239 485876083
436.5 485876083 485375047 487710893 492149830 496704549 500276566 503107071 505827904 508034945 508746743
454.8 508746743 508034289 506743014 505521059 503919244 501384377 498177767 495187044 492763400 490055114
473.2 490055114 486759424 483923346 482560694 482586235 482773870 482194364 481546193 481780678 482259989
491.5 482259989 481487572 479193568 476743162 475320488 474230140 472111046 469074130 466041088 463367164
509.9 463367164 460244447 455913872 451083928 447044432 443931252 440938085 438060731 436233044
526.2 436233044 436127186 437256545 438654423 440340996 443627357 449105412 455329299 460107088 462717056
$$ packed form
399.8E03769040l320396k247721j600593o07729J083702K607226K340943P92086k50816
418.1E02565742n14091p17282j286447k294749k999544k733231k138286k034873j971156
436.5D85876083n01036K335846M438937M554719L572017K830505K720833K207041P11798
454.8E08746743p12454j291275j221955j601815k534867l206610k990723k423644k708286
473.2D90055114l295690k836078j362652K5541J87635n79506o48171K34485M79311
491.5D82259989p72417k294004k450406j422674j090348k119094l036916l033042k673924
509.9D63367164l122717m330575m829944m039496l113180k993167k877354j827687
526.2D36233044j05858J129359J397878J686573L286361N478055O223887M777789K609968
$$ plain form
544.6 462717056 464162409 465024084 464694232 462720543 459656060 456594259 453654766 449701488 444128335
562.9 444128335 437722832 431401134 425372243 419865131 415915847 414780021 416789860 421139508
579.3 421139508 426802516 433226854 440146714 446926624 452317923 455550104 457005829 457624137 457931966
597.6 457931966 457808554 457244247 456745386 456762224 457300752 458130360 459057987 460228294 462081641 464967251
618 464967251 468578935 472254544 475984395 479970217 483827591 486892015 488974690 490577817 492204428
636.4 492204428 493799210 494989097 495630562 496170133 497073621 498240381 499250799 499880940 500579834
654.7 500579834 501863658 503389537 504437983 504987836 505019724 504397452 505376756 508056521 509873390
673.1 509873390 511374950 513487160 515601456 516826510 517550409 518830001 520638525 521782219 521483898
$$ packed form
544.6D62717056J445353Q61675l29852j973689l064483l061801k939493l953278n573153
562.9D44128335o405503o321698o028891n507112l949284j135826K009839M349648
579.3D21139508N663008O424338O919860O779910N391299L232181J455725O18308L07829
597.6D57931966j23412n64307m98861J6838N38528Q29608R27627J170307J853347K885610
618D64967251L611684L675609L729851L985822L857374L064424K082675J603127J626611
636.4D92204428J594782J189887O41465N39571R03488J166760J010418O30141O98894
654.7E00579834J283824J525879J048446N49853L1888o22272R79304K679765J816869
673.1E09873390J501560K112210K114296J225054P23899J279592J808524J143694k98321
$$ plain form
691.4 521483898 520356834 519352198 518241227 515998125 512566030 509338200 507517219 506922185 506899238
709.8 506899238 507616997 509857714 513854802 518737555 523624420 528686464 534528613 541004241 546983182
728.1 546983182 551601529 555351913 559184313 562976956 565625906 566585898 566528976 566217065 565232873
746.5 565232873 562545598 558117509 553223133 548867345 544733465 540262163 535965025 533104837
762.8 533104837 532471478 533878922 536887646 541615665 548425734 557002783 566132367 574609041 582110882
781.2 582110882 589027405 595477462 600820959 604731023 607992768 611723304 616192400 620749950
797.5 620749950 624909103 628944933 633148372 637071431 640016437 641959012 643544495 645293534
813.8 645293534 647031367 647994637 647830725 647014797 646024525 644587159 641857326 637537658 632409811
$$ packed form
691.4E21483898j127064j004636j110971k243102l432095l227830j820981n95034k2947
709.8E06899238P17759K240717L997088M882753M886865N062044N842149O475628N978941
728.1E46983182M618347L750384L832400L792643K648950R59992n6922l11911r84192
746.5E65232873k687275m428089m894376m355788m133880m471302m297138k860188
762.8E33104837o33359J407444L008724M728019O810069Q577049R129584Q476674P501841
781.2E82110882O916523O450057N343497L910064L261745L730536M469096M557550
797.5F20749950M159153M035830M203439L923059K945006J942575J585483J749039
813.8F45293534J737833R63270j63912q15928r90272j437366k729833m319668n127847
$$ plain form
832.2 632409811 627335012 622291923 616851449 611256480 606409371 602689624 599468231 595911741
848.5 595911741 591946959 588111699 584459305 580397546 576106191 573605180 575499296 582375109
864.8 582375109 592316985 603352487 614834309 626267076 636171281 642656982 645046592 644257605
881.1 644257605 641498029 637112856 630976796 623689294 616634607 610716701 605573118 600383997
897.4 600383997 595012903 589919508 585042238 579341471 571960509 563231945 553975642 544403791
913.7 544403791 534313262 524151027 515313089 509096026 505479515 503403842 502198279 502128780
930.1 502128780 503581166 506302536 509668529 513458133 517979622 522927940 526488483 526499927 522205651
948.4 522205651 514241874 503430188 490278989 475319237 459263414 442687601 425666809 407962471
$$ packed form
832.2F32409811n074799n043089n440474n594969m847109l719747l221393l556490
848.5E95911741l964782l835260l652394m061759m291355k501011J894116O875813
864.8E82375109R941876J1035502J1481822J1432767R904205O485701K389610p88987
881.1F44257605k759576m385173o136060p287502p054687n917906n143583n189121
897.4F00383997n371094n093395m877270n700767p380962q728564r256303r571851
913.7E44403791j0090529j0162235q837938o217063l616511k075673j205563o9499
930.1E02128780J452386K721370L365993L789604M521489M948318L560543J1444m294276
948.4E22205651p963777j0811686j3151199j4959752j6055823j6575813j7020792j7704338
$$ plain form
964.7 407962471 389547914 370713949 351785332 332954913 314407855 296647072 280514121
979 280514121 266736060 255623996 247203603 241368949 237845957 236203119 235925615 236538678 237704903
997.4 237704903 239204437 240779757 242125154 242999971 243305758 243163139 242825449 242588639 242734835
1015.7 242734835 243443981 244791061 246799320 249361292 252329022 255622923 259072840 262407452
1032 262407452 265364259 267722994 269343495 270333499 271018922 271724433 272668928 274043173 276139289
1050.4 276139289 279336929 283840716 289540648 296354622 304385126 313689440 323626608 332016021
1066.7 332016021 335437298 331731796 322550446 312298447 304608107 300541461 299537957 300772697
1083 300772697 303575575 307441175 312073231 317309976 322887897 328273803 332753956 335816324 337502509
$$ packed form
964.7D07962471j8414557j8833965j8928617j8830419j8547058j7760783j6132951
979B80514121j3778061j1112064q420393n834654l522992j642838k77504O13063J166225
997.4B37704903J499534J575320J345397Q74817L05787j42619l37690k36810J46196
1015.7B42734835P09146J347080K008259K561972K967730L293901L449917L334612
1032B62407452K956807K358735J620501R90004O85423P05511R44495J374245K096116
1050.4B76139289L197640M503787N699932O813974Q030504R304314R937168Q389413
1066.7C32016021L421277l705502r181350j0251999p690340m066646j003504J234740
1083C00772697K802878L865600M632056N236745N577921N385906M480153L062368J686185
$$ plain form
1101.4 337502509 338399053 339291215 340860188 343488276 347135216 351335198 355406344 358845532 361525536
1119.8 361525536 363619894 365512460 367727309 370734513 374729455 379275680 383186847 385015070
1136.1 385015070 383797854 379571646 373151064 365555286 357658505 350175023 343732715 338756084
1152.4 338756084 335330248 333300769 332560360 333209842 335449934 339430511 345252156 352969676 362552196
1170.7 362552196 373768717 386143267 399108976 412308931 425589949 438659012 451056272
1185 451056272 462314129 472056299 480065465 486264139 490735561 493801117 495976508 497805297
1201.3 497805297 499690056 501883328 504641950 508210659 512620270 517625391 522801936 527638435
1217.7 527638435 531625211 534406900 535884798 536155462 535467088 534145713 532490969 530774295 529184282
$$ packed form
1101.4C37502509Q96544Q92162J568973K628088L646940M199982M071146L439188K680004
1119.8C61525536K094358J892566K214849L007204L994942M546225L911167J828223
1136.1C85015070j217216m226208o420582p595778p896781p483482o442308m976631
1152.4C38756084l425836k029479p40409O49482K240092L980577N821645P717520R582520
1170.7C62552196J1216521J2374550J2965709J3199955J3281018J3069063J2397260
1185D51056272J1257857R742170Q009166O198674M471422L065556K175391J828789
1201.3D97805297J884759K193272K758622L568709M409611N005121N176545M836499
1217.7E27638435L986776K781689J477898K70664o88374j321375j654744j716674j590013
$$ plain form
1236 529184282 527773976 526540279 525654376 525480688 526181281 527551413 529304445 531275570 533317387
1254.4 533317387 535149097 536516786 537457943 538332701 539587677 541379273 543460131 545451522 547092795
1272.7 547092795 548210442 548648894 548379004 547651172 546879113 546237528 545516670 544491589 543234706
1291.1 543234706 541917801 540516794 538860142 536922932 534929693 533115506 531478465 529842615
1307.4 529842615 528193057 526759505 525676370 524755239 523666322 522201478 520309627 517808795
1323.7 517808795 514302313 509659231 504358113 499213070 494830221 491404057 488918096 487409234
1340 487409234 486902803 487105876 487563252 487838209 487711996 487316161 486742735 485873789 484706908 483389139
1360.4 483389139 482020080 480829477 479884177 479056537 478605956 478792906 479417831 480027974 480472773
$$ packed form
1236E29184282j410306j233697q85903j73688P00593J370132J753032J971125K041817
1254.4E33317387J831710J367689R41157Q74758J254976J791596K080858J991391J641273
1272.7E47092795J117647M38452k69890p27832p72059o41585p20858j025081j256883
1291.1E43234706j316905j401007j656652j937210j993239j814187j637041j635850
1307.4E29842615j649558j433552j083135r21131j088917j464844j891851k500832
1323.7E17808795l506482m643082n301118n145043m382849l426164k485961j508862
1340D87409234n06431K03073M57376K74957j26213l95835n73426q68946j166881j317769
1360.4D83389139j369059j190603r45300q27640m50581J86950O24925O10143M44799
$$ plain form
1378.8 480472773 480991155 482156783 484593928 488444239 492567122 495706946 497887641 499122679
1395.1 499122679 499209106 498300940 496977776 495551974 493795782 491765112 489625037 487484157 485686272
1413.5 485686272 484400660 483273447 482119799 481531262 481644481 482205212 483063817 484130114 485450029
1431.8 485450029 487085700 489102840 491191059 492932230 494658589 496360391 497644067 498103321
1448.1 498103321 497762918 497105271 496400326 495098889 493171424 492496699 493260264 495473176 499059558
1466.5 499059558 503532112 509677827 518993974 529265702 538011849 545730293 553103745 560393274
1482.8 560393274 567170620 573591292 579896808 585637808 590271890 594620347 599186122 603062749
1499.1 603062749 606220543 609227300 612624168 616324008 618691564 620479167 622581542 624861300
$$ packed form
1378.8D80472773N18382J165628K437145L850311M122883L139824K180695J235038
1395.1D99122679Q6427r08166j323164j425802j756192k030670k140075k140880j797885
1413.5D85686272j285612j127213j153648n88537J13219N60731Q58605J066297J319915
1431.8D85450029J635671K017140K088219J741171J726359J701802J283676M59254
1448.1D98103321l40403o57647p04945j301437j927465o74725P63565K212912L586382
1466.5D99059558M472554O145715R316147J0271728Q746147P718444P373452P289529
1482.8E60393274O777346O420672O305516N741000M634082M348457M565775L876627
1499.1F03062749L157794L006757L396868L699840K367556J787603K102375K279758
$$ plain form
1515.4 624861300 626993299 628768086 630510449 632101655 633294940 634184420 634903371 635740399 636593342
1533.8 636593342 637279212 637811482 637851357 637166500 636487424 635851562 635108113 634264946 633584678 633167922
1554.2 633167922 632797062 631525815 629155576 627918541 627134025 626243591 625098646 623753607 622929275
1572.6 622929275 622326493 621109128 619779289 618898153 618182063 617424965 616448641 615288854 614106774
1590.9 614106774 612962246 611642361 609957457 607989609 605870366 603611767 601055801 598071277
1607.2 598071277 594699025 591342568 588265777 584677637 579982102 576171637 573214293 569797754
1623.5 569797754 566256285 562772632 559471369 557163596 555586755 553660095 551770926 550709367
1639.9 550709367 550321877 550466239 550932169 551651180 552630901 554260910 556776464 558883488 561003983
$$ packed form
1515.4F24861300K131999J774787J742363J591206J193285Q89480P18951Q37028Q52943
1533.8F36593342O85870N32270L9875o84857o79076o35862p43449q43167o80268m16756
1554.2F33167922l70860j271247k370239j237035p84516q90434j144945j345039q24332
1572.6F22929275o02782j217365j329839q81136p16090p57098r76324j159787j182080
1590.9F14106774j144528j319885j684904j967848k119243k258599k555966k984524
1607.2E98071277l372252l356457l076791l588140m695535l810465k957344l416539
1623.5E69797754l541469l483653l301263k307773j576841j926660j889169j061559
1639.9E50709367l87490J44362M65930P19011R79721J630009K515554K107024K120495
$$ plain form
1658.2 561003983 563853264 567620516 571726322 575455368 579598546 584531546 589120150 593913794
1674.5 593913794 599055588 603639305 608073831 613268614 619720340 624954581 629142880 633628547
1690.9 633628547 637939572 642502725 647198439 651234269 655292809 658661664 661515534 664270580
1707.2 664270580 666694641 669148088 671765983 674174249 675575078 675673664 675610065 676160216 677571714
1725.5 677571714 679501951 681648135 683824658 686097622 688156307 689746439 691432595 693435431
1741.9 693435431 695688367 698181808 700935125 704146385 707761407 711231351 714578450 717806697
1758.2 717806697 720744848 723643899 726236999 728413939 730434895 732392609 734297335 735896409
1774.5 735896409 737150609 738355577 739653707 740969419 742202103 743328750 744451046 745667040
$$ packed form
1658.2E61003983K849281L767252M105806L729046M143178M933000M588604M793644
1674.5E93913794N141794M583717M434526N194783O451726N234241M188299M485667
1690.9F33628547M311025M563153M695714M035830M058540L368855K853870K755046
1707.2F64270580K424061K453447K617895K408266J400829R8586o3599N50151J411498
1725.5F77571714J930237K146184K176523K272964K058685J590132J686156K002836
1741.9F93435431K252936K493441K753317L211260L615022L469944L347099L228247
1758.2G17806697K938151K899051K593100K176940K020956J957714J904726J599074
1774.5G35896409J254200J204968J298130J315712J232684J126647J122296J215994
$$ plain form
1790.8 745667040 746909916 747932971 748803496 749691129 750665247 751691103 752658248 753526866 754330814
1809.2 754330814 755163431 756032228 756846189 757530928 758210480 759026647 759920239 760731637 761375606 761919677
1829.6 761919677 762458086 763048768 763580143 763973594 764385343 764948130 765512526 765837371 765987396 766219258
1850 766219258 766625762 767036617 767298639 767429590 767624080 768018663 768521607 768914461 769088447 769229293
1870.3 769229293 769528031 769876599 770126820 770360053 770743310 771301806 771840394 772206664 772485554 772853017
1890.7 772853017 773312032 773651958 773792446 773906469 774165392 774507582 774757564 774857402 774938226 775140464
1911.1 775140464 775401115 775582671 775652885 775759935 776004732 776257694 776369095 776394188 776494026 776722729
1931.5 776722729 776955545 777039170 777055442 777212799 777510285 777749538 777870238 777985632 778183818 778448999
$$ packed form
1790.8G45667040J242876J023055Q70525Q87633R74118J025856R67145Q68618Q03948
1809.2G54330814Q32617Q68797Q13961O84739O79552Q16167Q93592Q11398O43969N44071
1829.6G61919677N38409N90682N31375L93451M11749N62787N64396L24845J50025K31862
1850G66219258M06504M10855K62022J30951J94490L94583N02944L92854J73986J40846
1870.3G69229293K98738L48568K50221K33233L83257N58496N38588L66270K78890L67463
1890.7G72853017M59015L39926J40488J14023K58923L42190K49982R9838Q0824K02238
1911.1G75140464K60651J81556P0214J07050K44797K52962J11401K5093R9838K28703
1931.5G76722729K32816Q3625J6272J57357K97486K39253J20700J15394J98186K65181
$$ plain form
1951.9 778448999 778681695 778831720 778993130 779258192 779562533 779809356 779962599 780075073 780242443 780451417
1972.3 780451417 780601740 780682862 780805469 781018972 781224549 781307936 781315863 781365037 781474292 781565130 781598985
1994.8 781598985 781601727 781590939 781580746 781551182 781451702 781265676 781051517 780848801 780643344 780395687 780039251
2017.2 780039251 779543161 778989196 778439522 777919173 777570784 777360201 777111471 776796937 776406765 775966883
2037.6 775966883 775552034 775195897 774925947 774694026 774400592 774113536 773967862 773934126 773884237 773785412
2058 773785412 773727477 773781955 773900628 773954749 773913801 773885012 773972273 774126887 774190068 774121761 774079800
2080.4 774079800 774176717 774307132 774331808 774302006 774393380 774625719 774839520 774909019 774914145 775038540 775285423
2102.9 775285423 775485873 775550365 775582612 775724351 775940478 776050210 776004255 775946558 776008189 776146650
$$ packed form
1951.9G78448999K32696J50025J61410K65062L04341K46823J53243J12474J67370K08974
1972.3G80451417J50323Q1122J22607K13503K05577Q3387P927M9174J09255R0838L3855
1994.8G81598985K742j0788j0193k9564r9480j86026k14159k02716k05457k47657l56436
2017.2G80039251m96090n53965n49674n20349l48389k10583k48730l14534l90172m39882
2037.6G75966883m14849l56137k69950k31921k93434k87056j45674l3736m9889r8825
2058G73785412n7935N4478J18673N4121m0948k8789Q7261J54614O3181o8307m1961
2080.4G74079800R6917J30415K4676k9802R1374K32339K13801O9499N126J24395K46883
2102.9G75285423K00450O4492L2247J41739K16127J09732m5955n7697O1631J38461
$$ plain form
2123.3 776146650 776179254 776049912 775956452 776049733 776200354 776232243 776156425 776118219 776205659 776323915 776322961
2145.7 776322961 776247501 776284933 776473343 776671410 776765823 776834786 777034521 777382374 777745426 778007209
2166.1 778007209 778234482 778630078 779226720 779779017 780152619 780522704 781057060 781664133 782148957 782484710
2186.5 782484710 782839954 783332825 783862770 784279883 784594595 784956038 785436213 785935283 786328912 786638021
2206.9 786638021 787011206 787506759 787989020 788347900 788669467 789082944 789565861 789974988 790239930 790446639
2227.3 790446639 790717006 791068137 791405916 791634917 791788816 792002916 792291164 792539418 792687058 792779624
2247.7 792779624 792932808 793174922 793387532 793512464 793622673 793794870 794023871 794197917 794293165 794460535
2268.1 794460535 794752538 795059681 795300245 795465827 795643210 795951009 796304643 796455085 796323359 796124518
$$ packed form
2123.3G76146650L2604j29342r3460R3281J50621L1889p5818l8206Q7440J18256r54
2145.7G76322961p5460L7432J88410J98067R4413O8963J99735L47853L63052K61783
2166.1G78007209K27273L95596N96642N52297L73602L70085N34356O07073M84824L35753
2186.5G82484710L55244M92871N29945M17113L14712L61443M80175M99070L93629L09109
2206.9G86638021L73185M95553M82261L58880L21567M13477M82917M09127K64942K06709
2227.3G90446639K70367L51131L37779K29001J53899K14100K88248K48254J47640R2566
2247.7G92779624J53184K42114K12610J24932J10209J72197K29001J74046R5248J67370
2268.1G94460535K92003L07143K40564J65582J77383L07799L53634J50442j31726j98841
$$ plain form
2288.5 796124518 796041608 795987248 795799375 795457125 795066595 794700563 794297576 793706417 792880595 792001486
2308.9 792001486 791289508 790750444 790116489 789046407 787555218 786111951 785062909 784234166 783312798
2327.2 783312798 782362759 781734467 781345844 780707955 779863477 779222071 778998435 779505789 781232715
2345.6 781232715 783147037 783258021 781075120 777741611 774671495 772521913 771655440 771909177 772825301
2363.9 772825301 774314880 776430786 778949380 781469882 783715546 785791993 787944794 790106058
2380.2 790106058 791865766 792909563 793359280 793558717 793660104 793605864 793358266 793053985 792878509
2398.6 792878509 792776406 792528868 792094946 791691840 791479409 791302800 790911376 790343165 789841473 789477408
2419 789477408 789110780 788595736 787956953 787380278 786962688 786558926 785978079 785260201 784620523 784129441
$$ packed form
2288.5G96124518q2910n4360j87873l42250l90530l66032m02987n91159q25822q79109
2308.9G92001486p11978n39064o33955j070082j491189j443267j049042q28743r21368
2327.2G83312798r50039o28292l88623o37889q44478o41406k23636N07354J726926
2345.6G81232715J914322J10984k182901l333509l070116k149582q66473K53737R16124
2363.9G72825301J489579K115906K518594K520502K245664K076447K152801K161264
2380.2G90106058J759708J043797M49717J99437J01387n4240k47598l04281j75476
2398.6G92878509j02103k47538m33922m03106k12431j76609l91424n68211n01692l64065
2419G89477408l66628n15044o38783n76675m17590m03762n80847p17878o39678m91082
$$ plain form
2439.4 784129441 783617198 782967865 782292902 781724453 781234622 780681849 779991567 779299140 778768003 778337598
2459.8 778337598 777813613 777147532 776515782 776070118 775698423 775200546 774574995 773977041 773513079 773093700
2480.2 773093700 772593558 772070885 771629989 771272302 770918250 770482481 770005643 769630492 769404471 769198060
2500.6 769198060 768851399 768410325 768066585 767862916 767642498 767276168 766838312 766461849 766144156 765777647
2521 765777647 765296519 764777601 764326096 763892531 763343155 762656450 761964083 761388183 760870636 760257661
2541.4 760257661 759532392 758834422 758244634 757672071 756980300 756215096 755553067 755014479 754465640 753818750
2561.8 753818750 753123224 752494633 751958787 751444161 750869751 750217617 749588728 749063849 748559117 747973084
2582.2 747973084 747348189 746807992 746387303 745953262 745425284 744920552 744523108 744193614 743845105 743373990
$$ packed form
2439.4G84129441n12243o49333o74963n68449m89831n52773o90282o92427n31137m30405
2459.8G78337598n23985o66081o31750m45664l71695m97877o25551n97954m63962m19379
2480.2G73093700n00142n22673m40896l57687l54052m35769m76838l75151k26021k06411
2500.6G69198060l46661m41074l43740k03669k20418l66330m37856l76463l17693l66509
2521G65777647m81128n18918m51505m33565n49376o86705o92367n75900n17547o12975
2541.4G60257661p25269o97970n89788n72563o91771p65204o62029n38588n48839o46890
2561.8G53818750o95526o28591n35846n14626n74410o52134o28889n24879n04732n86033
2582.2G47973084o24895n40197m20689m34041n27978n04732l97444l29494l48509m71115
$$ plain form
2602.6 743373990 742806852 742292583 741832554 741254926 740483761 739654303 738905072 738174021 737290382 736237407
2623 736237407 735203445 734267712 733271778 732110620 730869174 729672074 728551388 727427304 726205647
2641.3 726205647 724919498 723699868 722577572 721449077 720247686 719043374 717920244 716842353
2657.6 716842353 715720713 714542687 713402987 712383032 711409867 710365415 709277511 708249867
2673.9 708249867 707318723 706407428 705433369 704457879 703558445 702692926 701814473 700909495 699957311 698986888
2694.3 698986888 698037922 697058916 695991158 694877088 693785191 692714870 691615462 690463901 689322650
2712.7 689322650 688257158 687245071 686227262 685186863 684169769 683242857 682389975 681520522 680625141
2731.1 680625141 679770708 679000199 678290904 677544892 676734984 675953567 675221145 674484253 673739433 673013270
$$ packed form
2602.6G43373990n67138n14269m60029n77628p71165q29458p49231p31051q83639j052975
2623G36237407j033962r35733r95934j161158j241446j197100j120686j124084j221657
2641.3G26205647j286149j219630j122296j128495j201391j204312j123130j077891
2657.6G16842353j121640j178026j139700j019955r73165j044452j087904j027644
2673.9G08249867r31144r11295r74059r75490q99434q65519q78453r04978r52184r70423
2694.3F98986888r48966r79006j067758j114070j091897j070321j099408j151561j141251
2712.7F89322650j065492j012087j017809j040399j017094r26912q52882q69453q95381
2731.1F80625141q54433p70509p09295p46012q09908p81417p32422p36892p44820p26163
$$ plain form
2751.4 673013270 672345459 671745002 671152353 670533657 669923604 669344127 668777168 668181181 667499900 666747868
2771.8 666747868 666010559 665284276 664467454 663536012 662562788 661590874 660579085 659479141 658291817
2790.2 658291817 657026172 655698657 654321373 652873337 651326716 649699926 648031056 646311104
2806.5 646311104 644524276 642663777 640704691 638670564 636612236 634504020 632298827 629998982
2822.8 629998982 627626240 625218868 622777641 620199919 617461860 614637911 611702263 608576536
2839.1 608576536 605186999 601496875 597543776 593421996 589326262 585535228 582254052 579484046
2855.5 579484046 577048123 574651003 571977198 568833053 565169156 560995638 556386769 551515400
2871.8 551515400 546517253 541451216 536479831 531851590 527776718 524387896 521671712 519549429
$$ packed form
2751.4F73013270o67811o00457n92649o18696o10053n79477n66959n95987o81281p52032
2771.8F66747868p37309p26283q16822r31442r73224r71914j011789j099944j187324
2790.2F58291817j265645j327515j377284j448036j546621j626790j668870j719952
2806.5F46311104j786828j860499j959086k034127k058328k108216k205193k299845
2822.8F29998982k372742k407372k441227k577722k738059k823949k935648l125727
2839.1F08576536l389537l690124l953099m121780m095734l791034l281176k770006
2855.5E79484046k435923k397120k673805l144145l663897m173518m608869m871369
2871.8E51515400m998147n066037m971385m628241m074872l388822k716184k122283
$$ plain form
2888.1 519549429 517966568 516825378 515964329 515194237 514380217 513474882 512457907 511280179 509831846
2906.5 509831846 507986367 505684257 502899110 499587387 495841682 491964400 488244921 484908491
2922.8 484908491 482186317 480227381 479102671 478901535 479727596 481649429 484624684 488475740 492997020
2941.1 492997020 497995228 503257930 508610249 514014781 519459605 524838507 530119896 535359800
2957.4 535359800 540551305 545582652 550333738 554776847 558912694 562774003 566474319 570106685
2973.8 570106685 573637068 577039361 580348015 583452284 586224377 588726699 591046095 593194425
2990.1 593194425 595096469 596640468 597873092 598833859 599434793 599721551 599799812 599661052 599296570
3008.4 599296570 598703563 597839832 596703708 595314264 593696237 591923654 590050220 588088691 586047471
$$ packed form
2888.1E19549429j582861j141190q61049p70092q14020r05335j016975j177728j448333
2906.5E09831846j845479k302110k785147l311723l745705l877282l719479l336430
2922.8D84908491k722174j958936j124710k01136Q26061J921833K975255L851056M521280
2941.1D92997020M998208N262702N352319N404532N444824N378902N281389N239904
2957.4E35359800N191505N031347M751086M443109M135847L861309L700316L632366
2973.8E70106685L530383L402293L308654L104269K772093K502322K319396K148330
2990.1E93194425J902044J543999J232624R60767O00934K86758P8261j38760l64482
3008.4E99296570n93007q63731j136124j389444j618027j772583j873434j961529k041220
$$ plain form
3026.8 586047471 583925188 581729233 579500616 577183902 574698269 572180390 569715202 567180574
3043.1 567180574 564527452 561814964 559104204 556378126 553617299 550899148 548174441 545335531
3059.4 545335531 542501628 539827824 537262559 534611344 531774998 528887987 526124656 523551404
3075.7 523551404 521063864 518410385 515578568 512792587 510075569 507365108 504654467 501857221
3092.1 501857221 499033451 496386677 493899584 491355091 488653243 485958248 483433425 480983108
3108.4 480983108 478428751 475898534 473575175 471264452 468806565 466246247 463603884 461007535
3124.7 461007535 458576918 456240714 453903496 451545537 449214518 446966588 444737732 442392588
3141 442392588 439994156 437699646 435514539 433471173 431568772 429579884 427352458 425034583 422812343
$$ packed form
3026.8E86047471k122283k195955k228617k316714k485633k517879k465188k534628
3043.1E67180574k653122k712488k710760k726078k760827k718151k724707k838910
3059.4E45335531k833903k673804k565265k651215k836346k887011k763331k573252
3075.7E23551404k487540k653479k831817k785981k717018k710461k710641k797246
3092.1E01857221k823770k646774k487093k544493k701848k694995k524823k450317
3108.4D80983108k554357k530217k323359k310723k457887k560318k642363k596349
3124.7D61007535k430617k336204k337218k357959k331019k247930k228856k345144
3141D42392588k398432k294510k185107k043366j902401j988888k227426k317875k222240
$$ plain form
3159.4 422812343 420763016 418847561 416925818 414960265 413029641 411169618 409332007 407482266
3175.7 407482266 405641675 403817892 402027577 400326729 398692310 397057533 395428538 393797725
3192 393797725 392150223 390506536 388920933 387447208 386051089 384655029 383230388 381791413 380392939
3210.3 380392939 379067957 377765238 376463324 375172824 373899966 372687936 371523768 370362818
3226.7 370362818 369252890 368254900 367319643 366256863 365009278 363788992 362704456 361727029 360845238
3245 360845238 359948307 358938426 357928693 357050776 356237561 355359972 354446411 353596270 352794141 352023065
3265.4 352023065 351370990 350850910 350264817 349476904 348592699 347744823 346983135 346268535 345562309 344892770
3285.8 344892770 344303608 343836010 343397617 342813730 342078358 341301590 340584934 340022117 339590043 339080155
$$ packed form
3159.4D22812343k049327j915455j921743j965553j930624j860023j837611j849741
3175.7D07482266j840591j823783j790315j700848j634419j634777j628995j630813
3192C93797725j647502j643687j585603j473725j396119j396060j424641j438975j398474
3210.3C80392939j324982j302719j301914j290500j272858j212030j164168j160950
3226.7C70362818j109928r97990r35257j062780j247585j220286j084536r77427q81791
3245C60845238q96931j009881j009733q77917q13215q77589r13561q50141q02129p71076
3265.4C52023065o52075n20080n86093p87913q84205q47876p61688p14600p06226o69539
3285.8C44892770n89162m67598m38393n83887p35372p76768p16656n62817m32074n09888
$$ plain form
3306.2 339080155 338324964 337390482 336456597 335640997 334931552 334244549 333541483 332873017 332251281 331509680
3326.6 331509680 330590874 329687834 328917056 328267217 327686310 327038169 326234311 325354904 324465632 323656231
3347 323656231 323054940 322453827 321586400 320634753 319856614 319206119 318534136 317838132 317296118 316857427
3367.4 316857427 316174656 315178543 314191997 313438863 312815458 312205046 311582655 310996294 310547382 310305923
3387.8 310305923 310250640 310085118 309552908 308943659 308714360 308750659 308493644 307854176 307346821 307154208
3408.2 307154208 307021618 306826144 306543440 306231022 306043655 305930078 305792361 305761784 305927485 306187928
3428.6 306187928 306397557 306635857 306992471 307202458 307078093 306905210 307001412 307327628 307717830 308085859
3449 308085859 308443785 308820873 309280038 309887826 310542524 311030120 311479777 312250793 313213050 313889742
$$ packed form
3306.2C39080155p55191r34482r33885q15600p09445o87003p03066o68466o21736p41601
3326.6C31509680r18806r03040p70778o49839n80907o48141q03858q79407q89272q09401
3347C23656231o01291o01113q67427r51647p78139o50495o71983o96004n42014m38691
3367.4C16857427o82771r96113r86546p53134o23405o10412o22391n86361m48912k41459
3387.8C10305923n5283j65522n32210o09249k29299L6299k57015o39468n07355j92613
3408.2C07154208j32590j95474k82704l12418j87367j13577j37717l0577J65701K60443
3428.6C06187928K09629K38300L56614K09987j24365j72883R6202L26216L90202L68029
3449C08085859L57926L77088M59165O07788O54698M87596M49657P71016R62257O76692
$$ plain form
3469.4 313889742 314191848 314495742 315021038 315784425 316622913 317218006 317734241 318470359 319206268 319824964
3489.8 319824964 320560157 321450502 322365403 323194534 323974043 324788302 325500429 326084912 326755911 327593684
3510.2 327593684 328583807 329568863 330385834 331183463 332145929 333294451 334362715 335134953 335861951
3528.5 335861951 336810619 337957382 339222789 340416193 341404349 342501581 343890399 345250010 346319973
3546.9 346319973 347352177 348537117 349789590 351116359 352585793 354208499 355919510 357556194
3563.2 357556194 359092951 360919088 363114834 365206093 367134124 369210511 371522933 374036074
3579.5 374036074 376737714 379444808 381906152 384211451 386840016 389637262 392362565 395247608
3595.8 395247608 398433000 401673555 404837877 407981187 411059231 414241463 417646289 421083033
$$ packed form
3469.4C13889742L02106L03894N25296P63387Q38488N95093N16235P36118P35909O18696
3489.8C19824964P35193Q90345R14901Q29131P79509Q14259P12127N84483O70999Q37773
3510.2C27593684R90123R85056Q16971P97629R62466J148522J068264P72238P26998
3528.5C35861951R48668J146763J265407J193404R88156J097232J388818J359611J069963
3546.9C46319973J032204J184940J252473J326769J469434J622706J711011J636684
3563.2C57556194J536757J826137K195746K091259J928031K076387K312422K513141
3579.5C74036074K701640K707094K461344K305299K628565K797246K725303K885043
3595.8C95247608L185392L240555L164322L143310L078044L182232L404826L436744
$$ plain form
3612.1 421083033 424573094 427987218 431293666 434926122 438609332 441967398 444990963 448175937
3628.5 448175937 452146560 456092983 459789783 463435799 467020899 470642835 474367112 478009164
3644.8 478009164 481411338 484969407 488999665 492787659 496170521 499789566 503581703 507001936
3661.1 507001936 510177076 513445258 516596496 519565344 522832751 525812626 528312922 531179309
3677.4 531179309 534143746 536991775 539916933 542806566 545490503 547807515 549894094 552007556
3693.7 552007556 554153442 556211472 558068812 559885144 561897337 563949406 565841854 567521155
3710 567521155 569146812 571015954 572832286 574317992 575594902 576840699 577986538 579226077 580878913
3728.4 580878913 582603574 584045351 585244298 586672127 588427901 589913368 590634048 591288805 592851698
$$ packed form
3612.1D21083033L490061L414124L306448L632456L683210L358066L023565L184974
3628.5D48175937L970623L946423L696800L646016L585100L621936L724277L642052
3644.8D78009164L402174L558069M030258L787994L382862L619045L792137L420233
3661.1E07001936L175140L268182L151238K968848L267407K979875K500296K866387
3677.4E31179309K964437K848029K925158K889633K683937K317012K086579K113462
3693.7E52007556K145886K058030J857340J816332K012193K052069J892448J679301
3710E67521155J625657J869142J816332J485706J276910J245797J145839J239539J652836
3728.4E80878913J724661J441777J198947J427829J755774J485467P20680O54757J562893
$$ plain form
3746.7 592851698 594101667 594788611 596041560 597562850 598630786 599389613 600425959 601606309 602682412
3765.1 602682412 603697717 604481220 605260134 606276155 607361555 608352721 609170914 609971881 610728383
3783.5 610728383 611463368 612348139 613308370 614222825 615013599 615804732 616799116 617484748 617823780 618545890
3803.9 618545890 619168222 619745553 620726049 621734083 622442842 623080492 623867273 624191999 624549508
3822.2 624549508 625455260 626314640 627039254 627629161 628260076 629073799 629614294 629828095 630183220 630701125
3842.6 630701125 631396115 632287741 633180737 633573532 633184850 633413732 634457231 635264635 635733902
3861 635733902 635946453 636317313 636893809 637208283 637534142 638018906 638608634 639207006 639518559 639989197
3881.4 639989197 640653253 641090691 641534448 641829491 641955376 642423511 643049657 643386006 643505216 643635273
$$ packed form
3746.7E92851698J249969O86944J252949J521290J067936P58827J036346J180350J076103
3765.1F02682412J015305P83503P78914J016021J085400R91166Q18193Q00967P56502
3783.5F10728383P34985Q84771R60231R14455P90774P91133R94384O85632L39032P22110
3803.9F18545890O22332N77331R80496J008034P08759O37650P86781L24726L57509
3822.2F24549508R05752Q59380P24614N89907O30915Q13723N40495K13801L55125N17905
3842.6F30701125O94990Q91626Q92996L92795l88682K28882J043499Q07404M69267
3861F35733902K12551L70860N76496L14474L25859M84764N89728N98372L11553M70638
3881.4F39989197O64056M37438M43757K95043J25885M68135O26146L36349J19210J30057
$$ plain form
3901.8 643635273 643809497 644166589 644607425 644930601 645243526 645548105 645709217 645861387 646148741 646429658
3922.1 646429658 646658897 646960676 647252977 647405744 647604287 647939503 648163140 648258388 648338914 648523390
3942.5 648523390 648937166 649291575 649431705 649594009 649814248 649989903 650143683 650376976 650688052 650969326
3962.9 650969326 651157320 651312590 651541233 651797235 651934981 652009130 652183115 652403653 652591348 652777910
3983.3 652777910 652989268 653201878 653388798 653569400 653728247 653824031 653869092
3997.6 653869092
$$ packed form
3901.8F43635273J74224L57092M40836L23176L12925L04579J61112J52170K87354K80917
3922.1F46429658K29239L01779K92301J52767J98543L35216K23637R5248Q0526J84476
3942.5F48523390M13776L54409J40130J62304K20239J75655J53780K33293L11076K81274
3962.9F50969326J87994J55270K28643K56002J37746P4149J73985K20538J87695J86562
3983.3F52777910K11358K12610J86920J80602J58847R5784M5061
3997.6F53869092
##END=$$ End of the data block
