##TITLE=$$ Begin of the data block
##JCAMP-DX=5.00 $$ ACD/SpecManager v 10.08
##SPECTROMETER/DATA SYSTEM=Alpha
##DATE=26 Dec 2014 10:25:20
##DATA TYPE=INFRARED SPECTRUM
##DATA CLASS=XYDATA
##ORIGIN=
##OWNER=
##NPOINTS=1765
##FIRSTX=399.76428223
##LASTX=3997.64306641
##MAXX=3997.64306641
##MINX=399.76428223
##MAXY=0.79784703
##MINY=0.23615523
##XFACTOR=1.0000000000
##YFACTOR=1.000000000000000e-9
##FIRSTY=0.50741178
##DELTAX=2.03961372
##XUNITS=1/CM
##YUNITS=ARBITRARY UNITS
##XYDATA=(X++(Y..Y))
$$ plain form
399.8 507411778 504088998 502053142 500297546 499001861 499590158 502509296 505626678 506839931 506133378
418.1 506133378 504693031 503654003 502427518 499914110 496459514 493531823 491631925 489897788
434.4 489897788 487831414 487016797 489165902 493554354 498181880 501972377 504978001 507627070 509703934
452.8 509703934 510435224 509722173 508258104 506896079 505415916 503116071 499796689 496475428 494034946
471.2 494034946 491658837 488644034 485777438 484265596 484113634 484076917 483417392 482813895 482988149
489.5 482988149 483285993 482407123 480194747 478059828 476998329 475957274 473515719 470095307 466985822
507.9 466985822 464501053 461471409 457063168 452086270 447856814 444624543 441740394 439169168
524.2 439169168 437569141 437500089 438548714 439728528 441155285 444273740 449741155 456004471 460783631
$$ packed form
399.8E07411778l322780k035856j755596j295685N88297K919138L117382J213253p06553
418.1E06133378j440347j039028j226485k513408l454596k927691j899898j734137
434.4D89897788k066374q14617K149105M388452M627526L790497L005624K649069K076864
452.8E09703934P31290p13051j464069j362025j480163k299845l319382l321261k440482
471.2D94034946k376109l014803k866596j511842j51962l6717o59525o03497J74254
489.5D82988149K97844q78870k212376k134919j061499j041055k441555l420412l109485
507.9D66985822k484769l029644m408241m976898m229456l232271k884149k571226
524.2D39169168j600027o9052J048625J179814J426757L118455N467415O263316M779160
$$ plain form
542.5 460783631 463426471 464926243 465886623 465614557 463571280 460524052 457556278 454481423 450311273
560.9 450311273 444835663 438749701 432545513 426330626 420683831 416748554 415565491 417488098
577.2 417488098 421872854 427646518 434129566 441100806 447936922 453337133 456557631 457966179
593.5 457966179 458583057 459013849 458949447 458190292 457378358 457278728 457923174 458864570 459881663 461203307
613.9 461203307 463210404 466119677 469627380 473209798 476862699 480688214 484401941 487517834
630.2 487517834 489823997 491628170 493369520 495062709 496277303 496793240 497152150 498030156 499300033
648.6 499300033 500326991 500894070 501564026 502874792 504371583 505226254 505578041 505626857 505263686
667 505263686 506489694 509121656 510844529 512320459 514355242 516343951 517612040 518513918 519857347
$$ packed form
542.5D60783631K642840J499772R60380k72066k043277l047228k967774l074855m170150
560.9D50311273n475610o085962o204188o214887n646795l935277j183063J922607
577.2D17488098M384756N773664O483048O971240O836116N400211L220498J408548
593.5D57966179O16878M30792o4402p59155q11934r9630O44446R41396J017093J321644
613.9D61203307K007097K909273L507703L582418L652901L825515L713727L115893
630.2D87517834K306163J804173J741350J693189J214594N15937L58910Q78006J269877
648.6D99300033J026958N67079O69956J310766J496791Q54671L51787M8816l63171
667E05263686J226008K631962J722873J475930K034783J988709J268089R01878J343429
$$ plain form
685.3 519857347 521591246 522673607 522451460 521453381 520422876 519139111 516755521 513289273 510039210
703.7 510039210 508156836 507566452 507615268 508322060 510511220 514531016 519450426 524357557 529448569
722 529448569 535303771 541806996 547890246 552597225 556280613 559992433 563761234 566435695 567403078
740.4 567403078 567322075 566977859 565969050 563217223 558711290 553799927 549463093 545369267 540952981
758.7 540952981 536652744 533748806 533106208 534562409 537633717 542347491 549108863 557741940 567000628
777.1 567000628 575498760 582904398 589752674 596210897 601606369 605556726 608825803 612557828
793.4 612557828 617011011 621556640 625713229 629712701 633921742 637921274 640955687 642986059
809.7 642986059 644589961 646246731 647849500 648716569 648498535 647663474 646696091 645235121 642423987
$$ packed form
685.3E19857347J733899J082361k22147r98079j030505j283765k383590l466248l250063
703.7E10039210j882374n90384M8816P06792K189160M019796M919410M907131N091012
722E29448569N855202O503225O083250M706979L683388L711820L768801K674461R67383
740.4E67403078q1003l44216j008809k751827m505933m911363m336834m093826m416286
758.7E40952981m300237k903938o42598J456201L071308M713774O761372Q633077R258688
777.1E67000628Q498132P405638O848276O458223N395472L950357L269077L732025
793.4F12557828M453183M545629M156589L999472M209041L999532L034413K030372
809.7F42986059J603902J656770J602769Q67069k18034q35061r67383j460970k811134
$$ plain form
828.1 642423987 638087571 633025050 628015339 622934282 617381096 611750424 606899977 603116810
844.4 603116810 599857330 596332252 592426956 588645697 585017800 580944836 576576591 573997915
860.7 573997915 575935304 582874298 592812538 603875935 615388870 626739383 636536419 643019497
877 643019497 645430148 644642949 641899943 637488663 631275177 623931885 616885483 610984206 605803549
895.4 605803549 600565314 595178843 590080440 585189342 579462826 572034717 563259125 553996861
911.7 553996861 544496357 534485042 524336457 515528917 509345710 505684078 503565133 502361357
928 502361357 502272010 503714561 506462514 509840250 513624728 518113077 523017645 526575089 526596367
946.4 526596367 522280574 514275968 503445804 490312189 475376844 459327549 442728966 425658673
$$ packed form
828.1F42423987m336416n062521n009711n081057n553186n630672m850447l783167
844.4F03116810l259480l525078l905296l781259l627897m072964m368245k578676
860.7E73997915J937389O938994R938240J1063397J1512935J1350513R797036O483078
877F43019497K410651p87199k743006m411280o213486p343292p046402n901277n180657
895.4F05803549n238235n386471n098403m891098n726516p428109q775592r262264
911.7E53996861r500504j0011315j0148585q807540o183207l661632k118945j203776
928E02361357q9347J442551K747953L377736L784478M488349M904568L557444K1278
946.4E26596367m315793q004606j0830164j3133615j4935345j6049295j6598583j7070293
$$ plain form
962.7 425658673 407913864 389474332 370618969 351693779 332897216 314425081 296757728
977 296757728 280649364 266857773 255787998 247419909 241581693 238042906 236422360 236155227
993.3 236155227 236730635 237858146 239336118 240919277 242287144 243144155 243420035 243279427 242947266
1011.6 242947266 242698342 242840096 243589133 244998723 247022256 249575764 252570778 255868703 259278744
1030 259278744 262598723 265554637 267893881 269519836 270565063 271284848 271975309 272914529 274297625
1048.4 274297625 276390642 279550463 283990890 289686650 296570331 304658622 313955724 323829055
1064.7 323829055 332135409 335506260 331811041 322669268 312487900 304897696 300886273 299880505
1081 299880505 301105142 303901941 307725579 312267512 317430884 323032171 328508586 333026350 336072981
$$ packed form
962.7D25658673j7744809j8439532j8855363j8925190j8796563j8472135j7667353
977B96757728j6108364j3791591j1069775q368089n838216l538787j620546k67133
993.3B36155227N75408J127511J477972J583159J367867Q57011K75880j40608l32161
1011.6B42947266k48924J41754P49037J409590K023533K553508K995014L297925L410041
1030B59278744L319979K955914K339244J625955J045227P19785O90461R39220J383096
1048.4B74297625K093017L159821M440427N695760O883681Q088291R297102R873331
1064.7C23829055Q306354L370851l695219r141773j0181368p590204m011423j005768
1081B99880505J224637K796799L823638M541933N163372N601287N476415M517764L046631
$$ plain form
1099.4 336072981 337733656 338590831 339470148 341081917 343751043 347335070 351424307 355494082 358995169
1117.7 358995169 361689299 363791287 365715295 367940694 370940864 374940336 379494011 383397520
1134 383397520 385211915 383978724 379720122 373267263 365686506 357854247 350425243 344005376 339038551
1152.4 339038551 335605770 333576143 332862616 333510458 335699499 339646757 345491976 353273839 362911612
1170.7 362911612 374110878 386418998 399353772 412554204 425822526 438885361 451294720
1185 451294720 462565511 472315758 480328143 486519009 490965605 494013011 496183962 498014838
1201.3 498014838 499929726 502178133 504985571 508562326 512925863 517878234 523035407 527863264
1217.7 527863264 531841695 534623146 536094427 536368370 535716891 534432113 532786906 531059682 529454112
$$ packed form
1099.4C36072981J660675Q57175Q79317J611769K669126L584027M089237M069775L501087
1117.7C58995169K694130K101988J924008K225399L000170L999472M553675L903509
1134C83397520J814395j233191m258602o452859p580757p832259p429004o419867m966825
1152.4C39038551l432781k029627p13527O47842K189041L947258N845219P781863R637773
1170.7C62911612J1199266J2308120J2934774J3200432J3268322J3062835J2409359
1185D51294720J1270791R750247Q012385O190866M446596L047406K170951J830876
1201.3D98014838J914888K248407K807438L576755M363537M952371N157173M827857
1217.7E27863264L978431K781451J471281K73943o51479j284778j645207j727224j605570
$$ plain form
1236 529454112 528028607 526775837 525881052 525715530 526442945 527841032 529592931 531537175 533549964
1254.4 533549964 535379708 536761940 537711322 538605154 539885581 541676462 543738961 545731544 547397077
1272.7 547397077 548541903 548991024 548712730 547976553 547201872 546562791 545856595 544843793 543577909
1291.1 543577909 542247176 540868402 539265871 537351131 535335481 533510923 531890154 530246377
1307.4 530246377 528550863 527060270 525932908 525017560 523968279 522528648 520631671 518105507
1323.7 518105507 514596701 509992599 504733324 499583155 495160073 491726965 489264011 487736136
1340 487736136 487194628 487417221 487900168 488159806 488013983 487598211 486994207 486118227 484970897 483649403
1360.4 483649403 482257038 481084973 480190217 479388326 478928357 479103535 479711056 480293661 480734736
$$ packed form
1236E29454112j425505j252770q94785j65522P27415J398087J751899J944244K012789
1254.4E33549964J829744J382232R49382Q93832J280427J790881K062499J992583J665533
1272.7E47397077J144826M49121k78294p36177p74681o39081p06196j012802j265884
1291.1E43577909j330733j378774j602531j914740k015650j824558j620769j643777
1307.4E30246377j695514j490593j127362r15348j049281j439631j896977k526164
1323.7E18105507l508806m604102n259275n150169m423082l433108k462954j527875
1340D87736136n41508K22593M82947K59638j45823m15772o04004q75980j147330j321494
1360.4D83649403j392365j172065q94756q01891m59969J75178O07521N82605M41075
$$ plain form
1378.8 480734736 481286496 482478946 484897822 488700002 492783070 495923132 498125076 499345481
1395.1 499345481 499394745 498479843 497157663 495716780 493952394 491939634 489835143 487733066 485959589
1413.5 485959589 484669030 483510196 482334286 481765836 481897980 482450426 483297229 484379679 485749424
1431.8 485749424 487421393 489424825 491472900 493188649 494899690 496595412 497888505 498357505
1448.1 498357505 498011559 497340858 496615529 495288789 493368834 492730021 493528217 495751381 499342293
1466.5 499342293 503845155 510003448 519294798 529540360 538266003 545984149 553387463 560706377
1482.8 560706377 567497492 573927283 580235064 585981369 590633154 594995797 599557519 603431225
1499.1 603431225 606604576 609623432 613011837 616693079 619077623 620892525 623006761 625306606
$$ packed form
1378.8D80734736N51760J192450K418876L802180M083068L140062K201944J220405
1395.1D99345481M9264r14902j322180j440883j764386k012760k104491k102077j773477
1413.5D85959589j290559j158834j175910n68450J32144N52446Q46803J082450J369745
1431.8D85749424J671969K003432K048075J715749J711041J695722J293093M69000
1448.1D98357505l45946o70701p25329j326740j919955o38813P98196K223164L590912
1466.5D99342293M502862O158293R291350J0245562Q725643P718146P403314P318914
1482.8E60706377O791115O429791O307781N746305M651785M362643M561722L873706
1499.1F03431225L173351L018856L388405L681242K384544J814902K114236K299845
$$ plain form
1515.4 625306606 627472818 629256964 631003678 632650077 633898377 634766877 635425031 636237383 637109458
1533.8 637109458 637812376 638335347 638378203 637740612 637075424 636401713 635621965 634780467 634120703 633721352
1554.2 633721352 633356512 632052064 629644573 628423870 627662182 626778781 625639856 624318421 623523712
1572.6 623523712 622931778 621703744 620356798 619463146 618746936 617976248 616969764 615796208 614603937
1590.9 614603937 613445342 612121642 610437393 608474374 606377959 604156792 601630270 598661423
1607.2 598661423 595282078 591887832 588783085 585207820 580557525 576782107 573835731 570419788
1623.5 570419788 566883504 563404083 560097098 557790220 556226850 554309666 552409053 551326215
1639.9 551326215 550932884 551096439 551587284 552321732 553331494 555018663 557560384 559632003 561709225
$$ packed form
1515.4F25306606K166212J784146J746714J646399J248300Q68500O58154Q12352Q72075
1533.8F37109458P02918N22971M2856o37591o65188o73711p79748q41498o59764l99351
1554.2F33721352l64840j304448k407491j220703p61688q83401j138925j321435p94709
1572.6F23523712n91934j228034j346946q93652p16210p70688j006484j173556j192271
1590.9F14603937j158595j323700j684249j963019k096415k221167k526522k968847
1607.2E98661423l379345l394246l104747l575265m650295l775418k946376l415943
1623.5E70419788l536284l479421l306985k306878j563370j917184j900613j082838
1639.9E51326215l93331J63555M90845P34448J009762J687169K541721K071619K077222
$$ plain form
1658.2 561709225 564545274 568358481 572524071 576273084 580411911 585357487 589982331 594798386
1674.5 594798386 599919856 604459107 608848155 613992691 620421410 625685096 629905581 634407103
1690.9 634407103 638714850 643262923 647957981 652005494 656068563 659444809 662299633 665053010
1707.2 665053010 667488813 669960797 672588348 674996972 676425457 676581562 676552951 677082360 678448498
1725.5 678448498 680379868 682562530 684764147 687015355 689020932 690587699 692268610 694264054
1741.9 694264054 696495950 698958457 701709509 704958200 708601534 712094605 715474248 718706191
1758.2 718706191 721622169 724522114 727138519 729319453 731319189 733256698 735157788 736778140
1774.5 736778140 738056481 739256620 740548193 741879880 743116617 744230568 745334089 746538281
$$ packed form
1658.2E61709225K836049L813207M165590L749013M138827M945576M624844M816055
1674.5E94798386N121470M539251M389048N144536O428719N263686M220485M501522
1690.9F34407103M307747M548073M695058M047513M063069L376246K854824K753377
1707.2F65053010K435803K471984K627551K408624J428485J56105k8611N29409J366138
1725.5F78448498J931370K182662K201617K251208K005577J566767J680911J995444
1741.9F94264054K231896K462507K751052L248691L643334L493071L379643L231943
1758.2G18706191K915978K899945K616405K180934J999736J937509J901090J620352
1774.5G36778140J278341J200139J291573J331687J236737J113951J103521J204192
$$ plain form
1790.8 746538281 747812390 748868823 749733269 750608444 751583397 752609432 753566265 754429758 755247116
1809.2 755247116 756103516 756991446 757800817 758477628 759178102 760011375 760883629 761669278 762309134 762835741
1829.6 762835741 763354421 763968170 764539480 764939368 765339792 765906155 766470611 766799748 766967416 767193973
1850 767193973 767578781 767997801 768296242 768454909 768667221 769066393 769528270 769862115 770015240 770174563
1870.3 770174563 770510375 770900428 771181285 771418810 771771371 772292137 772837341 773238838 773514748 773848951
1890.7 773848951 774306118 774671793 774826705 774940789 775197983 775526047 775744677 775832117 775933146 776153862
1911.1 776153862 776421964 776612461 776689827 776790142 777016759 777257681 777368784 777396977 777516127 777773261
1931.5 777773261 778010607 778086364 778092623 778236270 778529704 778777838 778896928 778986275 779177785 779468596
$$ packed form
1790.8G46538281J274109J056433Q64446Q75175R74953J026035R56833Q63493Q17358
1809.2G55247116Q56400Q87930Q09371O76811P00474Q33273Q72254P85649O39856N26607
1829.6G62835741N18680O13749N71310L99888M00424N66363N64456L29137J67668K26557
1850G67193973L84808M19020K98441J58667K12312L99172M61877L33845J53125J59323
1870.3G70174563L35812L90053K80857K37525L52561N20766N45204M01497K75910L34203
1890.7G73848951M57167L65675J54912J14084K57194L28064K18630Q7440J01029K20716
1911.1G76153862K68102J90497P7366J00315K26617K40922J11103K8193J19150K57134
1931.5G77773261K37346P5757O259J43647K93434K48134J19090Q9347J91510K90811
$$ plain form
1951.9 779468596 779716849 779871047 780031502 780274689 780561566 780820131 780990303 781114161 781289279 781519055
1972.3 781519055 781720459 781820238 781891465 782047331 782235265 782336652 782365978 782419086 782533944 782643318
1992.7 782643318 782699645 782715321 782705247 782689571 782623947 782482386 782321155 782158554 781964362 781744838
2013.1 781744838 781486809 781118631 780619800 780081391 779544592 779021025 778658092 778447449 778213561 777902484
2033.5 777902484 777511895 777056992 776631892 776308954 776069045 775844216 775557339 775260389 775085211 775032580
2053.9 775032580 774984479 774895906 774865031 774949431 775068343 775123775 775105059 775089860 775173724 775314093 775359869
2076.4 775359869 775290906 775258660 775360644 775495648 775529861 775515497 775601447 775806725 776017725 776129007
2096.8 776129007 776177704 776307046 776538074 776714385 776757240 776793957 776957691 777192831 777317107 777271152
$$ packed form
1951.9G79468596K48253J54198J60455K43187K86877K58565J70172J23858J75118K29776
1972.3G81519055K01404R9779P1227J55866J87934J01387K9326N3108J14858J09374
1992.7G82643318N6327J5676j0074j5676o5624j41561j61231j62601j94192k19524
2013.1G81744838k58029l68178m98831n38409n36799n23567l62933k10643k33888l11077
2033.5G77902484l90589m54903m25100l22938k39909k24829k86877k96950j75178n2631
2053.9G75032580m8101q8573l0875Q4400J18912N5432j8716j5199Q3864J40369M5776
2076.4G75359869o8963l2246J01984J35004L4213j4364Q5950K05278K11000J11282
2096.8G76129007M8697J29342K31028J76311M2855L6717J63734K35140J24276m5955
$$ plain form
2117.1 777271152 777193308 777247190 777393341 777430356 777305543 777216494 777310550 777455986 777482212 777402937 777363598
2139.6 777363598 777446270 777534902 777506530 777458847 777549326 777757585 777936697 777994215 778047144 778278768 778660297
2162 778660297 779025316 779283106 779506683 779924750 780569077 781136036 781479597 781810939 782330990 782949924
2182.4 782949924 783466578 783826053 784169555 784645319 785165012 785586417 785928488 786298692 786753237 787225723
2202.8 787225723 787615597 787937880 788333297 788862228 789370596 789732099 790036023 790409386 790836513 791207016
2223.2 791207016 791494966 791761279 792068064 792431712 792768478 792993367 793144763 793353021 793645620 793895841
2243.6 793895841 794025838 794115841 794295073 794553399 794767141 794895709 795011044 795171499 795359850 795508146
2264 795508146 795617640 795795083 796078682 796375513 796607375 796792090 797030509 797381759 797720015 797847033
$$ packed form
2117.1G77271152p7844N3882J46151L7015j24813q9049R4056J45436K6226p9275l9339
2139.6G77363598Q2672Q8632k8372m7683R0479K08259J79112N7518N2929K31624L81529
2162G78660297L65019K57790K23577M18067O44327N66959L43561L31342N20051O18934
2182.4G82949924N16654L59475L43502M75764N19693M21405L42071L70204M54545M72486
2202.8G87225723L89874L22283L95417N28931N08368L61503L03924L73363M27127L70503
2223.2G91207016K87950K66313L06785L63648L36766K24889J51396K08258K92599K50221
2243.6G93895841J29997R0003J79232K58326K13742J28568J15335J60455J88351J48296
2264G95508146J09494J77443K83599K96831K31862J84715K38419L51250L38256J27018
$$ plain form
2284.4 797847033 797714949 797507346 797414303 797373772 797208071 796862841 796435177 796049118 795652807 795038760
2304.8 795038760 794189274 793324769 792602479 792001724 791322291 790253103 788812876 787445247 786386251
2323.1 786386251 785444140 784398854 783384681 782776892 782452583 781863213 780998170 780272484 779999375
2341.5 779999375 780588090 782410979 784300506 784358263 782154441 778811991 775740981 773580313 772697568
2359.9 772697568 772955716 773873985 775325775 777379453 779916465 782564461 784929276 787061512 789238155
2378.2 789238155 791408300 793185413 794277966 794790387 795047760 795193672 795133591 794823885 794467807
2396.6 794467807 794283032 794188023 793953836 793534756 793144763 792952597 792775512 792356193 791765273 791242301
2417 791242301 790869951 790521979 790020466 789377630 788801372 788399577 787995338 787378013 786632895 786012471
$$ packed form
2284.4G97847033j32084k07603r3043m0531j65701l45230m27664l86059l96311o14047
2304.8G95038760q49486q64505p22290o00755o79433j069188j440227j367629j058996
2323.1G86386251r42111j045286j014173o07789l24309n89370q65043p25686k73109
2341.5G79999375N88715J822889J889527N7757k203822l342450l071010k160668q82745
2359.9G72697568K58148R18269J451790K053678K537012K647996K364815K132236K176643
2378.2G89238155K170145J777113J092553N12421K57373J45912o0081l09706l56078
2396.6G94467807j84775r5009k34187m19080l89993j92166j77085m19319n90920n22972
2417G91242301l72350l47972n01513o42836n76258m01795m04239o17325p45118o20424
$$ plain form
2437.4 786012471 785562873 785075545 784433424 783759296 783190548 782716215 782186508 781476378 780713737 780146420
2457.8 780146420 779753089 779261410 778581142 777917266 777442515 777067006 776589394 775980830 775394857 774949670
2478.1 774949670 774549127 774046779 773486435 772997320 772625506 772298515 771900237 771441221 771078587 770865142
2498.5 770865142 770644009 770286500 769860208 769509196 769288540 769082606 768743992 768331766 767971933 767641842
2518.9 767641842 767231584 766705632 766161144 765701830 765277684 764753163 764117122 763457894 762840092 762262523
2539.3 762262523 761645615 760958493 760275662 759665668 759090781 758427799 757678509 757001579 756447554 755898476
2559.7 755898476 755252719 754548132 753914535 753393173 752902389 752336562 751669765 751039624 750514269 749966741
2580.1 749966741 749346554 748742223 748241842 747839212 747405827 746886492 746389031 745981753 745634198 745275676
$$ packed form
2437.4G86012471m49598m87328o42121o74128n68748m74333n29707p10130p62641n67317
2457.8G80146420l93331m91679o80268o63876m74751l75509m77612o08564n85973m45187
2478.1G74949670m00543n02348n60344m89115l71814l26991l98278m59016l62634k13445
2498.5G70865142k21133l57509m26292l51012k20656k05934l38614m12226l59833l30091
2518.9G67641842m10258n25952n44488m59314m24146n24521o36041o59228o17802n77569
2539.3G62262523o16908o87122o82831o09994n74887o62982p49290o76930n54025n49078
2559.7G55898476o45757p04587o33597n21362m90784n65827o66797o30141n25355n47528
2580.1G49966741o20187o04331n00381m02630m33385n19335m97461m07278l47555l58522
$$ plain form
2600.5 745275676 744832635 744319439 743828893 743355811 742751539 741965652 741139293 740380526 739625156 738720417
2620.9 738720417 737650454 736591637 735629082 734644353 733517528 732291818 731116474 730018198 728873312
2639.3 728873312 727609754 726318419 725130916 724034488 722894132 721654713 720422626 719297349
2655.6 719297349 718252361 717177749 716025949 714885354 713826835 712782621 711677194 710597634
2671.9 710597634 709643066 708755851 707840502 706868708 705881774 704953730 704097152 703255534 702363849 701393366
2692.3 701393366 700407922 699460268 698488712 697420180 696301699 695227087 694174469 693060338 691880405
2710.7 691880405 690724671 689648151 688620746 687605143 686583579 685582817 684661627 683804929 682941437
2729 682941437 682073176 681234479 680435121 679689944 678945959 678142369 677357435 676643550 675927401 675182998
$$ packed form
2600.5G45275676m43041n13196m90546m73082o04272p85887q26359p58767p55370r04739
2620.9G38720417j069963j058817r62555r84729j126825j225710j175344j098276j144886
2639.3G28873312j263558j291335j187503j096428j140356j239419j232087j125277
2655.6G19297349j044988j074612j151800j140595j058519j044214j105427j079560
2671.9G10597634r54568q87215r15349r71794r86934r28044q56578q41618q91685r70483
2692.3G01393366r85444r47654r71556j068532j118481j074612j052618j114131j179933
2710.7F91880405j155734j076520j027405j015603j021564j000762r21190q56698q63492
2729F82941437q68261q38697p99358p45177p43985q03590p84934p13885p16149p44403
$$ plain form
2749.4 675182998 674453735 673780024 673154831 672519445 671853542 671217203 670656621 670128763 669553876 668877900
2769.8 668877900 668121636 667368054 666632533 665833354 664928734 663971364 663010180 662005246 660910487
2788.2 660910487 659729004 658463061 657134295 655746341 654268265 652709782 651100278 649448752
2804.5 649448752 647744656 645970821 644106686 642127156 640077472 638010800 635887265 633674562
2820.8 633674562 631374002 628995359 626556814 624052763 621457398 618759215 615946174 613007605
2837.1 613007605 609898984 606497049 602770150 598801851 594689250 590602934 586798251 583491206
2853.4 583491206 580708086 578264177 575838327 573130906 569978893 566313446 562129021 557528079
2869.7 557528079 552668452 547628462 542483926 537468553 532856762 528798997 525369704 522608161
$$ packed form
2749.4F75182998p29263o73711o25193o35386o65903o36339n60582n27858n74887o75976
2769.8F68877900p56264p53582p35521p99179r04620r57370r61184j004934j094759
2788.2F60910487j181483j265943j328766j387954j478076j558483j609504j651526
2804.5F49448752j704096j773835j864135j979530k049684k066672k123535k212703
2820.8F33674562k300560k378643k438545k504051k595365k698183k813041k938569
2837.1F13007605l108621l401935l726899l968299m112601m086316l804683l307045
2853.4E83491206k783120k443909k425850k707421l152013l665447m184425m600942
2869.7E57528079m859627n039990n144536n015373m611791m057765l429293k761543
$$ plain form
2886.1 522608161 520487249 518916845 517773449 516905129 516139507 515328765 514400303 513358653 512170792
2904.4 512170792 510715723 508871675 506571293 503754973 500394642 496669382 492859513 489150584
2920.7 489150584 485781908 483040750 481068641 479905248 479647368 480461359 482435793 485481292 489388227
2939.1 489388227 493913144 498870462 504148364 509572029 514988124 520397127 525782943 531105518
2955.4 531105518 536395073 541626930 546677291 551424384 555852294 560019791 563949883 567691982
2971.7 567691982 571329236 574868917 578310907 581655145 584772110 587564707 590113580 592479467
2988 592479467 594643950 596537113 598081172 599319577 600284994 600936830 601298690 601394951 601217926
3006.4 601217926 600807488 600187898 599328399 598217845 596883297 595338762 593588114 591700733 589733124
$$ packed form
2886.1E22608161k120912j570404j143396q68320p65622q10742r28462j041650j187861
2904.4E12170792j455069j844048k300382k816320l360331l725260l809869l708929
2920.7D89150584l368676k741158j972109j163393k57880Q13991J974434L045499L906935
2939.1D89388227M524917M957318N277902N423665N416095N409003N385816N322575
2955.4E31105518N289555N231857N050361M747093M427910M167497L930092L742099
2971.7E67691982L637254L539681L441990L344238L116965K792597K548873K365887
2988E92479467K164483J893163J544059J238405R65417O51836L61860R6261j77025
3006.4F01217926m10438o19590q59499j110554j334548j544535j750648j887381j967609
$$ plain form
3024.7 589733124 587649882 585466564 583256602 581043005 578730762 576242626 573734224 571292818
3041.1 571292818 568779886 566119730 563349128 560577393 557857811 555144966 552439809 549692392
3057.4 549692392 546868563 544079423 541386247 538750827 536072135 533249080 530353189 527569532
3073.7 527569532 524995506 522478342 519770622 516929686 514164448 511464775 508760273 506052673
3090 506052673 503279269 500457406 497740299 495162249 492583424 489914358 487274200 484781712 482339263
3108.4 482339263 479800940 477277219 474912673 472553462 470047891 467422605 464762300 462196320
3124.7 462196320 459763378 457378894 454983175 452573389 450223804 447998643 445768744 443401366
3141 443401366 441029549 438782722 436619431 434562087 432603449 430551976 428302556 426008642 423830688
$$ packed form
3024.7E89733124k083242k183318k209962k213597k312243k488136k508402k441406
3041.1E71292818k512932k660156k770602k771735k719582k712845k705157k747417
3057.4E49692392k823829k789140k693176k635420k678692k823055k895891k783657
3073.7E27569532k574026k517164k707720k840936k765238k699673k704502k707600
3090E06052673k773404k821863k717107k578050k578825k669066k640158k492488k442449
3108.4D82339263k538323k523721k364546k359211k505571k625286k660305k565980
3124.7D62196320k432942k384484k395719k409786k349585k225161k229899k367378
3141D43401366k371817k246827k163291k057344j958638k051473k249420k293914k177954
$$ plain form
3159.4 423830688 421776384 419787198 417831898 415897012 413968980 412069917 410210550 408382982
3175.7 408382982 406583935 404813766 403063446 401331633 399634302 397966802 396321833 394697934
3192 394697934 393074065 391432494 389803410 388248503 386796772 385394871 383988589 382587582 381228566
3210.3 381228566 379914016 378603548 377290696 375989437 374707758 373468846 372264653 371057510
3226.7 371057510 369898558 368898600 367994308 366931826 365661889 364416927 363328636 362350315 361435443
3245 361435443 360528648 359537691 358527750 357644409 356849790 356006026 355101377 354229361 353415221 352648526
3265.4 352648526 351980060 351430416 350816488 349998951 349120826 348313659 347593457 346923590 346230984 345512062
3285.8 345512062 344841987 344314933 343885958 343355268 342652291 341880083 341151923 340558559 340099066 339601576
$$ packed form
3159.4D23830688k054304j989186j955300j934886j928032j899063j859367j827568
3175.7D08382982j799047j770169j750320j731813j697331j667500j644969j623899
3192C94697934j623869j641571j629084j554907j451731j401901j406282j401007j359016
3210.3C81228566j314550j310468j312852j301259j281679j238912j204193j207143
3226.7C71057510j158952r99958r04292j062482j269937j244962j088291r78321r14872
3245C61435443r06795r90957j009941q83341p94619q43764r04649q72016q14140p66695
3265.4C52648526o68466n49644o13928q17537q78125q07167p20202o69867o92606p18922
3285.8C45512062o70075n27054m28975n30690p02977p72208p28160n93364m59493m97490
$$ plain form
3306.2 339601576 338906646 338022888 337069035 336199015 335443109 334716648 334009498 333367825 332737446 331972659
3326.6 331972659 331087291 330247849 329503745 328825206 328200251 327543765 326799691 326010615 325173348 324372470
3347 324372470 323724985 323030442 322095454 321135253 320377886 319737971 319029689 318273932 317703992 317273736
3367.4 317273736 316626370 315675616 314716488 313979089 313373357 312773883 312146902 311522275 311016798 310740858
3387.8 310740858 310691535 310581654 310104102 309505135 309251696 309247494 308941454 308253109 307743490 307610631
3408.2 307610631 307567358 307427108 307115436 306731939 306505948 306424886 306341439 306322217 306483835 306762874
3428.6 306762874 306993008 307194203 307482034 307676524 307563752 307382911 307480931 307839543 308250517 308570653
3449 308570653 308858663 309238136 309719890 310305476 310967863 311517388 312028229 312846422 313833147 314483792
$$ packed form
3306.2C39601576o94930q83758r53853q70020p55906p26461p07150o41673o30379p64787
3326.6C31972659q85368q39442p44104o78539o24955o56486p44074p89076q37267q00878
3347C24372470o47485o94543r34988r60201p57367o39915p08282p55757n69940m30256
3367.4C17273736o47366r50754r59128p37399o05732n99474o26981o24627n05477k75940
3387.8C10740858m9323j09881m77552n98967k53439m202l06040o88345n09619j32859
3408.2C07610631m3273j40250l11672l83497k25991q1062q3447j9222J61618K79039
3428.6C06762874K30134K01195K87831J94490j12772j80841R8020L58612M10974L20136
3449C08570653K88010L79473M81754N85586O62387N49525N10841Q18193R86725O50645
$$ plain form
3469.4 314483792 314730614 314992040 315515012 316307425 317158490 317735463 318210751 318924725 319692075 320350468
3489.8 320350468 321072072 321906716 322780699 323621690 324457109 325301021 326000869 326562971 327221811 328097194
3510.2 328097194 329152614 330174565 330987066 331760496 332725108 333892792 334942818 335727662 336519122
3528.5 336519122 337451875 338521540 339751720 340949446 341987193 343161255 344563097 345902413
3544.8 345902413 346976280 348006546 349205136 350510180 351916254 353458554 355130702 356880099
3561.1 356880099 358510911 359972358 361725003 363903314 366009414 367977619 370113671 372465670
3577.5 372465670 374965787 377648592 380368590 382865280 385233790 387901217 390690476 393423885
3593.8 393423885 396318644 399461299 402689517 405951202 409191430 412251592 415360361 418728888
$$ packed form
3469.4C14483792K46822K61426N22972P92413Q51065N76973M75288P13974P67350O58393
3489.8C20350468P21604Q34644Q73983Q40991Q35419Q43912O99848N62102O58840Q75383
3510.2C28097194J055420J021951Q12501P73430R64612J167684J050026P84844P91460
3528.5C36519122R32753J069665J230180J197726J037747J174062J401842J339316
3544.8C45902413J073867J030266J198590J305044J406074J542300J672148J749397
3561.1C56880099J630812J461447J752645K178311K106100J968205K136052K351999
3577.5C72465670K500117K682805K719998K496690K368510K667427K789259K733409
3593.8C93423885K894759L142655L228218L261685L240228L060162L108769L368527
$$ plain form
3610.1 418728888 422190309 425740004 429203093 432534456 436164707 439839810 443214655 446293950
3626.4 446293950 449512571 453453809 457363069 461043209 464726567 468382835 472069740 475817829
3642.7 475817829 479465663 482948810 486646533 490645945 494256228 497548342 501239061 505134284
3659 505134284 508584142 511748254 515005827 518149793 521095276 524382532 527463794 530005753 532811284
3677.4 532811284 535760880 538633406 541532159 544344366 546973109 549307704 551408052 553511381
3693.7 553511381 555699170 557851493 559767962 561538815 563498139 565579772 567520022 569177628
3710 569177628 570804060 572763264 574601710 576083899 577401042 578676999 579858601 581111848 582747936
3728.4 582747936 584479451 585965455 587198317 588561296 590269327 591793358 592584252 593302250 594860971
$$ packed form
3610.1D18728888L461421L549695L463089L331363L630251L675103L374845L079295
3626.4D46293950L218621L941238L909260L680140L683358L656268L686905L748089
3642.7D75817829L647834L483147L697723L999412L610283L292114L690719L895223
3659E05134284L449858L164112L257573L143966K945483L287256L081262K541959K805531
3677.4E32811284K949596K872526K898753K812207K628743K334595K100348K103329
3693.7E53511381K187789K152323J916469J770853J959324K081633J940250J657606
3710E69177628J626432J959204J838446J482189J317143J275957J181602J253247J636088
3728.4E82747936J731515J486004J232862J362979J708031J524031P90894P17998J558721
$$ plain form
3746.7 594860971 596083164 596675694 597759545 599270940 600479364 601308107 602326930 603535235 604606807
3765.1 604606807 605559647 606366754 607237279 608264148 609293044 610260427 611089587 611898422 612682462
3783.5 612682462 613451600 614344954 615298450 616179883 616951883 617745161 618665814 619312704 619741976 620497406
3803.9 620497406 621091485 621663094 622658432 623681366 624325693 624843359 625662684 626217663 626740992
3822.2 626740992 627563357 628274560 628940403 629546165 630178869 631039500 631699920 631894112 632191181 632759631
3842.6 632759631 633416951 634146690 634939909 635444582 635215700 635385275 636415243 637259662 637777507
3861 637777507 638158262 638669550 639233053 639484942 639752805 640238941 640915751 641530395 641687274 642005503
3881.4 642005503 642661154 643145382 643592775 643825412 643860340 644309223 644979596 645357907 645534575 645689487
$$ packed form
3746.7E94860971J222193N92530J083851J511395J208424Q28743J018823J208305J071572
3765.1F04606807R52840Q07107Q70525J026869J028896R67383Q29160Q08835P84040
3783.5F12682462P69138Q93354R53496Q81433P72000P93278R20653O46890M29272P55430
3803.9F20497406N94079N71609R95338J022934O44327N17666Q19325N54979N23329
3822.2F26740992Q22365P11203O65843O05762O32704Q60631O60420J94192K97069N68450
3842.6F32759631O57320P29739P93219N04673k28882J69575J029968Q44419N17845
3861F37777507L80755N11288N63503K51889K67863M86136O76810O14644J56879L18229
3881.4F42005503O55651M84228M47393K32637L4928M48883O70373L78311J76668J54912
$$ plain form
3901.8 645689487 645846009 646199465 646637857 647021592 647464693 647833765 647933722 647973001 648199499 648509979
3922.1 648509979 648777425 649043262 649350286 649654627 649889886 650030971 650100768 650221705 650472045 650803983
3942.5 650803983 651147366 651339889 651369572 651475012 651726604 651977301 652206361 652455449 652672648 652910590
3962.9 652910590 653179169 653375387 653541148 653750420 653984368 654198527 654326141 654432178 654667914 654958010
3983.3 654958010 655174077 655291617 655352294 655494630 655749738 655969262 656046987
3997.6 656046987
$$ packed form
3901.8F45689487J56522L53456M38392L83735M43101L69072R9957L9279K26498L10480
3922.1F48509979K67446K65837L07024L04341K35259J41085O9797J20937K50340L31938
3942.5F50803983L43383J92523K9683J05440K51592K50697K29060K49088K17199K37942
3962.9F52910590K68579J96218J65761K09272K33948K14159J27614J06037K35736K90096
3983.3F54958010K16067J17540O0677J42336K55108K19524P7725
3997.6F56046987
##END=$$ End of the data block
