##TITLE=$$ Begin of the data block
##JCAMP-DX=5.00 $$ ACD/SpecManager v 10.08
##SPECTROMETER/DATA SYSTEM=Alpha
##DATE=26 Dec 2014 10:25:20
##DATA TYPE=INFRARED SPECTRUM
##DATA CLASS=XYDATA
##ORIGIN=
##OWNER=
##NPOINTS=1765
##FIRSTX=399.76428223
##LASTX=3997.64306641
##MAXX=3997.64306641
##MINX=399.76428223
##MAXY=0.79997796
##MINY=0.23649085
##XFACTOR=1.0000000000
##YFACTOR=1.000000000000000e-9
##FIRSTY=0.51180780
##DELTAX=2.03961372
##XUNITS=1/CM
##YUNITS=ARBITRARY UNITS
##XYDATA=(X++(Y..Y))
399.8E11807799m190623k408922k100229j344204P72476K710223K559364J131415k45630
418.1E08691669j373530j262784j428127k698839l470004l066450k060920j625180
434.4D91705835j922578q06778K098232M387349M657567L835678L051877K543568J919091
452.8E11469841P53045n70357j341283j299024j552343k492726l453195l360480k480507
471.2D95672971k606869l296017k861411j357764q8274q5801o44177n49466J38223
489.5D84321415L43383p20889k093196k240717j480997j375257k271504l069043k994239
507.9D68418956k528519l080964m440665m875511m032224l157050k916664k700597
524.2D40686762j820981k75523R06170J246482J704931L304362N455286O241023M754693
$$ y = [511807799, 507617176, 505208254, 503108025, 501763821, 502536297, 505246520, 507805884, 508937299, 508691669, 507318139, 506055355, 504627228, 501928389, 498458385, 495391935, 493331015, 491705835, 489783257, 488976479, 491074711, 495462060, 500119627, 503955305, 507007182, 509550750, 511469841, 512222886, 511652529, 510311246, 509012222, 507459879, 504967153, 501513958, 498153478, 495672971, 493066102, 489770085, 486908674, 485550910, 485462636, 485376835, 484732658, 484183192, 484321415, 484664798, 483943909, 481850713, 479609996, 478128999, 476753742, 474482238, 471413195, 468418956, 465890437, 462809473, 458368808, 453493297, 449461073, 446304023, 443387359, 440686762, 438865781, 438590258, 439496428, 440742910, 442447841, 445752203, 451207489, 457448512, 462203205]
542.5D62203205K545952J440049Q95440m27305k065570k921223k915442l011227m052877
560.9D51691002n470515o227761o260306o032645n556673m065544j218676K004593
577.2D18863475M301429N522072O404311P123053O959558N390256L105670J361341
593.5D59031165O99699M23789j88947p31796n90950k39N56946Q36343Q96155J210153
613.9D62142318J951576K881586L565699L639460L583282L840297L882289L189564
630.2D88676071K163649J609504J698315J734972J261234O52016N55902R25005J099139
648.6E00375807Q63612N71609P69794J387119J501441Q40068L58700M1962m16577J170695
669E07464230K648115J778782J604795K185524J966297J101494Q18729J364351J750946
$$ y = [462203205, 464749157, 466189206, 467084646, 466657341, 464591771, 461670548, 458755106, 455743879, 451691002, 446220487, 439992726, 433732420, 427699775, 422143102, 418077558, 416858882, 418863475, 423164904, 428686976, 435091287, 442214340, 449173898, 454564154, 457669824, 459031165, 459730864, 460154653, 459965706, 459233910, 458642960, 458642721, 459199667, 460036010, 460932165, 462142318, 464093894, 466975480, 470541179, 474180639, 477763921, 481604218, 485486507, 488676071, 490839720, 492449224, 494147539, 495882511, 497143745, 497795761, 498351663, 499276668, 500375807, 501239419, 501811028, 502580822, 503967941, 505469382, 506309450, 506668150, 506710112, 506293535, 507464230, 510112345, 511891127, 513495922, 515681446, 517647743, 518749237, 519567966, 520932317, 522683263]
687.3E22683263J094580k23458j023412j066566j319170k381026l480673l293634j850605
705.7E09139299n45919P809O96897K277374M113555M974723M920244N079508N892456
724.1E36555946O559193O048203M621386L704608L829777L814637K608359Q99494p6354
742.4E68565249l23414j016140k744794m502833m968703m403353m142463m491985m272878
760.8E37698686k731562n63204J382530L013551M740417O786049Q577764R181916Q483589
779.1E76569736P432878O876528O457329N348861L878713L228545L787756M555404
795.4F18135750M579723M157484M058480M258454L961325K917230J884818J564681
811.8F45517945J772046J715660Q55864k66016q69393j024008j499772k858341m419744
$$ y = [522683263, 523777843, 523554385, 522530973, 521464407, 520145237, 517764211, 514283538, 510989904, 509139299, 508593380, 508601189, 509298086, 511575460, 515689015, 520663738, 525583982, 530663490, 536555946, 543115139, 549163342, 553784728, 557489336, 561319113, 565133750, 567742109, 568641603, 568565249, 568241835, 567225695, 564480901, 559978068, 555009365, 550606012, 546463549, 541971564, 537698686, 534967124, 534403920, 535786450, 538800001, 543540418, 550326467, 558904231, 568086147, 576569736, 584002614, 590879142, 597336471, 602685332, 606564045, 609792590, 613580346, 618135750, 622715473, 626872957, 630931437, 635189891, 639151216, 642068446, 643953264, 645517945, 647289991, 649005651, 649861515, 649595499, 648726106, 647702098, 646202326, 643343985, 638924241]
830.1F38924241n099356n021513n093574n519509n606652m855811l773392l234922
846.4F00719512l510118l941059l834427l643572m072547m326224k483308J945555
862.8E76853812O870746R931624J1059165J1473418J1305272R688139O359339K387285
879.1F45928800p71105k762079m437268o238699p340491p000208n882323n230367n319655
897.4F00946605n431592n083621m911005n793751p427513q727908r267986r561598
913.7E44741631j0015786j0069072q764565o179631l635109k111554j237809j09017
930.1E02619088J447439K735615L350615L777445M505157M880369L482938q703m285097
948.4E22504866p970512j0835767j3205140j5025825j6079247j6548991j7013937j7756134
$$ y = [638924241, 633824885, 628803372, 623709798, 618190289, 612583637, 607727826, 603954434, 600719512, 597209394, 593268335, 589433908, 585790336, 581717789, 577391565, 574908257, 576853812, 583724558, 593656182, 604715347, 616188765, 627494037, 637182176, 643541515, 645928800, 645157695, 642395616, 637958348, 631719649, 624379158, 617378950, 611496627, 606266260, 600946605, 595515013, 590431392, 585520387, 579726636, 572299123, 563571215, 554303229, 544741631, 534725845, 524656773, 515892208, 509712577, 506077468, 503965914, 502728105, 502619088, 504066527, 506802142, 510152757, 513930202, 518435359, 523315728, 526798666, 526789963, 522504866, 514534354, 503698587, 490493447, 475467622, 459388375, 442839384, 425825447, 408069313]
964.7D08069313j8462301j8810808j8849850j8781215j8538654j7717183j6079634
979B80829668j3760507j1068672q333668n759552l487930j637414k91079N92276J162961
997.4B38246083J493827J549065J310542Q30129K87175j16929l03537k17661J46135
1015.7B43224829P03991J329854J981601K557695K961755L261834L451884L411859
1032B62885302L015966K329379J591980J011700O87450O96689R88841J420230K090334
1050.4B76717871L172815M499793N713463O769300P948041R291559R955227Q344204
1066.7C32412273L364175l652841r055763j0165483p663160m083783j038402J219779
1083C01336795K830863L883034M568249N155772N577415N435556M496456L054350J697392
$$ y = [408069313, 389607012, 370796204, 351946354, 333165139, 314626485, 296909302, 280829668, 267069161, 256000489, 247666821, 241907269, 238419339, 236781925, 236490846, 237083122, 238246083, 239739910, 241288975, 242599517, 243429646, 243716821, 243599892, 243296355, 243078694, 243224829, 243928820, 245258674, 247240275, 249797970, 252759725, 256021559, 259473443, 262885302, 265901268, 268230647, 269822627, 270834327, 271521777, 272218466, 273207307, 274627537, 276717871, 279890686, 284390479, 290103942, 296873242, 304821283, 314112842, 324068069, 332412273, 335776448, 332123607, 323067844, 312902361, 305239201, 301155418, 300117016, 301336795, 304167658, 308050692, 312618941, 317774713, 323352128, 328787684, 333284140, 336338490, 338035882]
1101.4C38035882R04768R15736J633734K632171L542393M124135M118025L506154K673894
1119.8C62086892K070338J896888K212584K978265L975034M558861L918439J815230
1136.1C85512531j222551m248351o457239p588148p848591p417500o376416m959374
1152.4C39394361l450096k030551p07656O77347K242595L974467N824655P718742R569884
1170.7C63213748J1206686J2373686J2949467J3168633J3262212J3077408J2414545
1185D51666385J1274576R754419P989407O153554M432797L062070K215176J881510
1201.3D98429894J931191K252579K807378L546954M340648M948378N153477M844070
1217.7E28254569L989696K758443J465917K93136o71387j334429j662791j697659j576662
$$ y = [338035882, 338940650, 339856386, 341490120, 344122291, 347664684, 351788819, 355906844, 359412998, 362086892, 364157230, 366054118, 368266702, 371244967, 375220001, 379778862, 383697301, 385512531, 384289980, 380041629, 373584390, 365996242, 358147651, 350730151, 344353735, 339394361, 335944265, 333913714, 333206058, 333883405, 336126000, 340100467, 345925122, 353643864, 363213748, 374420434, 386794120, 399743587, 412912220, 426174432, 439251840, 451666385, 462940961, 472695380, 480684787, 486838341, 491271138, 494333208, 496548384, 498429894, 500361085, 502613664, 505421042, 508967996, 513308644, 518257022, 523410499, 528254569, 532244265, 535002708, 536468625, 536761761, 536090374, 534755945, 533093154, 531395495, 529818833]
1236E29818833j429558j249194q65579j50084P17580J398146J774729J959562K013624
1254.4E33988059J834034J389862R46939Q66830J256943J818597K110481J999378J651109
1272.7E47862232J141488M48168k67923p19846p69913o28114p00533j047611j295865
1291.1E44022083j313686j370072j619816j918137k010167j820505j601159j590669
1307.4E30777872j640380j498878j183629r63449j086355j451432j859904k478242
1323.7E18615603l500878m623413n267919n132436m390389l421754k479136j536369
1340D88263309n25206K26527M49419K21968j42127l78818n76704q62360j148075j337231
1360.4D84190702j392573j168579r25928q36640m67241J62065N91218N85079M53920
$$ y = [529818833, 528389275, 527140081, 526274502, 526124418, 526841998, 528240144, 530014873, 531974435, 533988059, 535822093, 537211955, 538158894, 539025724, 540282667, 542101264, 544211745, 546211123, 547862232, 549003720, 549451888, 549183965, 548464119, 547694206, 547066092, 546365559, 545317948, 544022083, 542708397, 541338325, 539718509, 537800372, 535790205, 533969700, 532368541, 530777872, 529137492, 527638614, 526454985, 525491536, 524405181, 522953749, 521093845, 518615603, 515114725, 510491312, 505223393, 500090957, 495700568, 492278814, 489799678, 488263309, 487738103, 487964630, 488414049, 488636017, 488493890, 488115072, 487538368, 486676008, 485527933, 484190702, 482798129, 481629550, 480703622, 479866982, 479399741, 479561806, 480153024, 480738103, 481192023]
1378.8D81192023N57541J179964K417564L831118M103870L109693K149701J215250
1395.1D99756724P1019r34959j355857j440048j733124j985163k097934k109289j783312
1413.5D86388057j295715j167476j190245n70357J70320O20455Q92192J083403J334131
1431.8D86264765J627267J986682K081394J754672J727193J696408J279891M63634
1448.1D98881906l21358o33329o74278j292646j970470o93708P82758K228975L574490
1466.5D99882340M444480O095112R271681J0299146Q792162P739842P389128P318139
1482.8E61232030O811858O447315O318927N746126M623055M301667M527033L930449
1499.1F03938460L232301L022670L388226L695906K356827J815259K168656K332747
$$ y = [481192023, 481749564, 482929528, 485347092, 489178210, 493282080, 496391773, 498541474, 499756724, 499827743, 498892784, 497536927, 496096879, 494363755, 492378592, 490280658, 488171369, 486388057, 485092342, 483924866, 482734621, 482164264, 482334584, 482955039, 483847231, 484930634, 486264765, 487892032, 489878714, 491960108, 493714780, 495441973, 497138381, 498418272, 498881906, 498560548, 497927219, 497252941, 495960295, 493989825, 493296117, 494078875, 496307850, 499882340, 504326820, 510421932, 519693613, 529992759, 538784921, 546524763, 553913891, 561232030, 568043888, 574491203, 580810130, 586556256, 591179311, 595480978, 600008011, 603938460, 607170761, 610193431, 613581657, 617277563, 619634390, 621449649, 623618305, 625951052]
1515.4F25951052K154290J774967J737476J623332J231253Q99732P17163Q43108Q84414
1533.8F37816787O90460M58539l517n51701n61476o02066p40469q40485o75022m13835
1554.2F34577215l70086j302838k400637j208603p64251r07182j168311j351118q38459
1572.6F24265730o30259j197338j279295q76605p20024p32720r65953j185358j212060
1590.9F15466118j156926j313985j682877j975537k104461k222895k527595k955556
1607.2E99526286l339589l346622l085672l605068m707217l801346k952993l415287
1623.5E71272492l516435l440142l269136k323627j643002j975775j856268j004755
1639.9E52243352l45409J68800M97699P71582J010716J618028K539158K164840K115310
$$ y = [625951052, 628105342, 629880309, 631617785, 633241117, 634472370, 635372102, 636089265, 636932373, 637816787, 638507247, 638965786, 638962269, 638410568, 637849092, 637247026, 636506557, 635666072, 634991050, 634577215, 634207129, 632904291, 630503654, 629295051, 628530800, 627623618, 626455307, 625104189, 624265730, 623635471, 622438133, 621158838, 620282233, 619562209, 618829489, 617863536, 616678178, 615466118, 614309192, 612995207, 611312330, 609336793, 607232332, 605009437, 602481842, 599526286, 596186697, 592840075, 589754403, 586149335, 581442118, 577640772, 574687779, 571272492, 567756057, 564315915, 561046779, 558723152, 557080150, 555104375, 553248107, 552243352, 551897943, 552066743, 552564442, 553336024, 554346740, 555964768, 558503926, 560668766, 562784076]
1658.2E62784076K834439L823400M191935L772139M147411M944741M609704M794061
1674.5E95901906N153955M591703M417121N187095O463825N248189M216314M524529
1690.9F35704637M323363M508674M600704L986716M073441L391862K846122K762556
1707.2F66198075K470970K490640K606213K351165J410305K21908K3902N49018J369476
1725.5F79691672J903951K134562K174795K247929J986742J531661J660764J999497
1741.9F95331573K232790K453566K746880L279209L691495L495693L363073L252148
1758.2G19846427K964974K941668K636313K175868J961827J899004J909316J662314
1774.5G37997711J314997J232028J323402J347423J231193J101196J096964J200438
$$ y = [562784076, 565618515, 569441915, 573633850, 577405989, 581553400, 586498141, 591107845, 595901906, 601055861, 605647564, 610064685, 615251780, 621715605, 626963794, 631180108, 635704637, 640028000, 644536674, 649137378, 653124094, 657197535, 660589397, 663435519, 666198075, 668669045, 671159685, 673765898, 676117063, 677527368, 677749276, 677773178, 678322196, 679691672, 681595623, 683730185, 685904980, 688152909, 690139651, 691671312, 693332076, 695331573, 697564363, 700017929, 702764809, 706044018, 709735513, 713231206, 716594279, 719846427, 722811401, 725753069, 728389382, 730565250, 732527077, 734426081, 736335397, 737997711, 739312708, 740544736, 741868138, 743215561, 744446754, 745547950, 746644914, 747845352]
1790.8G47845352J271605J066923Q73030Q80301R99212J052558R57191Q51393Q03769
1809.2G56601334Q40306Q81910Q35717P15613P09713Q32677Q73208P63118O11663N44131
1829.6G64209390N79357O29186N32687L89576M18782N51463N43057L54231K04980K37108
1850G68649817L67760L96550K88546J72615K34187M01318M65214L51667J63317J53482
1870.3G71644473L35515M00304K71678K23101L80098N52893N27024L69132K79725L59892
1890.7G75343835M62652L61442J59383J19209K70248L42548K26318Q6666Q5294K18212
1911.1G77675807K89500J90020M5836R6083K56657K49744J04606M6193J28687K34902
1931.5G79318035K20418R0897N6803J79827K77221K32399J32143R5606J87338L13758
$$ y = [747845352, 749116957, 750183880, 751056910, 751937211, 752936423, 753988981, 754946172, 755797565, 756601334, 757441640, 758323550, 759159267, 759874880, 760584593, 761417270, 762290478, 763053596, 763665259, 764209390, 764788747, 765417933, 765950620, 766340196, 766758978, 767310441, 767853498, 768207729, 768412709, 768649817, 769017577, 769414127, 769702673, 769875288, 770109475, 770510793, 770976007, 771327674, 771490991, 771644473, 771979988, 772380292, 772651970, 772875071, 773255169, 773808062, 774335086, 774704218, 774983943, 775343835, 775806487, 776167929, 776327312, 776446521, 776716769, 777059317, 777285635, 777372301, 777457595, 777675807, 777965307, 778155327, 778201163, 778297246, 778553903, 778803647, 778908253, 778954446, 779083133, 779318035, 779538453, 779629350, 779686153, 779865980, 780143201, 780375600, 780507743, 780603349, 780790687, 781104445]
1951.9G81104445K90215J55509J21772K32399L18885K73883J56939J20044J97351K55167
1972.3G83226609J80781N5909P2420J77562J81019R9540O5088Q5533R7811O4731K5749
1994.8G84332752J1683J6093K0266k4796j02520j69396k06828k14518k24769k86519
2015.2G83151448l74258m57167n06044n34892n16653l31819j91689k53975l39091l85463
2035.6G79260397m29392m28736l44634k47896k41995k96592k74003j55747p3433q7619
2056G76680350r9778l0339P8380J24634O9141M411J5259J04308J40846K4259q1718
2078.4G77029753k39J27733J17838J9968j1802J05620K40743K15709N9962L577J36673
2100.8G78045535K69413K24888O1930M887J31428K48492J47701n2155p6651P8857J64211
$$ y = [781104445, 781394660, 781550169, 781671941, 781904340, 782223225, 782497108, 782654047, 782774091, 782971442, 783226609, 783407390, 783463299, 783535719, 783713281, 783894300, 783993840, 784058928, 784144461, 784242272, 784307003, 784332752, 784344435, 784360528, 784380794, 784355998, 784253478, 784084082, 783877254, 783662736, 783437967, 783151448, 782777190, 782320023, 781813979, 781279087, 780762434, 780430615, 780238926, 779984951, 779645860, 779260397, 778831005, 778402269, 778057635, 777809739, 777567744, 777271152, 776997149, 776841402, 776767969, 776680350, 776580572, 776550233, 776628613, 776753247, 776822388, 776826799, 776842058, 776946366, 777087212, 777111471, 777029753, 777029514, 777157247, 777275085, 777295053, 777283251, 777388871, 777629614, 777845323, 777905285, 777908862, 778045535, 778314948, 778539836, 778601766, 778606653, 778738081, 778986573, 779134274, 779082119, 779005468, 779084325, 779248536]
2123.3G79248536K9206j44422r9361R1612J60098M5956q6904n8115Q6308J19626R835
2145.7G79402375l9935N1916J76489J86503O7055N3704K29299L89993L87967K69055
2166.1G81174421K44916M36067O12438N39422L84510L91245N24938N81145M82142L69847
2186.5G85741091L89337M94719N19097M07159K95341L54171N05566N26369L96788L04997
2206.9G89934635L85940N23210N02944L55899K98202L80933M61460M06682K74599K35021
2227.3G93759525L07381L71575L40283K27213J56760K21372L09289K78055J61231R6261
2247.7G96228945J71960K70486K02119N9664P9513K22683K72691J69218R2148J84179
2268.1G97953606K92956K83838K39789K04742K30491L31223L21329J19984j08540j90616
$$ y = [779248536, 779277742, 779133320, 779033959, 779125571, 779285669, 779331625, 779244721, 779186606, 779272914, 779392540, 779402375, 779362440, 779414356, 779590845, 779777348, 779844403, 779898107, 780127406, 780517399, 780905366, 781174421, 781419337, 781855404, 782467842, 783007264, 783391774, 783783019, 784307957, 784889102, 785371244, 785741091, 786130428, 786625147, 787144244, 787551403, 787846744, 788200915, 788706481, 789232850, 789629638, 789934635, 790320575, 790843785, 791346729, 791702628, 792000830, 792381763, 792843223, 793249905, 793524504, 793759525, 794066906, 794438481, 794778764, 795005977, 795162737, 795384109, 795693398, 795971453, 796132684, 796228945, 796400905, 796671391, 796873510, 796933174, 797012687, 797235370, 797508061, 797677279, 797769427, 797953606, 798246562, 798530400, 798770189, 798974931, 799205422, 799536645, 799857974, 799977958, 799869418, 799678802]
2288.5G99678802j43110r9778j53661k69890l51727l62098l85523n87285q59916r22382
2308.9G95543432p53045n76079o42478j016379j415729j433730j116812r18985r92656
2327.2G86677539r53972n69999l22879n77926q71480p70688k94208N62429J789093
2345.6G84667909J918614J20997k144396l299653l057480k188504r22859K62976R29415
2363.9G76287019J462341K098977K533376K557993K301693K134323K192855K184809
2380.2G93753386J776933J073063M83036K18093J07288r4354l22759l23713j35362
2398.6G96535611o4492k23160m22478m17411k51114k03491l76343n41806m95434l68119
2419G93171763l82602n47588o50108n46515l93509m22359o11961p13289o06954m82440
$$ y = [799678802, 799535692, 799435914, 799282253, 799012363, 798660636, 798298538, 797913015, 797325730, 796465814, 795543432, 794790387, 794214308, 793571830, 792555451, 791139722, 789705992, 788589180, 787670195, 786677539, 785723567, 785153568, 784830689, 784252763, 783381283, 782610595, 782316387, 782878816, 784667909, 786586523, 786707520, 784563124, 781263471, 778205991, 776017487, 775094628, 775357604, 776287019, 777749360, 779848337, 782381713, 784939706, 787241399, 789375722, 791568577, 793753386, 795530319, 796603382, 797086418, 797304511, 797411799, 797317445, 796994686, 796670973, 796535611, 796471119, 796247959, 795825481, 795408070, 795156956, 794953465, 794577122, 794035316, 793539882, 793171763, 792789161, 792241573, 791591465, 791044950, 790651441, 790229082, 789617121, 788903832, 788296878, 787814438]
2439.4G87814438n27501o38962o39140n44667m88043n63801p12394p17342n47111m36008
2459.8G81999469n17428o56247o37591m55797l53098m62651o09934o07729m79222m17649
2480.2G76802123m92812n44905m78030l58879l33667m39823m85718l40879j92463k33233
2500.6G72901714l82483m55499l48568j71363j68324l40879m37617l88384l41475m03941
2521G69463181n29229n46634m36247m00901n14805o28531o42598n94079n74827o38366
2541.4G63956964p14838o96302n94735n57423o54638p43329o87778n60403n38528o48320
2561.8G57560670p26044o49094n07117m81963o00338o99103o29544m95911n03718n98670
2582.2G51669168o13629n17428m14193m31478n10097n01155m10736l31044l52621m67956
$$ y = [787814438, 787286937, 786647975, 786008835, 785464168, 784976125, 784412324, 783699930, 782982588, 782435477, 781999469, 781482041, 780825794, 780188203, 779732406, 779379308, 778916657, 778306723, 777698994, 777219772, 776802123, 776309311, 775764406, 775286376, 774927497, 774593830, 774154007, 773668289, 773327410, 773134947, 772901714, 772519231, 772063732, 771715164, 771543801, 771375477, 771034598, 770596981, 770208597, 769867122, 769463181, 768933952, 768387318, 767951071, 767550170, 767035365, 766406834, 765764236, 765170157, 764595330, 763956964, 763242126, 762545824, 761951089, 761393666, 760739028, 759995699, 759307921, 758747518, 758208990, 757560670, 756834626, 756185532, 755678415, 755196452, 754596114, 753897011, 753267467, 752771556, 752267838, 751669168, 751055539, 750538111, 750123918, 749692440, 749182343, 748681188, 748270452, 747939408, 747586787, 747118831]
2602.6G47118831n32449m97222m85956o18935p82728p94649p28429p54952r30726j096547
2623G39896238j052618r16183r37104j111150j233161j210868j152039j166999j231193
2641.3G29884923j235664j155317j115620j163125j224399j235366j163483j102745
2657.6G20489204j141012j177907j118004j012385r63509j024008j101613j060903
2673.9G11889863r44674q91268r20177r44137r10402q63552q73983r40203r93073r58026
2694.3G02650368r09745r74715j083493j138270j118482j075327j105845j160800j128197
2712.7F92955494j053155j030921j048327j059353j033128r36746q45313q37326q52466
2731.1F84258759q35001p91908p64847p78138p73192p19010p02024p49707p68483p26938
$$ y = [747118831, 746586382, 746089160, 745603204, 744984269, 744201541, 743406892, 742678463, 741923511, 740992785, 739896238, 738843620, 737927437, 736990333, 735879183, 734646022, 733435154, 732283115, 731116116, 729884923, 728649259, 727493942, 726378322, 725215197, 723990798, 722755432, 721591949, 720489204, 719348192, 718170285, 717052281, 716039896, 715076387, 714052379, 712950766, 711889863, 710945189, 710053921, 709133744, 708189607, 707279205, 706415653, 705541670, 704601467, 703608394, 702650368, 701740623, 700765908, 699682415, 698544145, 697425663, 696350336, 695244491, 694083691, 692955494, 691902339, 690871418, 689823091, 688763738, 687730610, 686793864, 685948551, 685111225, 684258759, 683423758, 682631850, 681867003, 681088865, 680315673, 679596663, 678894639, 678144932, 677376449, 676649511]
2751.4F76649511o65605o30260o33418o32167n98312n63204n81086o16312o46174p37130
2771.8F70345843p99477p65026p77900q57592r19461r66907j029729j088560j138806
2790.2F62002385j241625j370072j444221j485407j558959j631141j660764j709819
2806.5F49900377j790762j876950j968027k031385k068282k134263k221644k285421
2822.8F33523643k353072k438843k521277k634466k769589k870142k959073l118694
2839.1F11858487l377318l679693l976464m188895m176558l843784l285110k753973
2855.5E82576692k425134k418935k738715l198742l712357m238903m666984m941225
2871.8E54235697n069614n091846m978299m665673m143476l465056k764941k126336
$$ y = [676649511, 675983906, 675353646, 674720228, 674088061, 673489749, 672926545, 672345459, 671729147, 671082973, 670345843, 669546366, 668781340, 668003440, 667145848, 666226387, 665259480, 664229751, 663141191, 662002385, 660760760, 659390688, 657946467, 656461060, 654902101, 653270960, 651610196, 649900377, 648109615, 646232665, 644264638, 642233253, 640164971, 638030708, 635809064, 633523643, 631170571, 628731728, 626210451, 623575985, 620806396, 617936254, 614977181, 611858487, 608481169, 604801476, 600825012, 596636117, 592459559, 588615775, 585330665, 582576692, 580151558, 577732623, 574993908, 571795166, 568082809, 563843906, 559176922, 554235697, 549166083, 544074237, 539095938, 534430265, 530286789, 526821733, 524056792, 521930456]
2888.1E21930456j580953j190305r25839p73907p72357q50797r79959j188458j491248
2906.5E12176633j887798k338827k836466l331840l718078l892005l776550l343463
2922.8D87051606k696782j969546j129896j79261Q36104J919210K969385L870636M562974
2941.1D95234430N003929N253613N393863N454957N471945N434751N373776N338490
2957.4E37959754N252898N072236M805684M474879M173159L938198L776729L685177
2973.8E73138714L584862L475010L368855L158748K832532K550780K380789K210915
2990.1E96701205J920879J543164J236439R77635O78122L95000J17064j51873l55721
3008.4F03061914n50925q18730j123249j378358j566112j715898j857102j984179k088368
$$ y = [521930456, 520349503, 519159198, 518233359, 517459452, 516687095, 515836298, 514856339, 513667881, 512176633, 510288835, 507950008, 505113542, 501781702, 498063624, 494171619, 490395069, 487051606, 484354824, 482385278, 481255382, 481076121, 481912225, 483831435, 486800820, 490671456, 495234430, 500238359, 505491972, 510885835, 516340792, 521812737, 527247488, 532621264, 537959754, 543212652, 548284888, 553090572, 557565451, 561738610, 565676808, 569453537, 573138714, 576723576, 580198586, 583567441, 586726189, 589558721, 592109501, 594490290, 596701205, 598622084, 600165248, 601401687, 602379322, 603057444, 603452444, 603569508, 603417635, 603061914, 602510989, 601692259, 600569010, 599190652, 597624540, 595908642, 594051540, 592067361, 589978993]
3026.8E89978993k167404k211869k227127k330601k499581k506971k473652k553404
3043.1E71008384k627730k701998k761841k764225k764821k750814k774954k840459
3059.4E49021542k792835k668679k630234k735614k884984k903581k762199k547562
3075.7E27095854k474248k689183k882659k822876k744973k749860k754271k783656
3092.1E05194128k793313k699643k583653k610355k713233k665192k498299k429635
3108.4D84200805k557665k601981k401948k310604k427756k590687k712458k655715
3124.7D63941991k467960k354950k404153k481103k383411k199352k210259k383411
3141D45057392k419829k319247k241313k127767j994669k025843k210200k304226k229899
$$ y = [589978993, 587811589, 585599720, 583372593, 581041992, 578542411, 576035440, 573561788, 571008384, 568380654, 565678656, 562916815, 560152590, 557387769, 554636955, 551862001, 549021542, 546228707, 543560028, 540929794, 538194180, 535309196, 532405615, 529643416, 527095854, 524621606, 521932423, 519049764, 516226888, 513481915, 510732055, 507977784, 505194128, 502400815, 499701172, 497117519, 494507164, 491793931, 489128739, 486630440, 484200805, 481643140, 479041159, 476639211, 474328607, 471900851, 469310164, 466597706, 463941991, 461474031, 459119081, 456714928, 454233825, 451850414, 449651062, 447440803, 445057392, 442637563, 440318316, 438077003, 435949236, 433954567, 431928724, 429718524, 427414298, 425184399]
3159.4D25184399k097845j986176j956373j978279j945287j863211j833111j861483
3175.7D09662634j856506j796037j728624j705318j729757j711488j650393j624763
3192C95859748j633227j646250j623601j544476j446127j403422j441508j475811j412273
3210.3C82233053j331687j323848j317293j286238j254946j226604j208663j199246
3226.7C72084528j147806j024515r82433j139015j259834j176774j058519r73553q86828
3245C62435251r10013j051665j071244r18985q32438q87752r04858q29279p89851p82281
3265.4C53456885p00534n82158o12438p55787q33631q36789p58618o77914o86079o96331
3285.8C46316606o56277n53668m83453n51045o75082p72745p43448n86272m78863n38498
$$ y = [425184399, 423086554, 421100378, 419144005, 417165726, 415220439, 413357228, 411524117, 409662634, 407806128, 406010091, 404281467, 402576149, 400846392, 399134904, 397484511, 395859748, 394226521, 392580271, 390956670, 389412194, 387966067, 386562645, 385121137, 383645326, 382233053, 380901366, 379577518, 378260225, 376973987, 375719041, 374492437, 373283774, 372084528, 370936722, 369912207, 368929774, 367790759, 366530925, 365354151, 364295632, 363322079, 362435251, 361525238, 360473573, 359402329, 358483344, 357650906, 356763154, 355858296, 355029017, 354239166, 353456885, 352756351, 352174193, 351561755, 350805968, 349972337, 349135548, 348376930, 347699016, 347012937, 346316606, 345660329, 345106661, 344623208, 344072163, 343397081, 342624336, 341880888, 341294616, 340815753, 340277255]
3306.2C40277255p28250q94248r07600q14826p63684p60973p28905o54668o27398p55608
3326.6C32641095q88944q54224p70092o88046n93215o61016q18669q34108q35210q07553
3347C24890018o32704o29097q69960r61482q09819o76036o78151o59556n06371m41760
3367.4C18025082o68883r80377r96441p39872n97656o17445o50882o41674n25355k85626
3387.8C11320871n3584j40578n00232n88834k10941Q8781k11805o66082n93573k65449
3408.2C08178574j28836j68293k96057l42309k24024j14620p3761l635J61409L28809
3428.6C07317257K59578J69397K70038J98216o8575j16706P6592L02702M28349L75807
3449C09212655L45856M09901M38988N29260O58929N72383N13405P71731R38952O62833
$$ y = [340277255, 339549005, 338654757, 337747157, 336932331, 336168647, 335407674, 334678769, 334024101, 333396703, 332641095, 331752151, 330897927, 330127835, 329439789, 328846574, 328185558, 327366889, 326532781, 325697571, 324890018, 324257314, 323628217, 322758257, 321796775, 320986956, 320310920, 319632769, 318973213, 318466842, 318025082, 317356199, 316375822, 315379381, 314639509, 314041853, 313424408, 312773526, 312131852, 311606497, 311320871, 311267287, 311126709, 310626477, 310037643, 309826702, 309915483, 309703678, 309037596, 308444023, 308178574, 308049738, 307881445, 307585388, 307243079, 307019055, 306904435, 306830674, 306827039, 306988448, 307317257, 307576835, 307746232, 308016270, 308214486, 308145911, 308029205, 308105797, 308408499, 308836848, 309212655, 309558511, 309968412, 310407400, 310936660, 311595589, 312167972, 312681377, 313453108, 314392060, 315054893]
3469.4C15054893K53410K17884N02617P93188P92027M91261M88550Q33154Q57830O60121
3489.8C20944935P11352Q54015R03636Q57234Q22872Q25495O93053N62757O52760Q60185
3510.2C28688294J039326R87202P94589Q08746R84698J154095J080186Q13037P54624
3528.5C37104797R42320J147270J270592J191289J040935J190633J397222J316547
3544.8C46601605J067788J069665J272768J345723J360149J464933J653284J783251
3561.1C57619166J684010J531572J800358K185404K109289J999587K150446K295852
3577.5C73375684K470762K747178K806872K565890K423138K713918K818793K718866
3593.8C94641101K894909L208488L244191L186733L228366L173500L223002L385842
$$ y = [315054893, 315308303, 315526187, 316028804, 316821992, 317614019, 318105280, 318593830, 319426984, 320284814, 320944935, 321656287, 322510302, 323413938, 324271172, 325094044, 325919539, 326612592, 327175349, 327828109, 328688294, 329727620, 330714822, 331509411, 332318157, 333302855, 334456950, 335537136, 336350173, 337104797, 338047117, 339194387, 340464979, 341656268, 342697203, 343887836, 345285058, 346601605, 347669393, 348739058, 350011826, 351357549, 352717698, 354182631, 355835915, 357619166, 359303176, 360834748, 362635106, 364820510, 366929799, 368929386, 371079832, 373375684, 375846446, 378593624, 381400496, 383966386, 386389524, 389103442, 391922235, 394641101, 397536010, 400744498, 403988689, 407175422, 410403788, 413577288, 416800290, 420186132]
3610.1D20186132L462225L584028L472298L316969L633767L725201L439069L071546
3626.4D47891235L135890L903180L972561L783583L754765L655672L631890L708035
3642.7D77436811L648877L500402L687054M003972L689855L362268L713220L917337
3659E06959796L475904L162623L224671L120124K980709L328145L050506K524435K864778
3677.4E34691691K986968K865136K916455K907514K723575K300680K092421K182484
3693.7E55666924K165794K024710J813531J758993K024293K161741K006769J686573
3710E71309328J592457J891792J807451J497925J344263J330853J253724J279354J590788
3728.4E84897935J635969J417041J235604J378238J703620J512707P71939O71626J513063
$$ y = [420186132, 423648357, 427232385, 430704683, 434021652, 437655419, 441380620, 444819689, 447891235, 451027125, 454930305, 458902866, 462686449, 466441214, 470096886, 473728776, 477436811, 481085688, 484586090, 488273144, 492277116, 495966971, 499329239, 503042459, 506959796, 510435700, 513598323, 516822994, 519943118, 522923827, 526251972, 529302478, 531826913, 534691691, 537678659, 540543795, 543460250, 546367764, 549091339, 551392019, 553484440, 555666924, 557832718, 559857428, 561670959, 563429952, 565454245, 567615986, 569622755, 571309328, 572901785, 574793577, 576601028, 578098953, 579443216, 580774069, 582027793, 583307147, 584897935, 586533904, 587950945, 589186549, 590564787, 592268407, 593781114, 594553053, 595224679, 596737742]
3746.7E96737742J227618O54816J187146J580656J218617Q27968J022994J200855J077175
3765.1F06735587R87530Q14438Q61883J079023J081824R44376P91490Q30531Q33988
3783.5F14960670Q15511R08733R37342Q79884P96616Q04484Q97467O02245M09008P97808
3803.9F22809768O08623N53608J012087J051664O86884N50270P94351M91023N07176
3822.2F29065454Q87036P69616P08222O40988O22809P70152N24163J52707L21090N74410
3842.6F35036647P57456R00328Q66831L89039m21762J58548J058996Q51452N42283
3861F40139818L56734M94778N91636K82407L36468M94122N48542N69343L02792M49240
3881.4F44565880O51002M18484L92616K39372R8885M76420O32703L52382J48893J31488
$$ y = [596737742, 597965360, 598620176, 599807322, 601387978, 602606595, 603434563, 604457557, 605658412, 606735587, 607723117, 608537555, 609399438, 610478461, 611560285, 612504661, 613296151, 614126682, 614960670, 615776181, 616684914, 617622256, 618502140, 619298756, 620103240, 621000707, 621602952, 622011960, 622809768, 623418391, 623971999, 624984086, 626035750, 626722634, 627272904, 628067255, 628558278, 629065454, 629952490, 630722106, 631430328, 632071316, 632694125, 633464277, 633988440, 634141147, 634462237, 635036647, 635794103, 636694431, 637561262, 637950301, 637528539, 637687087, 638746083, 639597535, 640139818, 640496552, 640991330, 641582966, 641865373, 642201841, 642695963, 643244505, 643813848, 644116640, 644565880, 645216882, 645635366, 646027982, 646267354, 646366239, 646842659, 647475362, 647827744, 647976637, 648108125]
3901.8F48108125J98543L93688M48168L40938L33786L27826K05338J65880K87175L16799
3922.1F51126266K09987K12133K67207K04981K21550L21388K34783J26362J36852K51770
3942.5F53313279M02987K82049J15574J98364K44141J76668J54555J93894K30670K61724
3962.9F55573905K58922J90556J63257K10107J90019J23680J40846J77443K28226K51949
3983.3F57508910J62840J16765J78397K12073J97649J79529J25349
3997.6F58681512
$$ y = [648108125, 648306668, 648700356, 649148524, 649489462, 649823248, 650151074, 650356412, 650522292, 650809467, 651126266, 651336253, 651548386, 651815593, 652020574, 652242124, 652563512, 652798295, 652924657, 653061509, 653313279, 653716266, 653998315, 654113889, 654312253, 654556394, 654733062, 654887617, 655081511, 655312181, 655573905, 655832827, 656023383, 656186640, 656396747, 656586766, 656710446, 656851292, 657028735, 657256961, 657508910, 657671750, 657788515, 657966912, 658178985, 658376634, 658556163, 658681512]
##END=$$ End of the data block
