##TITLE=$$ Begin of the data block
##JCAMP-DX=5.00 $$ ACD/SpecManager v 10.08
##SPECTROMETER/DATA SYSTEM=Alpha
##DATE=26 Dec 2014 10:25:20
##DATA TYPE=INFRARED SPECTRUM
##DATA CLASS=XYDATA
##ORIGIN=
##OWNER=
##NPOINTS=1765
##FIRSTX=399.76428223
##LASTX=3997.64306641
##MAXX=3997.64306641
##MINX=399.76428223
##MAXY=0.82840800
##MINY=0.23908083
##XFACTOR=1.0000000000
##YFACTOR=1.000000000000000e-9
##FIRSTY=0.53177166
##DELTAX=2.03961372
##XUNITS=1/CM
##YUNITS=ARBITRARY UNITS
##XYDATA=(X++(Y..Y))
399.8E31771660o244600l980637j552641K3127N80549J300633K165079K398908J311541
$$ 531771660 525527060 521546423 519993782 520016909 520597458 521898091 524063170 526462078 527773619
418.1E27773619j458705k897322k642095j970410j863718l126562m423082l706992
$$ 527773619 526314914 523417592 520775497 518805087 516941369 513814807 509391725 505684733
434.4E05684733j157403J440943K710819K886414L507972M886627N166352L330887
$$ 505684733 504527330 505968273 508679092 511565506 515073478 519960105 525126457 528457344
450.8E28457344O08563q37147l61562K37048p83265k747297m002691l704190k563655
$$ 528457344 529065907 528228760 527867198 528104246 527320981 524573684 520570993 516866803 514303148
469.1E14303148k366603l531038l918529k808332j138270J28030j6987j011520r85861
$$ 514303148 511936545 508405507 504486978 501678646 500540376 500668406 500651419 499639899 498654038
487.5D98654038R1284N96434l60817k033084k931088k452463j437784j398086k774984
$$ 498654038 498745322 499341756 498980939 496947855 494016767 491564304 490126520 488728434 485953450
505.8D85953450m098385m010767l139645k940357m011094n353570n228102l454864
$$ 485953450 481855065 477844298 474704653 471764296 467753202 462399632 457171530 453716666
522.1D53716666j565218q22932q40724n30302Q07852L024041M791022N287051M972368
$$ 453716666 452151448 451328516 450487792 449957490 450765342 453789383 458580405 463867456 468839824
540.5D68839824M417032L809035K881974R45508j409709k626538k513558k270609l158420
$$ 468839824 473256856 477065891 479947865 480893373 479483664 476857126 474343568 472072959 468914539
558.9D68914539m950583o315738o619215o398231o189674n666435m129559j352817
$$ 468914539 463963956 457648218 451029003 444630772 438441098 432774663 428645104 427292287
575.2D27292287K019704M880398O519735O967247O879419O705612O033331M341125
$$ 427292287 429311991 434192389 440712124 447679371 454558790 461264402 467297733 471638858
591.5D71638858J882792l398l95178J93893N33075N9902n81801m99278O56605K039760
$$ 471638858 473521650 473518252 473123074 473316967 473850042 473909944 473328143 472828865 473485470 475525230
611.9D75525230K480805K077013K059967L174662M585773N049199M140496K795607
$$ 475525230 478006035 480083048 482143015 485317677 489903450 494952649 499093145 501888752
628.2E01888752K326071K828777L227294K526760J100063L53336R07719J902640J968861
$$ 501888752 504214823 507043600 510270894 512797654 513897717 514251053 515158772 517061412 519030273
646.6E19030273Q97586K0683M41909J611054K192140J554787L04043j42574L81708
$$ 519030273 519927859 519948542 520390451 522001505 524193645 525748432 526052475 525909901 526291609
664.9E26291609J285136K359271J671433P72238J201272K269626K580821J680613N69999
$$ 526291609 527576745 529936016 531607449 532379687 533580959 535850585 538431406 540112019 540682018
683.3E40682018M56631J230657J654804O97553j182616k472162k461314j939059k163946
$$ 540682018 541138649 542369306 544024110 544721663 543539047 541066885 538605571 536666512 534502566
701.6E34502566l139794l486395k133071M04060K531409L220856L112316L654003N367160
$$ 534502566 531362772 527876377 525743306 526147366 528678775 531899631 535011947 538665950 544033110
720E44033110P094145P280171N989909M675508M577875N250990N069673L421664J421392
$$ 544033110 551127255 558407426 564397335 569072843 573650718 578901708 583971381 587393045 588814437
738.3E88814437N01216P22110O24895j063645l672003n298436n050540m074574l965079
$$ 588814437 589315653 590037763 590662658 589599013 585927010 580628574 575578034 571503460 567538381
756.7E67538381m726529m939020l491104o99818K096713L794193M720688O135702Q420050
$$ 567538381 562811852 557872832 554381728 553681910 555778623 559572816 564293504 570429206 578849256
775.1E78849256J0376632J0391116Q323610O005824N261004N779624N791902M370690
$$ 578849256 589225888 599617004 607940614 613946438 619207442 624987066 630778968 635149658
791.4F35149658K727091K705216M393638N998790N697012L637552J973808K224207
$$ 635149658 637876749 640581965 644975603 650974393 656671405 660308957 662282765 664506972
807.7F64506972L327370L260970J511037l61443n99324N12719R38177o65367l355622
$$ 664506972 667834342 671095312 672606349 672244906 671645582 672158301 673096478 672431111 669075489
826F69075489m920185m552483l813565m391491o053090p014513o064415m062236l007948
$$ 669075489 664155304 659602821 655789256 651397765 645344675 638330162 632265747 628203511 625195563
844.4F25195563l673852m767477m819036l908217l345012m094541n029738l425837
$$ 625195563 621521711 616754234 611935198 608026981 604681969 600587428 595557690 592131853
860.7E92131853J675248P700205J1403561J2148082J1455357J0750949R916008P691979
$$ 592131853 593807101 601507306 612910867 625058949 636514306 647265255 657181263 664873242
877F64873242L548801j189887m389227n252897n111814n785286p251263p844210o689727
$$ 664873242 668422043 667232156 662842929 657590032 652478218 646692932 639441669 631597459 624907732
895.4F24907732m860163m188895n281150o971002p854104p785141p918537r281159
$$ 624907732 620047569 615858674 610577524 603606522 595752418 587967277 580048740 570767581
911.7E70767581j1218786j2005508j0773182q229494n753875m095315k899468j391173
$$ 570767581 559548795 547543287 536770105 528540611 522786736 518691421 515791953 514400780
928E14400780N99444K327979L022730L046155L518343M801810N643427M121363j67131
$$ 514400780 515000224 517328203 520350933 523397088 526915431 531717241 537360668 541482031 541314900
946.4E41314900n354881r293676j1701524j3670087j5782118j7564744j8389612j8403381
$$ 541314900 535960019 526666343 514964819 501294732 485512614 467947870 449558258 431154877
962.7D31154877j8455595j9086540j9907236k0171523j9638866j8617570j7361641
$$ 431154877 412699282 393612742 373705506 353533983 333895117 315277547 297915906
977B97915906j5790195j3679236j0973245p947817n180031l116131j645207n03213
$$ 297915906 282125711 268446475 257473230 249525413 244345382 241229251 239584044 239080831
993.3B39080831M60178J282215J774371J722053J252919O93336K47911m5851k54914
$$ 239080831 239541009 240823224 242597595 244319648 245572567 246265903 246513814 246467963 246213049
1011.6B46213049k97740J8030P35030J634761K440885K977729L232390L411114L659725
$$ 246213049 245915309 245933339 246668369 248303130 250744015 253721744 256954134 260365248 264024973
1030B64024973L772318L368765K394587J282424O29425O21676R12756J088530J278490
$$ 264024973 267797291 271166056 273560643 274843067 275472492 276094168 277006924 278095454 279373944
1048.4B79373944K021313L500878N273581O693542P605880Q443416R640425J0532200
$$ 279373944 281395257 284896135 290169716 296863258 304469138 312912554 322552979 333085179
1064.7C33085179R082496L669620m225731j0187983j1092872q010208m088551j094043
$$ 333085179 342167675 345837295 341611564 331423581 320330709 312320501 308231950 307137907
1081C07137907J037597K783567M243374N312294N878686N896390N522549M853219L769785
$$ 307137907 308175504 310959071 315202445 320514739 326393425 332289815 337812364 342665583 346435368
1099.4C46435368K260655Q54284M35829J388252L043771M257470M442304L896058L248900
$$ 346435368 348696023 349550307 349986136 351374388 354418159 358675629 363117933 367013991 370262891
1117.7C70262891K835959K546996K196789K094567K742260M051686N017757M393608
$$ 370262891 373098850 375645846 377842635 379937202 382679462 386731148 391748905 396142513
1134C96142513J877546j653016m835605o794602p672548p993341p831186o987393n397528
$$ 396142513 398020059 396367043 391531438 384736836 377064288 369070947 361239761 354252368 348854840
1152.4C48854840l426433j729905n66483M47691J928806M070103O404698Q315951R725242
$$ 348854840 345428407 343698502 343132019 343579710 345508516 349578619 355983317 364299268 374024510
1170.7C74024510J0979265J2331605J3587296J4213860J3945789J3158261J2495101
$$ 374024510 385003775 397335380 410922676 425136536 439082325 452240586 464735687
1185D64735687J2005240J1007785Q964956O302506M136205L140807K904594K593696
$$ 464735687 476740927 487748712 496713668 503016174 507152379 510293186 513197780 515791476
1201.3E15791476J991510J692891K373398L883302N237877N622030N193531M678607
$$ 515791476 517782986 519475877 521849275 525732577 530970454 536592484 541786015 546464622
1217.7E46464622M396379L895223K543986N26965j097262j582444j267731j095474
$$ 546464622 550861001 554756224 557300210 557827175 556729913 555147469 553879738 552784264
1234E52784264j560450k148866j980424q56280M97281J235187J292527J349509J914858
$$ 552784264 551223814 549074948 547094524 546238244 546735525 547970712 549263239 550612748 552527606
1252.3E52527606K607227K605498J694739O49750M99964J380384K382755K617717K066314
$$ 552527606 555134833 557740331 559435070 560084820 560584784 561965168 564347923 566965640 569031954
1270.7E69031954J401782J147806J070261N42164n04732j316607j260757o13988k71499
$$ 569031954 570433736 571581542 572651803 573193967 572689235 571372628 570111871 569497883 569226384
1289E69226384p74443j720905k253354k025187j566172j557946k053916k497256k296269
$$ 569226384 568451941 566731036 564477682 562452495 560886323 559328377 557274461 554777205 552480936
1307.4E52480936j488328q38697r53853j467526j650453j430213j456559k420962m141688
$$ 552480936 550992608 550153911 549200058 547732532 546082079 544651866 543195307 540774345 536632657
1325.8E36632657n570412n905926n318582m492760l815889l114760j985729n08904
$$ 536632657 531062245 525156319 519837737 515344977 511529088 508414328 506428599 505919695
1342.1E05919695N62549P73489K45512l89219n60462m41909n30779r82941j504242
$$ 505919695 506482244 507255733 507501245 507112026 506551564 506109655 505578876 504595935 503091693
1360.4E03091693j658976j136959n00262l29077l11762j7643N86748J097709J153589
$$ 503091693 501432717 500295758 499795496 499466419 499154657 499137014 499723762 500821471 501975060
1378.8E01975060Q77738R86397K167105M077733M877746L824592K395034J075983J50978
$$ 501975060 502852798 503839195 506006300 510084033 514961779 518786371 521181405 522257388 522408366
1397.1E22408366l22163o66141j185835j950025k179802j820326j561105j508772j486421
$$ 522408366 522086203 521420062 520234227 518284202 516104400 514284074 512722969 511214197 509727776
1415.5E09727776j476169j142084j82450M91381O02722O58393R77039J484811J893342
$$ 509727776 508251607 507109523 506927073 507418454 508021176 508679569 509656608 511141419 513034761
1433.9E13034761K112508J871764J462460J607120J785636J402259K92718q61346j249075
$$ 513034761 515147269 517019033 518481493 520088613 521874249 523276508 523569226 522707880 521458805
1452.2E21458805j107812j477540k108037j042366L19361J861453L572405M715144
$$ 521458805 520350993 518873453 516765416 515723050 516042411 517903864 521476269 526191413
1468.5E26191413O289542R035528R946823R049535Q443773P926404P303715O511926
$$ 526191413 532480955 541516483 551463306 560512841 568956614 576883018 584186733 590698659
1484.9E90698659O459415O989181O576121M863858M098595M463851M475296L977596
$$ 590698659 597158074 604147255 610723376 615587234 619685829 624149680 628624976 632602572
1501.2F32602572L450811L391683L486753K672255K490342K672553K447009K106011
$$ 632602572 636053383 639445066 642931819 645604074 648094416 650766969 653213978 655319989
1517.5F55319989K076387K553523K416372J694143J129269R06408J353026J799166
$$ 655319989 657396376 659949899 662366271 664060414 665189683 666096091 667449117 669248283
1533.8F69248283J563013J167118O48379n6207K08199N21481K68400k32577l07501
$$ 669248283 670811296 671978414 672626793 672570586 672778785 673300266 673568666 673336089 673028588
1552.2F73028588J80126O46412O6280j751601j359225o89506l03984k50459r21726
$$ 673028588 673208714 673855126 673921406 672169805 670810580 670121074 669817090 669566631 668644905
1570.5F68644905j154959r61125j041412q55446p92086j322091j702428j520514j153469
$$ 668644905 667489946 666528821 665487409 664631963 663839877 662517786 660815358 659294844 658141375
1588.9F58141375j216233j786113k449632k618193k306760k221882k691686l372491
$$ 658141375 656925142 655139029 652689397 650071204 647764444 645542562 642850876 639478385
1605.2F39478385l786087l842711l484547l115356l854036n298973m222810k963245
$$ 639478385 635692298 631849587 628365040 625249684 621395648 616096675 611873865 608910620
1621.5F08910620l300488l613174l836035l783525k647995j734019k142131k327442
$$ 608910620 605610132 601996958 598160923 594377398 591729403 589995384 587853253 585525811
1637.8E85525811j522661o70909K44736R91404J182199J102626J684308K639890K538741
$$ 585525811 584003150 583332241 583576977 584568381 585750580 586853206 588537514 591177404 593716145
1656.2E93716145K700984L211737L690362L940224M019261M843414N405545M482031
$$ 593716145 596417129 599628866 603319228 607259452 611278713 616122127 621527672 626009703
1672.5F26009703M541814N246401N102455M989624N421401O135046N075038M577100
$$ 626009703 630551517 635797918 640900373 645889997 651311398 657446444 662521482 667098582
1688.8F67098582M974782M503131M341543M245043L977120M308879L393233K536714
$$ 667098582 672073364 676576495 680918038 685163081 689140201 693449080 696842313 699379027
1705.1F99379027K261102K152562K450586K725362K652645K067268J319766J433909
$$ 699379027 701640129 703792691 706243277 708968639 711621284 713688552 715008318 716442227
1721.5G16442227J965046K166808J871586J652360J788854K425194K483308J781404
$$ 716442227 718407273 720574081 722445667 724098027 725886881 728312075 730795383 732576787
1737.8G32576787J501501J569986K053380K645076K847075K572656K213895K274513
$$ 732576787 734078288 735648274 737701654 740346730 743193805 745766461 747980356 750254869
1754.1G50254869K766014K911031K316117J704455J444280J735925K174080K058387
$$ 750254869 753020883 755931914 758248031 759952486 761396766 763132691 765306771 767365158
1770.4G67365158J318693P41064R45747J448930J565337J061141N78702O45220J108289
$$ 767365158 768683851 769424915 770370662 771819592 773384929 774446070 775024772 775669992 776778281
1788.8G76778281J512408J350880O62148M55498Q07107J197696J147806P21753M07398
$$ 776778281 778290689 779641569 780303717 780759215 781566322 782764018 783911824 784633577 785040975
1807.1G85040975N32388R72867J159430Q72135M18544L16143O81996J085341J069844
$$ 785040975 785573363 786546230 787705660 788577795 788996339 789312482 789994478 791079819 792149663
1825.5G92149663O08265J59681J63675O22332Q74281N73814J17182J00076M71294P11203
$$ 792149663 792757928 792917609 793081284 793703616 794577897 795151711 795268893 795368969 795840263 796551466
1845.9G96551466M86553M2379j93060M8876N24282O90341L63052o2644m1425L97920
$$ 796551466 797038019 797080398 796887338 796936214 797460496 798150837 798513889 798451245 798409820 798807740
1866.3G98807740P12812M49121l9935j66297J70708O47425P08640L45230M4346J56879
$$ 798807740 799520552 799969673 799929738 799763441 799934149 800581574 801290214 801635444 801679790 801836669
1886.7H01836669N29588P11858M71473K7299j53661J42217N24044N20110J59859j47402
$$ 801836669 802366257 803078115 803549588 803576887 803423226 803565443 804089487 804609597 804769456 804622054
1907.1H04622054r1970K38121M48465L19123m2736k18213O6042M46916M38452Q3565
$$ 804622054 804530084 804768205 805216670 805535793 805493057 805274844 805340886 805787802 806226254 806309819
1927.5H06309819j76847n9008K96116M45365K07782r4414j14679J48177M17531L82066
$$ 806309819 806132972 806073964 806370080 806815445 807023227 806928813 806814134 806962311 807379842 807761908
1947.9H07761908R6082r5606L6300L61085N05328L01718p271m9770J91510M11808L57509
$$ 807761908 807857990 807762384 807798684 808159769 808665097 808966815 808959544 808909774 809101284 809513092 809870601
1970.3H09870601Q2135j37508m7266K65061M06921J99020j19388j68502R4950L46959
$$ 809870601 809952736 809815228 809767962 810033023 810439944 810638964 810519576 810351074 810446024 810792983
1990.7H10792983K55525q8573k69294j19924J66476K39789k4974l76106m33027j70768
$$ 810792983 811048508 810959935 810690641 810570717 810737193 810976982 810952008 810575902 810142875 809972107
2011.1H09972107M8459o6280m39048p19369o60061m57466l46184k65181k95520l82244
$$ 809972107 810020566 809954286 809515238 808795869 808135808 807678342 807332158 807066977 806771457 806389213
2031.5H06389213k81692j51336k48194m91798n94616m06861r5785J5199j70111l76582
$$ 806389213 806107521 805956185 805707991 805216193 804621577 804214716 804118931 804134130 803964019 803587437
2051.9H03587437k95282J8120K45392J52111j21235j88649M8041L02553K63513m0293
$$ 803587437 803292155 803310275 803555667 803707778 803586543 803397894 803445935 803748488 804012001 803971708
2072.3H03971708k61307j40667J90318L78430K13861j13368k05219M9770L82126M07874
$$ 803971708 803710401 803569734 803760052 804138482 804352343 804238975 804033756 804083526 804465652 804873526
2092.7H04873526J01864j32858j0372K72871L83317K40266k443o7652J39773L57568
$$ 804873526 804975390 804842532 804832160 805105031 805488348 805728614 805726171 805658519 805798292 806155860
2113.1H06155860K83242k027j77026o2048J98901K78651Q3149j52528j56522O0558
$$ 806155860 806439102 806437075 806260049 806198001 806396902 806675553 806758702 806606174 806449652 806510210
2133.5H06510210K35081J67727n9724j86920n1737K02954K94626J27613r9003p9691
$$ 806510210 806745291 806913018 806853294 806666374 806614637 806817591 807112217 807239830 807140827 807061136
2153.9H07061136J98126M19736L55899J52767Q1598K23637M64678O10173N40554L73900
$$ 807061136 807259262 807678998 808034897 808187664 808269262 808492899 808957577 809567750 810108304 810482204
2174.3H10482204L65138N39005O79672N82337L18766K19822M18305O58631O46591M04656
$$ 810482204 810847342 811386347 812066019 812648356 812967122 813186944 813605249 814263880 814910471 815315127
2194.6H15315127J98901K44320M71413O15596N24402L13580K31445L78191N80073N84066
$$ 815315127 815514028 815758348 816229761 816845357 817369759 817683339 817914784 818292975 818873048 819457114
2215H19457114L88801K40326K96175M40121M96209L85105J95563J39237K61664L88682
$$ 819457114 819845915 820086241 820382416 820822537 821318746 821703851 821899414 822038651 822300315 822688997
2235.4H22688997L53217J99556J03057J73866L41714M00960K76029J15872O6340J61290
$$ 822688997 823042214 823241770 823344827 823518693 823860407 824261367 824537396 824653268 824719608 824880898
2255.8H24880898L07381L12209J68741N7280J09434K90096L88801K87950J23561Q0764
$$ 824880898 825188279 825500488 825669229 825726509 825835943 826126039 826514840 826802790 826926351 827007115
2276.2H27007115K05159L90709M07993K00034k4677q0347M8041J58847R5129n7936
$$ 827007115 827212274 827602983 828010976 828211010 828186333 828105986 828154027 828312874 828408003 828350067
2296.6H28350067j51336j19090l3200n9903k25961l47316k88904q5592K1338j99019
$$ 828350067 828198731 828079641 828046441 827986538 827760577 827413261 827124357 827038765 827060103 826861084
2317H26861084n30720o08683l57270o9082j01328l34620m44830l50594j69516n5849
$$ 826861084 826330364 825721681 825364411 825295329 825194001 824859381 824414551 824063957 823894441 823838592
2337.4H23838592j32442l26991j61469M90427O34789p2717r31263j342416j034260
$$ 823838592 823706150 823379159 823217690 823708117 824342906 824270189 823338926 821996510 820962250
2355.8H20962250l90529o6817j50442j80960J49071O45340Q50200O94990M83692M71890
$$ 820962250 820571721 820504904 820354462 820173502 820322573 820967913 821818113 822513103 822996795 823468685
2376.2H23468685O82175Q40307O72400K70724p1049j51694j8596N4896r6322l19957
$$ 823468685 824150860 824991167 825663567 825934291 825863242 825711548 825692952 825747848 825651526 825331569
2396.6H25331569l98338k70546q3804j01864l35157n04673m39226k66493k06351l49223
$$ 825331569 824933231 824662685 824578881 824477017 824141860 823637187 823197961 822931468 822725117 822375894
2417H22375894n62847o22928m70579k94924l66211o31868p48456n90444l91483l74794
$$ 822375894 821813047 821190119 820719540 820424616 820058405 819426537 818678081 818087637 817696154 817321360
2437.4H17321360n35607p09176p11263n50508m27246n02706o83903p41542o10649m14551
$$ 817321360 816785753 816076577 815365314 814814806 814387560 813884854 813200951 812459409 811848760 811434209
2457.8H11434209l55661n09977o74903o44028m58599l44336m62532o58810o78480n21063
$$ 811434209 811078548 810568571 809893668 809249640 808791041 808446705 807984173 807325363 806646883 806125820
2478.1H06125820l67046l29673m15087n16593m82798l25858k22624l04580m56213m77255
$$ 806125820 805758774 805429101 805014014 804497421 804014623 803688765 803466141 803161561 802705348 802228093
2498.5H02228093l24666j48058j50979l22223m37974l57926k14816j97887l25322m68075
$$ 802228093 801903427 801755369 801604390 801282167 800844193 800486267 800271451 800073564 799748242 799280167
2518.9G99280167m93884m07279l42190m04835n51939o49095n91337m68314m98891o70731
$$ 799280167 798786283 798379004 798036814 797631979 797080040 796430945 795839608 795371294 794872403 794201672
2539.3G94201672p67529p26521o20127n31792n46217o41287o91533o17206n14984n40853
$$ 794201672 793434143 792707622 792087495 791555703 791009486 790368199 789676666 789059460 788544476 788003623
2559.7G88003623o66379p57933p20739n79298m87328n17666n97656o43372o06358n18561
$$ 788003623 787337244 786579311 785858572 785279274 784791946 784274280 783676624 783033252 782426894 781908333
2580.1G81908333m92155n52356n99862n50210m11570l14176l57867m62412m98951m41313
$$ 781908333 781416178 780863822 780263960 779713750 779302180 778988004 778630137 778167725 777668774 777227461
2600.5G77227461l47674l47018m97818o60240p13647o68347o40750p39455r18925j014292
$$ 777227461 776879787 776532769 776034951 775374711 774661064 773992717 773351967 772612512 771693587 770679295
2620.9G70679295r51409q81970r42111j113594j250684j217842j114786j091540j152634
$$ 770679295 769727886 768845916 767903805 766790211 765539527 764321685 763206899 762115359 760962725
2639.3G60962725j243592j258611j172483j110673j134694j215577j256824j187741
$$ 760962725 759719133 758460522 757288039 756177366 755042672 753827095 752570271 751382530
2655.6G51382530j087904j055718j115024j165330j125813j050770r99570r85324j022518
$$ 751382530 750294626 749238908 748123884 746958554 745832741 744781971 743782401 742797077 741774559
2673.9G41774559j045644r69410q84056q54910q73387r32455r40024q80123q52167
$$ 741774559 740728915 739759505 738875449 738020539 737147152 736214697 735274673 734394550 733542383
2692.3G33542383r12905j056671j156569j103878j023411j046837j157760j257301
$$ 733542383 732629478 731572807 730416238 729312360 728288949 727242112 726084352 724827051
2708.6G24827051j216829j062512r69648j024008j140654j156926j036525r01461q56876
$$ 724827051 723610222 722547710 721578062 720554054 719413400 718256474 717219949 716318488 715461612
2727G15461612q95679r04978q35239p52032p03752p23780q01980q40127q02994p30217
$$ 715461612 714565933 713660955 712825716 712073684 711369932 710646152 709844172 709004045 708201051 707470834
2747.4G07470834o69777p04050p79987p40528o06775n34654n79238o60777o79731o16670
$$ 707470834 706801057 706097007 705317020 704576492 703969717 703435063 702855825 702195048 701515317 700898647
2767.8G00898647n74648o38545p58052q44895q74400q73924r05037j001417j118124
$$ 700898647 700323999 699685454 698927402 698082507 697208107 696334183 695429146 694427729 693309605
2786.1F93309605j194596j232863j271128j343191j453459j552463j619100j647056
$$ 693309605 692115009 690882146 689611018 688267827 686814368 685261905 683642805 681995749
2802.4F81995749j681506j803100j949251k017081k012431k013564k104104k271414
$$ 681995749 680314243 678511143 676561892 674544811 672532380 670518816 668414712 666143298
2818.8F66143298k371728k346993k343297k450168k617419k771914k866149k911567
$$ 666143298 663771570 661424577 659081280 656631112 654013693 651241779 648375630 645464063
2835.1F45464063k952099l094673l387809l675103l837467l918588l961920l870309
$$ 645464063 642511964 639417291 636029482 632354379 628516912 624598324 620636404 616766095
2851.4F16766095l514886l044903k759874k773762l084898l595113m102469m550218
$$ 616766095 613251209 610206306 607446432 604672670 601587772 597992659 593890190 589339972
2867.7E89339972m951597n260586n479455n589545n460322m993498m295052l583252
$$ 589339972 584388375 579127789 573648334 568058789 562598467 557604969 553309917 549726665
2884E49726665k928674k250612j563966j023829p52211p03633p52687q42631r47177
$$ 549726665 546797991 544547379 542983413 541959584 541207373 540503740 539751053 538908422 537961245
2902.4E37961245j117588j449167j876235k300322k754450l251493l670514l887117
$$ 537961245 536843657 535394490 533518255 531217933 528463483 525211990 521541476 517654359
2918.7E17654359l859341l554463l016532k283394j373589l84092P26223J990914L172994
$$ 517654359 513795018 510240555 507224023 504940629 503567040 503182948 503909171 505900085 509073079
2937E09073079M105627M834652N355120N674720N834579N852699N822957N791008N749882
$$ 509073079 513178706 518013358 523368478 529043198 534877777 540730476 546553433 552344441 558094323
2955.4E58094323N702912N616010N417108N032718M554034M188359L983259L870725
$$ 558094323 563797235 569413245 574830353 579863071 584417105 588605464 592588723 596459448
2971.7E96459448L782273L695309L683626L700912L542960L199101K868175K600193
$$ 596459448 600241721 603937030 607620656 611321568 614864528 618063629 620931804 623531997
2988F23531997K315939J992583J649916J340628J022100O73056L57509M8339k48909
$$ 623531997 625847936 627840519 629490435 630831063 631853163 632526219 632883728 632932067 632683158
3006.4F32683158m93765p21455r83297j277745j547456j742363j887500k009154k124309
$$ 632683158 632189393 631467938 630484641 629206896 627659440 625917077 624029577 622020423 619896114
3024.7F19896114k262890k335608k349198k437711k618194k744138k671421k593219
$$ 619896114 617633224 615297616 612948418 610510707 607892513 605148375 602476954 599883735
3041.1E99883735k706408k880156k964378k913058k839863k873421k957582l033936
$$ 599883735 597177327 594297171 591332793 588419735 585579872 582706451 579748869 576714933
3057.4E76714933l051281k963007k856552k838493k915144l009021l048718l011822
$$ 576714933 573663652 570700645 567844093 565005600 562090456 559081435 556032717 553020895
3073.7E53020895k873064k767860k878190l017246l003061k958894k925992k907455
$$ 553020895 550147831 547379971 544501781 541484535 538481474 535522580 532596588 529689133
3090E29689133k971947l014982k918958k787114k813756k946019k894700k688169k640546
$$ 529689133 526717186 523702204 520783246 517996132 515182376 512236357 509341657 506653488 504012942
3108.4E04012942k776205k739221k517760k489895k640903k826333k969384k893239
$$ 504012942 501236737 498497516 495979756 493489861 490848958 488022625 485053241 482160002
3124.7D82160002k645791k450376k478391k637029k606451k385587k314538k498001
$$ 482160002 479514211 477063835 474585444 471948415 469341964 466956377 464641839 462143838
3141D62143838k623081k527654k397299k240568k112657k249420k459138k418131k245337
$$ 462143838 459520757 456993103 454595804 452355236 450242579 447993159 445534021 443115890 440870553
3159.4D40870553k149820k154470k177208k140731k077520k028584k005607k019882
$$ 440870553 438720733 436566263 434389055 432248324 430170804 428142220 426136613 424116731
3175.7D24116731k004952j909375j816570j801640j853198j885086j871348j853525
$$ 424116731 422111779 420202404 418385834 416584194 414730996 412845910 410974562 409121037
3192D09121037j791448j713008j679211j657725j605868j541406j517296j549095j561165
$$ 409121037 407329589 405616581 403937370 402279645 400673777 399132371 397615075 396065980 394504815
3210.3C94504815j504540j448989j393735j345098j376480j423806j386524j287311
$$ 394504815 393000275 391551286 390157551 388812453 387435973 386012167 384625643 383338332
3226.7C83338332j180380j082421j083672j280039j426071j301945j123726j034081
$$ 383338332 382157952 381075531 379991859 378711820 377285749 375983804 374860078 373825997
3243C73825997r82553j017630j130938j145244j024246r35793r59784r91672r45032
$$ 373825997 372843444 371825814 370694876 369549632 368525386 367589593 366629809 365638137 364693105
3261.3C64693105q83788q48293p46638n93483o42955q70139r78112r46045q67039p82609
$$ 364693105 363809317 362961024 362214386 361620903 360977948 360107809 359129697 358183652 357316613 356534004
3281.7C56534004p34389p25984o92964n96076n72622o97017q38041q82327q17001o75291
$$ 356534004 355799615 355073631 354380667 353784591 353211969 352514952 351676911 350794584 349977583 349302292
3302.1C49302292n28544n72294q58307j127362j160443r71258q00878p94291q25972
$$ 349302292 348773748 348201454 347343147 346215785 345055342 344084084 343283206 342488915 341662943
3320.5C41662943q10980q09372r23723j068115j042873r16362q13454p23422p63624
$$ 341662943 340851963 340042591 339118868 338050753 337007880 336091518 335278064 334554642 333791018
3338.8C33791018r39638j042873j073151j000911q16614q73864j146972j193285r84102
$$ 333791018 332851380 331808507 330735356 329734445 328917831 328043967 326896995 325703710 324719608
3357.2C24719608p99686q17329q94516p80434o73055q78901j227975j261323r56267
$$ 324719608 323919922 323102593 322208077 321427643 320754588 319875687 318647712 317386389 316430122
3375.5C16430122p35402p25508p88719p54475n76109l55035k05547l53902o92606o74576
$$ 316430122 315694720 314969212 314180493 313426018 312849909 312494874 312289327 311935425 311242819 310568243
3395.9C10568243k71171q1956m30912p84874n60731k15471j98304k85894l88831m54634
$$ 310568243 310297072 310215116 309784204 308999330 308438599 308223128 308024824 307738930 307350099 306895465
3416.3C06895465l57390k37256j65522l9309J43319K86221K38568J83135K43277J41292
$$ 306895465 306538075 306300819 306135297 306095988 306239307 306525528 306764096 306947231 307190508 307331800
3436.7C07331800q5711p4118J70558L33488L57151L71278M29392M75496N06907O00457
$$ 307331800 307246089 307171971 307342529 307676017 308033168 308404446 308833838 309309334 309816241 310416698
3457.1C10416698P21693O70940O48439R32366J099705P69973L35902L39210O19054
$$ 310416698 311138391 311809331 312457770 313390136 314489841 315259814 315595716 315934926 316553980
3475.5C16553980Q82685R12607O35296N89579R00180R64671Q05289Q43197R64641J031697
$$ 316553980 317436665 318349272 318984568 319574147 320474327 321438998 322244287 323087484 324052125 325083822
3495.9C25083822J012236R63509R17047P49231O59197Q09699J018376J193463J165957
$$ 325083822 326096058 327059567 327976614 328725845 329385042 330194741 331213117 332406580 333572537
3514.2C33572537R40054Q90226J092553J289218J141608Q53866Q60632J086265J321822
$$ 333572537 334512591 335402817 336495370 337784588 338926196 339780062 340640694 341726959 343048781
3532.6C43048781J440197J297623J124382J323819J580030J473785J163274J163035
$$ 343048781 344488978 345786601 346910983 348234802 349814832 351288617 352451891 353614926
3548.9C53614926J392454J469642J512259J671315J859486J950800J870841J750082
$$ 353614926 355007380 356477022 357989281 359660596 361520082 363470882 365341723 367091805
3565.2C67091805J978039K353102K358318K280921K394467K540916K723724K997607
$$ 367091805 369069844 371422946 373781264 376062185 378456652 380997568 383721292 386718899
3581.5C86718899L111422K859354K578497K819747L045857L075748L259242L511429
$$ 386718899 389830321 392689675 395268172 398087919 401133776 404209524 407468766 410980195
3597.9D10980195L544092L487736L491938L424406L455132L578514L629536L733456
$$ 410980195 414524287 418012023 421503961 424928367 428383499 431962013 435591549 439325005
3614.2D39325005L763735L798336M039735L950566L648549L395796L453701M034311
$$ 439325005 443088740 446887076 450926811 454877377 458525926 461921722 465375423 469409734
3630.5D69409734M137546M002184L931343L830075L813535L883154L835797L672212
$$ 469409734 473547280 477549464 481480807 485310882 489124417 493007571 496843368 500515580
3646.8E00515580L790081M095018L853619L541529L802776L988981L638268L388405
$$ 500515580 504305661 508400679 512254298 515795827 519598603 523587584 527225852 530614257
3663.1E30614257L464103L328144L051520L321468L334344K901792K951324L000260
$$ 530614257 534078360 537406504 540458024 543779492 547113836 550015628 552966952 555967212
3679.4E55967212K870381K968490L112197K985775K412975K095699K320886K461195
$$ 555967212 558837593 561806083 564918280 567904055 570317030 572412729 574733615 577194810
3695.8E77194810K366125K064527J797556J974524K241194K172708J794696J480103
$$ 577194810 579560935 581625462 583423018 585397542 587638736 589811444 591606140 593086243
3712.1E93086243J780390J996577J831651J584709J411616J300276J359939J701355
$$ 593086243 594866633 596863210 598694861 600279570 601691186 602991462 604351401 606052756
3728.4F06052756J863420J661122J259804J262426J670719J645505J004577O78479
$$ 606052756 607916176 609577298 610837102 612099528 613770247 615415752 616420329 617098808
3744.7F17098808J354099J250684N95450J016379J634955J459837J091003J153529
$$ 617098808 618452907 619703591 620299041 621315420 622950375 624410212 625501215 626654744
3761F26654744J263917J093387R57370Q67248R26196J166642J265943J167536R20593
$$ 626654744 627918661 629012048 629969418 630836666 631762862 632929504 634195447 635362983 636283576
3779.4F36283576Q35360Q32974P99120R16541J010239R85443R09388Q78990R64165
$$ 636283576 637118936 637951910 638751030 639667571 640677810 641663253 642572641 643451631 644415796
3797.7F44415796O89864M36127R25303Q44359N45025R58741J210689Q25763M67062
$$ 644415796 645105660 645541787 646467090 647311449 647856474 648815215 650025904 650851667 651318729
3816.1F51318729P88033O70314M40478P59423P97450Q04305Q08180P42018Q48889O38962
$$ 651318729 652106762 652777076 653217554 653976977 654774427 655578732 656386912 657128930 657977819 658616781
3836.5F58616781K10643L90947O54936O92188Q07822R18567O16253k73764p8440R96113
$$ 658616781 658827424 659218371 659873307 660565495 661373317 662291884 662908137 662634373 662555933 663552046
3856.9F63552046J037240P01368M09066M38273O39379M35591L73066N22315N85914
$$ 663552046 664589286 665290654 665699720 666137993 666777372 667212963 667586029 668108344 668694258
3875.2F68694258O61194M24802M23909O41346M49121N02944N29706K27928L21448N81265
$$ 668694258 669355452 669780254 670204163 670845509 671294630 671797574 672327280 672555208 672876656 673457921
3895.6F73457921M97102K44081Q2612J15693L83913N86689M97341M11451M10974K68221
$$ 673457921 673955023 674199104 674281716 674397409 674781322 675368011 675865352 676276803 676687777 676955998
3916F76955998J37865K37465L01898J93059K40445M03941L15786K28285L52145L73244
$$ 676955998 677093863 677331328 677633226 677826285 678066730 678470671 678786457 679014742 679366887 679740131
3936.4F79740131K82407K06709J79946K60711K61247K01166K77519L43919L34441K64943
$$ 679740131 680022538 680229247 680409193 680669904 680931151 681132317 681409836 681753755 682088196 682353139
3956.8F82353139J79291J95086K83181L03686K17140J76787K05934K00272K14159K39730
$$ 682353139 682532430 682727516 683010697 683314383 683531523 683708310 683914244 684114516 684328675 684568405
3977.2F84568405J75119J87754L25442L37183K18690J13189M3809P9513K35259L19660
$$ 684568405 684743524 684931278 685256720 685593903 685812593 685925782 685969591 686049104 686284363 686604023
3997.6F86604023
$$ 686604023
##END=$$ End of the data block
