##TITLE=$$ Begin of the data block
##JCAMP-DX=5.00 $$ ACD/SpecManager v 10.08
##SPECTROMETER/DATA SYSTEM=Alpha
##DATE=26 Dec 2014 10:25:20
##DATA TYPE=INFRARED SPECTRUM
##DATA CLASS=XYDATA
##ORIGIN=
##OWNER=
##NPOINTS=1765
##FIRSTX=399.76428223
##LASTX=3997.64306641
##MAXX=3997.64306641
##MINX=399.76428223
##MAXY=0.82952434
##MINY=0.23918042
##XFACTOR=1.0000000000
##YFACTOR=1.000000000000000e-9
##FIRSTY=0.53018945
##DELTAX=2.03961372
##XUNITS=1/CM
##YUNITS=ARBITRARY UNITS
##XYDATA=(X++(Y..Y))
399.8 530189455 524736106 521882594 521166921 521470547 521842599 522524774 524177194 526320398 527675629
418.1 527675629 526640773 523598313 520629048 518726408 516833782 513442695 508859217 505243599
434.4 505243599 504402399 506103277 508939087 512116671 515853524 520474911 525126040 528358638 529428005
452.8 529428005 528875232 528267801 528278291 527586043 524919033 520885944 517135680 514468670 512140036
471.2 512140036 508918047 505122423 502172947 500924110 500935435 500793934 499818325 498883754 498904765
489.5 498904765 499513090 499272108 497310460 494385362 491976261 490587085 489002615 485971421 481887460
507.9 481887460 478083551 475061625 472120970 468152523 462830067 457582295 454089314 452549905
524.2 452549905 451989055 451430231 451090187 452045381 454914093 459358454 464442760 469309807 473731220
542.5 473731220 477724880 480746478 481703013 480283141 477612197 474995494 472602904 469485372 464758307
560.9 464758307 458587170 451932758 445486635 439295620 433587462 429428846 428044856 430000097
577.2 430000097 434865773 441395789 448300272 455026329 461603016 467654228 472152114 474130273
593.5 474130273 474068820 473663986 473913252 474381477 474298507 473688215 473296940 474029332 476077259 478544742
613.9 478544742 480555058 482578695 485813826 490502954 495599508 499726176 502546966 504902244
630.2 504902244 507705271 510850370 513287783 514371753 514806390 515863955 517864883 519813120 520632803
648.6 520632803 520544231 520889163 522539735 524801493 526277363 526516497 526455939 526923358 528178930
667 528178930 530487239 532175720 532949924 534217238 536624432 539280891 540975094 541489601 541842997
685.3 541842997 543035209 544715345 545477867 544393778 541978061 539455771 537405312 535192728 532008171
703.7 532008171 528460801 526349545 526814580 529391706 532684207 535832763 539446294 544807434 551947951
722 551947951 559226096 565170527 569847107 574481130 579766750 584813595 588174641 589549065 590049446
740.4 590049446 590788662 591434181 590390444 586709023 581365407 576259673 572129011 568122447 563382804
758.7 563382804 558423519 554935098 554298162 556452453 560286999 565056026 571200013 579611599 590023816
777.1 590023816 600430906 608727276 614680946 619863808 625610352 631448209 635906339 638666153
793.4 638666153 641356409 645809770 651866198 657498837 661004663 662917435 665234983 668686569
809.7 668686569 671915770 673259914 672789037 672230899 672841549 673841000 673136413 669654965 664674938
828.1 664674938 660151064 656337380 651872814 645718038 638658285 632623315 628574967 625544667
844.4 625544667 621873617 617083073 612249017 608429015 605175078 601099849 596047342 592575669
860.7 592575669 594245017 601997077 613408983 625508666 636933208 647659659 657546639 665256560
877 665256560 668817341 667534053 663030863 657745659 652639091 646852374 639594078 631734729 625026226
895.4 625026226 620148957 615941286 610628605 603626072 595797598 588054180 580108404 570782006
911.7 570782006 559572875 547628582 536938250 528787017 523065627 518927515 515936613 514469504
928 514469504 515036404 517348468 520364106 523403883 526904941 531710863 537374914 541473389 541270733
946.4 541270733 535930693 526648521 514901161 501164556 485344708 467777431 449408203 431033045
962.7 431033045 412592679 393513232 373600304 353403598 333750814 315163970 297869891
977 297869891 282117546 268444300 257521093 249635831 244463772 241329879 239673331 239180416
993.3 239180416 239673421 240985021 242788568 244527519 245751008 246393293 246604249 246566206 246398538
1011.6 246398538 246199027 246236175 246945947 248562694 250977248 253904432 257102758 260524780 264185578
1030 264185578 267924637 271281749 273698181 275004864 275655895 276273727 277137548 278189331 279495209
1048.4 279495209 281580806 285138160 290422767 297086209 304668099 313112646 322764635 333285570
1064.7 333285570 342327267 345970005 341763258 331622988 320580155 312602490 308531970 307458580
1081 307458580 308484346 311210215 315413445 320721179 326604366 332529992 338102192 342967302 346690118
1099.4 346690118 348929137 349853694 350369245 351753652 354736686 358964115 363421828 367323130 370565236
1117.7 370565236 373405099 375973076 378196687 380295306 383031458 387068838 392057389 396443099
1134 396443099 398308575 396612048 391765594 385004461 377363980 369384170 361540616 354540467 349156022
1152.4 349156022 345755816 344052017 343506366 343979180 345929801 349975646 356340349 364676595 374441236
1170.7 374441236 385433972 397782475 411367595 425544709 439455718 452589273 465044439
1185 465044439 477010697 488015473 496970981 503238082 507374167 510550261 513490617 516118109
1201.3 516118109 518114030 519793987 522186160 526093066 531329930 536935627 542107105 546791255
1217.7 546791255 551219583 555118501 557656825 558211148 557114005 555481791 554193914 553117871
1234 553117871 551571131 549433053 547466695 546612024 547096193 548317313 549603283 550956726 552888632
1252.3 552888632 555521309 558136106 559825838 560481906 560986519 562362432 564743817 567360699 569412947
1270.7 569412947 570799053 571967065 573070109 573608041 573075116 571742654 570500314 569925666 569662273
1289 569662273 568860292 567133904 564897060 562856078 561260819 559682906 557603657 555127501 552922904
1307.4 552922904 551489532 550586641 549533069 548025310 546378195 544964969 543520451 541104257
1323.7 541104257 536971569 531410933 525522590 520231783 515767097 511995435 508924663 506935537
1340 506935537 506383777 506894529 507631958 507878661 507513344 506983876 506577909 506052554 505043268 503530502
1360.4 503530502 501889467 500777543 500290036 499940902 499593973 499572277 500175655 501257360 502386749
1378.8 502386749 503290176 504306138 506439149 510473549 515368521 519234359 521635354 522669673
1395.1 522669673 522774339 522450566 521816730 520646453 518702865 516551852 514761329 513197780 511665523
1413.5 511665523 510177672 508732617 507613063 507429302 507934511 508560300 509203613 510136247 511621475
1431.8 511621475 513553500 515673518 517506778 518943310 520562768 522368908 523777425 524070024
1448.1 524070024 523227394 522010267 520910382 519412577 517266750 516192138 516509175 518395305 521990001
1466.5 521990001 526705325 532981038 542019367 551972151 560988903 569413662 577355623 584654570
1482.8 584654570 591123402 597554266 604581237 611236453 616142154 620225370 624632835 629055977
1499.1 629055977 633029878 636515617 639936805 643388271 646040797 648567855 651284158 653770804
1515.4 653770804 655874133 657907724 660453916 662893593 664596736 665748417 666694880 668052614
1531.8 668052614 669828355 671408534 672632515 673300862 673195481 673379958 673893511 674162388 673932731
1550.1 673932731 673609793 673771799 674438179 674582243 672872782 671499789 670800507 670484126 670199573
1568.5 670199573 669232786 668070018 667128026 666083157 665198922 664397895 663095891 661404788 659867465
1586.8 659867465 658705473 657495320 655709743 653246164 650605202 648302615 646107018 643424273
1603.2 643424273 640042126 636237323 632369757 628865063 625747323 621923566 616690040 612505734
1619.5 612505734 609520435 606181204 602563560 598729491 594908059 592202723 590442359 588328540
1635.8 588328540 586061835 584570646 583889484 584142387 585167289 586339772 587444603 589180648 591867566
1654.1 591867566 594419181 597103775 600263596 603917181 607891500 611968219 616853595 622302353
1670.5 622302353 626817763 631371260 636648774 641782641 646741867 652077377 658150852 663250804
1686.8 663250804 667888105 672902465 677381754 681662798 685905993 689962804 694342792 697736025
1703.1 697736025 700245321 702485085 704635024 707099915 709812164 712415934 714490891 715861440
1719.4 715861440 717294693 719249427 721438348 723338783 725005865 726805210 729234159 731682837
1735.7 731682837 733423412 734914124 736485243 738532245 741152763 743955374 746517301 748777032
1752 748777032 751084268 753856599 756758213 759052694 760767996 762247264 763994217 766156495 768200397
1770.4 768200397 769495547 770206630 771162689 772646010 774217546 775248051 775785983 776428044 777574062
1788.8 777574062 779107630 780456066 781118691 781561553 782352746 783556759 784727633 785466552 785880089
1807.1 785880089 786420643 787411213 788580835 789439499 789839983 790161312 790859282 791937172 792961955
1825.5 792961955 793508232 793637395 793833971 794516861 795429289 796016037 796132922 796208084 796648264 797344267
1845.9 797344267 797817171 797864974 797698915 797762454 798281670 798951864 799289882 799219966 799175024 799563050
1866.3 799563050 800289214 800769210 800731421 800554454 800724506 801367402 802086234 802461624 802515566 802654803
1886.7 802654803 803162098 803849876 804309726 804357290 804236412 804388821 804902673 805422604 805589616 805442750
1907.1 805442750 805348277 805575907 806006491 806316018 806272745 806057096 806142926 806617677 807065308 807148695
1927.5 807148695 806976378 806923568 807221651 807677209 807907104 807804763 807646513 807775259 808212757 808615386
1947.9 808615386 808717728 808620751 808661878 809042275 809554636 809846699 809817255 809730947 809916139 810351610
1968.3 810351610 810714602 810791910 810670197 810662866 810964882 811373949 811547399 811408162 811240315 811343253
1988.7 811343253 811689794 811951995 811883986 811622679 811480582 811612189 811833739 811811745 811450422 811039388
2009 811039388 810873210 810899436 810819209 810373724 809647083 808992565 808546007 808209896 807948411 807637930
2029.4 807637930 807230651 806951702 806838691 806616366 806117594 805526853 805159807 805113494 805139422 804936349
2049.8 804936349 804540038 804250002 804272056 804510593 804653704 804537952 804349542 804367185 804639518 804898858
2070.2 804898858 804857135 804589570 804459631 804676652 805074334 805298209 805189669 804986835 805047750 805425763
2090.6 805425763 805807352 805902660 805784822 805785477 806076407 806482136 806715786 806699514 806638658 806772649 807109416
2113.1 807109416 807392478 807401419 807225645 807158649 807360709 807657361 807751894 807603061 807449818 807500780
2133.5 807500780 807739198 807911754 807823181 807644069 807648122 807857335 808115423 808237970 808156788 808076739
2153.9 808076739 808267832 808703065 809085429 809238136 809312463 809563041 810057998 810659528 811164200 811506450
2174.3 811506450 811851084 812371016 813050926 813663602 814012051 814246714 814657450 815285087 815910876 816318452
2194.6 816318452 816539466 816807091 817282796 817891896 818412423 818726480 818956077 819325447 819888830 820461810
2215 820461810 820843935 821072519 821369410 821814060 822297752 822680533 822887897 823025823 823278785 823666692
2235.4 823666692 824045420 824265003 824344873 824500263 824834108 825207829 825465500 825580060 825650632 825829208
2255.8 825829208 826145351 826463819 826672256 826767445 826862812 827108920 827487886 827816367 827966452 828027248
2276.2 828027248 828205466 828588545 829006553 829216003 829192996 829130113 829209983 829404294 829524338 829448342
2296.6 829448342 829255700 829143822 829160988 829106092 828817308 828394532 828073621 828010142 828078628 827899694
2317 827899694 827302516 826598823 826192677 826111197 826046228 825764894 825359046 825017095 824818671 824765861
2337.4 824765861 824639320 824271023 824073315 824571073 825262487 825220764 824260354 822897136 821800053
2355.8 821800053 821287990 821231663 821194053 821037412 821091950 821691692 822614849 823400259 823955297 824474514
2376.2 824474514 825157344 825988352 826705277 827051401 827014267 826847315 826800764 826854169 826787472 826482415
2396.6 826482415 826085627 825822651 825727522 825596988 825244606 824739337 824299932 824032187 823810756 823434889
2417 823434889 822877109 822293818 821855485 821547091 821153522 820533752 819787979 819150686 818721652 818345904
2437.4 818345904 817817330 817117393 816429913 815910339 815500617 815007150 814341068 813639343 813068688 812619865
2457.8 812619865 812169850 811608195 810944259 810330570 809892595 809557974 809111118 808465540 807801604 807311893
2478.1 807311893 806949854 806567013 806101501 805583835 805128872 804836631 804617226 804275930 803798139 803344429
2498.5 803344429 803060174 802937150 802773416 802404761 801932275 801577926 801397860 801230073 800885797 800374568
2518.9 800374568 799868345 799481511 799154460 798737764 798160911 797484815 796884716 796441257 795961380 795282423
2539.3 795282423 794502854 793772995 793166339 792663932 792130828 791470885 790764630 790145457 789624035 789092183
2559.7 789092183 788444161 787711143 787035704 786484420 785987079 785438001 784805596 784144402 783546746 783050716
2580.1 783050716 782578766 782037556 781414270 780807793 780361772 780073822 779767334 779325902 778824091 778390765
2600.5 778390765 778056979 777705789 777187943 776507735 775797606 775163054 774560690 773829460 772901833 771893024
2620.9 771893024 770937920 770049512 769111335 767983496 766719222 765505135 764384866 763285279 762123048
2639.3 762123048 760857463 759599566 758457422 757358968 756212831 755002081 753740728 752526700
2655.6 752526700 751460433 750450253 749337852 748145163 746984303 745930731 744988859 744059801 743036807
2673.9 743036807 741941690 740935445 740101218 739307940 738409400 737425089 736458004 735562325 734710693
2692.3 734710693 733819783 732795596 731651664 730530858 729484141 728422105 727259040 726029396
2708.6 726029396 724865675 723802686 722776234 721722066 720603228 719490886 718489408 717594862
2724.9 717594862 716726243 715809941 714876473 714016497 713258028 712556541 711814940 710990727 710151911 709379911
2745.3 709379911 708685696 708024383 707324445 706570327 705856502 705226898 704645395 704071641 703444839 702769756
2765.7 702769756 702133834 701543629 700900197 700134397 699271679 698387146 697531760 696662605 695667028 694519937
2786.1 694519937 693304420 692074537 690822065 689491510 688026965 686453879 684839308 683218420
2802.4 683218420 681538403 679713964 677769959 675769866 673736036 671696067 669606686 667379379
2818.8 667379379 665033698 662669420 660307884 657831550 655160069 652357638 649510860 646662474
2835.1 646662474 643752217 640626609 637212634 633546650 629703343 625777245 621831119 617968440
2851.4 617968440 614418626 611316502 608521163 605732024 602634609 599028170 594905972 590334952
2867.7 590334952 585348129 580035269 574526608 568951786 563544631 558570206 554211736 550556183
2884 550556183 547603369 545368791 543846488 542855978 542101979 541371822 540588856 539751709 538832664
2902.4 538832664 537701309 536222994 534338713 532017171 529242098 525989115 522302806 518398941
2918.7 518398941 514535546 510971963 507965446 505714417 504353702 503962159 504687428 506685615 509877145
2937 509877145 514008939 518843710 524181068 529839873 535661399 541560709 547489583 553334951 559071362
2955.4 559071362 564799845 570474684 575859070 580798388 585350335 589635372 593698204 597576737
2971.7 597576737 601367891 605129480 608871460 612593114 616169572 619421363 622321129 624907613
2988 624907613 627222657 629279971 631000817 632374406 633412361 634096742 634470999 634538412 634292126
3006.4 634292126 633810878 633140087 632198989 630908251 629338443 627611578 625740469 623728096 621604621
3024.7 621604621 619345367 616982102 614592075 612162828 609582603 606853127 604167163 601541817
3041.1 601541817 598815024 595935762 592964649 590037704 587201774 584326029 581331551 578271151
3057.4 578271151 575223327 572243869 569347024 566487491 563566327 560548186 557516158 554539204
3073.7 554539204 551670611 548885882 545988381 542945325 539942503 536978245 533979952 530998588
3090 530998588 528020501 525052547 522182941 519433916 516679943 513779759 510855079 508079827 505362868
3108.4 505362868 502555311 499786794 497228622 494738072 492112488 489278287 486286193 483376116
3124.7 483376116 480735332 478246570 475679517 473005414 470419705 468054175 465742171 463230073
3141 463230073 460574508 458001286 455576509 453342170 451269209 449076205 446625501 444151223 441832691
3159.4 441832691 439631462 437460482 435262382 433052629 430908501 428880811 426912099 424934417
3175.7 424934417 422957152 421012193 419112504 417265117 415449113 413615465 411769122 409959614
3192 409959614 408203691 406469017 404723853 402993351 401360780 399858207 398389190 396825910 395200610
3210.3 395200610 393660486 392232299 390852422 389482886 388103515 386704773 385296762 383951247
3226.7 383951247 382748663 381668001 380583644 379306197 377881020 376578510 375437468 374361724
3243 374361724 373346120 372332543 371230990 370114505 369105905 368159026 367150635 366121501 365200669
3261.3 365200669 364371717 363565624 362829298 362192750 361493260 360630959 359687954 358735859 357864588 357093066
3281.7 357093066 356335878 355577260 354852855 354229331 353679866 353044122 352267653 351368308 350466907 349764615
3302.1 349764615 349241138 348668694 347839832 346751302 345630884 344678581 343829900 342959970 342077613
3320.5 342077613 341226250 340386391 339436829 338380158 337390035 336510599 335700125 334945023 334132671
3338.8 334132671 333176643 332132936 331050903 330043852 329203397 328334779 327258587 326118827 325117707
3357.2 325117707 324242651 323351473 322464228 321730882 321027875 320093036 318905860 317710906 316762775
3375.5 316762775 316012770 315272450 314467639 313667476 313018054 312648714 312492549 312156349 311461687 310806453
3395.9 310806453 310532361 310418129 309967041 309163690 308533818 308233649 307994604 307698786 307327986 306923836
3416.3 306923836 306642652 306475550 306313604 306234390 306349337 306604862 306819260 307037711 307359219 307523489
3436.7 307523489 307395905 307287425 307464242 307870150 308284372 308608502 308984846 309464067 309983820 310594946
3457.1 310594946 311333388 312004238 312641948 313566774 314647555 315406084 315747231 316097707 316727340
3475.5 316727340 317606896 318509191 319164723 319815338 320724428 321627825 322395205 323234737 324220955 325283676
3495.9 325283676 326276273 327205747 328150362 328947335 329613537 330404460 331416428 332632363 333825141
3514.2 333825141 334795505 335729331 336866975 338193715 339349657 340201974 341060996 342109233 343374729
3532.6 343374729 344847351 346236229 347384453 348703772 350312412 351780623 352899909 354081452
3548.9 354081452 355524212 357015133 358555198 360252202 362139136 364136398 366027057 367760122
3565.2 367760122 369707316 372056305 374444842 376763791 379204571 381782621 384509653 387460977
3581.5 387460977 390518099 393390924 396022648 398904115 402025402 405145347 408432424 411992401
3597.9 411992401 415572524 419060975 422520250 425897777 429350376 432988077 436680883 440454751
3614.2 440454751 444233119 448022276 452067167 456024915 459673703 463127166 466688156 470777541
3630.5 470777541 474918008 478880852 482702553 486437887 490269035 494221687 498088688 501747549
3646.8 501747549 505532920 509681642 513638437 517282307 521098793 525042415 528672636 532070637
3663.1 532070637 535513759 538789153 541798890 545130968 548469007 551331341 554272532 557325840
3679.4 557325840 560286820 563328505 566446960 569388390 571761250 573859990 576216280 578687727
3695.8 578687727 581014991 583072782 584937155 586967647 589182734 591243148 592932522 594444692
3712.1 594444692 596335351 598399997 600243688 601797044 603156030 604437292 605858028 607649267
3728.4 607649267 609528303 611166835 612452328 613680601 615274906 616946638 618018389 618655801
3744.7 618655801 619926929 621188164 621916413 623045743 624633193 625987411 627030015 628192127
3761 628192127 629472435 630590796 631587565 632482111 633408606 634563327 635798335 636935472 637885571
3779.4 637885571 638764858 639619589 640457332 641394734 642362654 643311024 644242108 645129561 646100521 646849692
3799.8 646849692 647293866 648125827 648891985 649433792 650411606 651648700 652559280 653150976 653975904
3818.1 653975904 654589415 654980123 655730963 656521261 657276571 658035755 658806920 659735024 660405934 660547554
3838.5 660547554 660813212 661441088 662251890 663138330 664023876 664625406 664413273 664369643 665357709 666388929
3858.9 666388929 667078972 667460859 667843223 668410242 668802619 669210434 669830203 670489371 671181202 671602845
3879.3 671602845 671930969 672460377 672906876 673479676 674055934 674273312 674588442 675212204 675744534 675979137
3899.7 675979137 676033795 676121771 676470220 677040637 677587986 678037465 678415418 678680003 678848386 679116189
3920.1 679116189 679470658 679719865 679999948 680382848 680590510 680711508 681037724 681424558 681747377 682016134
3940.5 682016134 682200968 682417333 682678282 682881355 683099568 683412433 683810472 684171140 684409797 684603214
3960.9 684603214 684794962 684994280 685195982 685380518 685586095 685811162 686017036 686237931 686478794 686737955
3981.3 686737955 687030733 687283754 687445879 687591136 687757373 687921464 688128412 688359618
3997.6 688359618
##END=$$ End of the data block
