##TITLE=$$ Begin of the data block
##JCAMP-DX=5.00 $$ ACD/SpecManager v 10.08
##SPECTROMETER/DATA SYSTEM=Alpha
##DATE=26 Dec 2014 10:25:20
##DATA TYPE=INFRARED SPECTRUM
##DATA CLASS=XYDATA
##ORIGIN=
##OWNER=
##NPOINTS=1765
##FIRSTX=399.76428223
##LASTX=3997.64306641
##MAXX=3997.64306641
##MINX=399.76428223
##MAXY=0.83114833
##MINY=0.23957054
##XFACTOR=1.0000000000
##YFACTOR=1.000000000000000e-9
##FIRSTY=0.53399664
##DELTAX=2.03961372
##XUNITS=1/CM
##YUNITS=ARBITRARY UNITS
##XYDATA=(X++(Y..Y))
399.8E33996642o362617l641248j169622K57075N70655Q38756J878679K369821J225174
418.1E29963315j383782k761781k588093k247870k263427l094375l960133l320634
434.4E08343220j283586J138985K809942L044963L180682M422009M948676L319144
450.8E29924035O08802r57549m79877K39492p82013k894581m084408l484011k239048
469.1E15850842k095103l412426m181623l206194j143396L62039J2159j058101r40681
487.5E00187516J52409O18100l66509k140492l140419k402306j141161j315117k864629
505.8D87587392m292011m350811l304750k789646l762335n270839n240291l407180
522.1D55169529j509100o78361o46740l82245Q26955K790481M570842N318045M987389
$$ plain form
399.8 533996642 527634025 523992777 522823155 523080230 523650885 524489641 526368320 528738141 529963315
418.1 529963315 528579533 525817752 523229659 520981789 518718362 515623987 511663854 508343220
434.4 508343220 507059634 508198619 511008561 514053524 517234206 521656215 526604891 529924035
450.8 529924035 530532837 529575288 529095411 529334903 528552890 525658309 521573901 518089890 515850842
469.1 515850842 513755739 510343313 506161690 502955496 501812100 502174139 502186298 501128197 500187516
487.5 500187516 500339925 500958025 500591516 498451024 495310605 492908299 491767138 490452021 487587392
505.8 487587392 483295381 478944570 475639820 472850174 469087839 463817000 458576709 455169529
522.1 455169529 453660429 452982068 452335328 451953083 452780038 455570519 460141361 465459406 470446795
540.5D70446795M303217L785879K892375R40322j354754k643406k585500k281219l140420
558.9D70363289m945546o280244o517410o303459o167770n693376m183739j389027
575.2D28882718K077133M881233O349653O776094O712079O534070N971581M450798
591.5D72635359J973748k6465l54051L17543N88000J4484o74069n30243P29114K164960
611.9D76838380K577394K056152K017766L145695M501790N008816M246146K993226
628.2E03385365K428234K784311L153205K494335J126409L99172R47059J971125K062023
646.6E20751238R38892n7339L57568J693666K263367J432121K37942k981O03140J537740
667E29755354K410769J455546O06179J195312K385258K652645J684010N80252M34816
$$ plain form
540.5 470446795 474750012 478535891 481428266 482368588 481013834 478370428 475784928 473503709 470363289
558.9 470363289 465417743 459137499 452620089 446316630 440148860 434455484 430271745 428882718
575.2 428882718 430959851 435841084 442190737 448966831 455678910 462212980 468184561 472635359
591.5 472635359 474609107 474582642 474228591 474546134 475134134 475148618 474474549 473944306 474673420 476838380
611.9 476838380 479415774 481471926 483489692 486635387 491137177 496145993 500392139 503385365
628.2 503385365 505813599 508597910 511751115 514245450 515371859 515771031 516718090 518689215 520751238
646.6 520751238 521690130 521632791 521990359 523684025 525947392 527379513 527617455 527614474 528217614 529755354
667 529755354 532166123 533621669 534227848 535423160 537808418 540461063 542145073 542725325 543160141
685.3E43160141J205205J648546O21676j281142k484918k437114j965881k239406l212750
703.7E33014357l515065k122402M20749K513230L189802L169358L774882N447804P131517
722E53024232P270337N951345M709362M659772N254388N010665L342986J302302M48227
740.4E90973616P98046O63221j134038l703594n247235n062759m198194m091084m802406
758.7E64195573m997909l505826o01887K267062L935576M752934O090522Q423686J0446131
777.1E91005862J0467708Q352339N949855N224049N819500N781114M312813K692819
793.4F39606059K664089M411638O073355N673290L534376J934469K255738L347218
809.7F69500232L225624J414717m36068n43177O00636Q89122q46564l526926m960537
$$ plain form
685.3 543160141 544365346 546013892 546635568 545354426 542869508 540432394 538466513 536227107 533014357
703.7 533014357 529499292 527376890 527797639 530310869 533500671 536670029 540444911 545892715 553024232
722 553024232 560294569 566245914 570955276 575615048 580869436 585880101 589223087 590525389 590973616
740.4 590973616 591771662 592434883 591300845 587597251 582350016 577287257 573089063 568997979 564195573
758.7 564195573 559197664 555691838 555089951 557357013 561292589 566045523 572136045 580559731 591005862
777.1 591005862 601473570 609825909 615775764 620999813 626819313 632600427 636913240 639606059
793.4 639606059 642270148 646681786 652755141 658428431 661962807 663897276 666153014 669500232
809.7 669500232 672725856 674140573 673704505 673161328 673761964 674651086 673804522 670277596 665317059
828.1F65317059m517913l821492m494429o227315p133185o045998m017770l037274
844.4F26021683l697336m744529m743815l795087l323495m150808n031109l390193
860.7E93145311J703083P763565J1459887J2117445J1357606J0600328R800792P698238
877F65646255L515661j347065m520655n320966n191863n855262p258773p818103o664991
895.4F25184238m827678m181683n364359p116496p918656p762075p940232r337545
911.7E70735514j1224866j1942923j0683298q160233n732179m117191k919972j371980
928E14582872O50227K356530L010571L002762L465057M779279N625487M060983k47180
946.4E41286588n416513r324014j1720121j3713121j5824527j7568916j8385082j8421501
$$ plain form
828.1 665317059 660799146 656977654 652483225 646255910 639122725 633076727 629058957 626021683
844.4 626021683 622324347 617579818 612836003 609040916 605717421 601566613 596535504 593145311
860.7 593145311 594848394 602611959 614071846 626189291 637546897 648147225 657948017 665646255
877 665646255 669161916 667814851 663294196 657973230 652781367 646926105 639667332 631849229 625184238
895.4 625184238 620356560 616174877 610810518 603694022 595775366 588013291 580073059 570735514
911.7 570735514 559510648 547567725 536884427 528724194 522992015 518874824 515954852 514582872
928 514582872 515233099 517589629 520600200 523602962 527068019 531847298 537472785 541533768 541286588
946.4 541286588 535870075 526546061 514825940 501112819 485288292 467719376 449334294 430912793
962.7D30912793j8488646j9097060j9876152k0151496j9643128j8581957j7277211
977B97797143j5688091j3585657j0907501p904008n121693l010318j547128m62204
993.3B39570543M83737J289531J723960J640886J200989O82324K70322L204j99884
1011.6B46665612k53528M3228P43821J629889K400532K910376L213018L436446L635079
1030B64424473L706008L340900K408445J316011O79255O37382Q73387J073628J332969
1048.4B79792458K113998L595114N317449O647647P514357Q398086R648055J0497957
1064.7C33525121Q969605L579259m178405j0032355j0974885p987529m069000j069725
1081C07762086R98229K743244M262299N325347N828291N846828N531341M868448L752023
$$ plain form
962.7 430912793 412424147 393327087 373450935 353299439 333656311 315074354 297797143
977 297797143 282109052 268523395 257615894 249711886 244590193 241579875 240032747 239570543
993.3 239570543 240054280 241343811 243067771 244708657 245909646 246591970 246862292 246865496 246665612
1011.6 246665612 246412084 246455312 247199133 248829022 251229554 254139930 257352948 260789394 264424473
1030 264424473 268130481 271471381 273879826 275195837 275875092 276512474 277385861 278459489 279792458
1048.4 279792458 281906456 285501570 290819019 297466666 304981023 313379109 323027164 333525121
1064.7 333525121 342494726 346073985 341895580 331863225 320888340 312900811 308831811 307762086
1081 307762086 308760315 311503559 315765858 321091205 326919496 332766324 338297665 343166113 346918136
1099.4C46918136K248198Q97377N08786J428991L029168M220128M424155L880858L218114
1117.7C70773911K806843K540141K217561K121091K734751L987044M935473M377514
1134C96494329J906276j648218m823535o763488p641823p966846p822811o970913n333781
1152.4C49429190l343135j694679n83142M47631J960694M071623O363601Q283198R720921
1170.7C74655902J1000604J2357920J3577819J4183223J3921291J3114393J2430668
1185D65241820J1963993J1001170Q972168O315529M137099L135502K933323K634943
1201.3E16335547J994729J675844K387285L927052N264223N598426N148470M661858
1217.7E46993434M403115L885329K526521N30780j098693j591444j253903j086175
$$ plain form
1099.4 346918136 349166334 350063711 350572497 352001488 355030656 359250784 363674939 367555797 370773911
1117.7 370773911 373580754 376120895 378338456 380459547 383194298 387181342 392116815 396494329
1134 396494329 398400605 396752387 391928852 385165364 377523541 369556695 361733884 354762971 349429190
1152.4 349429190 346086055 344391376 343808234 344255865 346216559 350288182 356651783 364934981 374655902
1170.7 374655902 385656506 398014426 411592245 425775468 439696759 452811152 465241820
1185 465241820 477205813 488206983 497179151 503494680 507631779 510767281 513700604 516335547
1201.3 516335547 518330276 520006120 522393405 526320457 531584680 537183106 542331576 546993434
1217.7 546993434 551396549 555281878 557808399 558339179 557240486 555649042 554395139 553308964
1234E53308964j578808k151489j934707p92325N36621J227259J248539J327693J945794
1252.3E53137541K627194K569020J670479O89507N49435J383305K348006K579272K048432
1270.7E69602191J407266J169562J098216N57542n12958j329362j249909n75066k32875
1289E69934607p66397j718461k234579k011537j572669j589954k078175k461493k210975
1307.4E53290367j431346q66711j037180j524747j654148j414299j441955k421916
1323.7E41498065m147232n560636n881906n284309m460335l782689l088713j968861
1340E07323384m93765N53251P35700K07066m00662n54264m33802n32449r99093j520752
1360.4E03884614j667679j108646m70758l67343l64274j9789N98342J100063J171291
$$ plain form
1234 553308964 551730156 549578667 547643960 546851635 547388256 548615515 549864054 551191747 553137541
1252.3 553137541 555764735 558333755 560004234 560693741 561243176 562626481 564974487 567553759 569602191
1270.7 569602191 571009457 572179019 573277235 573834777 573321819 571992457 570742548 570167482 569934607
1289 569934607 569168210 567449749 565215170 563203633 561630964 560041010 557962835 555501342 553290367
1307.4 553290367 551859021 550992310 549955130 548430383 546776235 545361936 543919981 541498065
1323.7 541498065 537350833 531790197 525908291 520623982 516163647 512380958 509292245 507323384
1340 507323384 506829619 507382870 508118570 508325636 507924974 507370710 506936908 506404459 505405366 503884614
1360.4 503884614 502216935 501108289 500637531 500270188 499905914 499886125 500484467 501584530 502755821
1378.8E02755821R10341R97603K132595M019678M837513L806829K356529J003027J10865
1397.1E22930801k96831o29127j183331j949132k141356j776576j540303j501918j481831
1415.5E10430396j460016j109183j63794N01037O10173O31451R53675J525461J934290
1433.9E13853490K101899J857042J483142J636386J783312J366138K76625q09014j179218
1452.2E22369802j106977j562000k177715j041353L30270J873970L596484M734159
1468.5E27016640O271541Q993327R952486R078264Q459687P928133P272006O455838
1484.9E91427922O417036O983161O612838M899859M083455M429400M476368L984928
1501.2F33314967L431499L318012L405213K726555K582073K700448K421320K070725
$$ plain form
1378.8 502755821 503666162 504663765 506796360 510816038 515653551 519460380 521816909 522819936 522930801
1397.1 522930801 522633970 522004843 520821512 518872380 516731024 514954448 513414145 511912227 510430396
1415.5 510430396 508970380 507861197 507697403 508198440 508808613 509440064 510393739 511919200 513853490
1433.9 513853490 515955389 517812431 519295573 520931959 522715271 524081409 524358034 523549020 522369802
1452.2 522369802 521262825 519700825 517523110 516481757 516812027 518685997 522282481 527016640
1468.5 527016640 533288181 542281508 552233994 561312258 569771945 577700078 584972084 591427922
1484.9 591427922 597844958 604828119 611440957 616340816 620424271 624853671 629330039 633314967
1501.2 633314967 636746466 640064478 643469691 646196246 648778319 651478767 653900087 655970812
1517.5F55970812K019167K536952K509177J751661J154721R62675J360953J786470
1533.8F70052588J596332J138806N34475j2696L78907O13868K81990k32280l27706
1552.2F74024284J25825N67079o557j645803j190960n83590k78890l13163r85562j160503
1572.6F68552160r71496j057148q31961p74205j320481j679302j490354j172006j266897
1590.9F57988310j815319k461910k626002k309263k225518k696574l376007l777385
1607.2F36700332l811121l441632l125906l942489n302131m118681k929867l325998
1623.5F06702507l629745l848016l772616k621591j725495k125681k252996j435220
1639.9E85291147o15418K67327R91106J202464J154065J700044K669573K637446K761781
$$ plain form
1517.5 655970812 657989979 660526931 663036108 664787769 665942490 666905165 668266118 670052588
1533.8 670052588 671648920 672787726 673322201 673309505 673688412 674302280 674584270 674351990 674024284
1552.2 674024284 674150109 674717188 674710631 673064828 671873868 671290278 671011388 670698225 669712663 668552160
1572.6 668552160 667580664 666523516 665691555 664917350 663596869 661917567 660427213 659255207 657988310
1590.9 657988310 656172991 653711081 651085079 648775816 646550298 643853724 640477717 636700332
1607.2 636700332 632889211 629447579 626321673 622379184 617077053 612958372 610028505 606702507
1623.5 606702507 603072762 599224746 595452130 592830539 591105044 588979363 586726367 585291147
1639.9 585291147 584675729 584943056 585934162 587136626 588290691 589990735 592660308 595297754 598059535
1658.2E98059535L224671L726661M017115M045665M792810N384683M562378M633129
1674.5F32446647N304753N138338M974008N342602O099284N136311M629731M972995
1690.9F74044669M429698M194021M117966M007577M414261L386855K451897K213061
1707.2G03260005K184093K507507K718687K546013K008557J435280J547456K008259
1723.5G20215857K178252J853823J612783J757741K414167K447426J707375J470924
1739.8G35658348J613378K075553K589464K753794K529741K266168K349377K816081
1756.1G54651904K914012K263546J697182J524925J800538K161026J983881J263022
1772.4G70260036P71701J015604J488507J556039J030862N34952O28232J145185J523256
$$ plain form
1658.2 598059535 601284206 605010867 609027982 613073647 617866457 623251140 627813518 632446647
1674.5 632446647 637751400 642889738 647863746 653206348 659305632 664441943 669071674 674044669
1690.9 674044669 678474367 682668388 686786354 690793931 695208192 698595047 701046944 703260005
1707.2 703260005 705444098 707951605 710670292 713216305 715224862 716660142 718207598 720215857
1723.5 720215857 722394109 724247932 725860715 727618456 730032623 732480049 734187424 735658348
1739.8 735658348 737271726 739347279 741936743 744690537 747220278 749486446 751835823 754651904
1756.1 754651904 757565916 759829462 761526644 763051569 764852107 767013133 768997014 770260036
1772.4 770260036 771031737 772047341 773535848 775091887 776122749 776657701 777285933 778431118 779954374
1790.8G79954374J308679O13988M22001Q32081J275122J210093P26760L67820N13494
1809.2G87224412J005113J194954Q76546M07576L19005O89744J064837J020670N44846
1827.5G94347703J26899K23160P04467Q96633N68687J13249O9380M31716P02441M89652
1847.9G98673987N3049j61887R3878N62489O80029L14891p6592l0160L76285O86884
1868.3H01172853M83453M291j51813J96994O80625P10428L23415J4364J29938N31734
1888.7H04096282P27176M76420M8936j36912J21236N08070N37395J78874j53125j08540
1909.1H06295812K40028M68254L10123r2029k41757J00315N13315M85480P1704k07364
1929.5H07943881o4970K89619M34995K19405q3804j29044J38402M44889M26709J21296
$$ plain form
1790.8 779954374 781263053 781877041 782299042 783131123 784406245 785616338 786343098 786710918 787224412
1809.2 787224412 788229525 789424479 790301025 790708601 791027606 791717350 792782187 793802857 794347703
1827.5 794347703 794474602 794697762 795402229 796298862 796867549 796980798 797050178 797481894 798184335 798673987
1847.9 798673987 798727036 798565149 798659027 799221516 799901545 800216436 800139844 800109684 800485969 801172853
1868.3 801172853 801656306 801660597 801508784 801705778 802386403 803096831 803420246 803434610 803564548 804096282
1888.7 804096282 804823458 805299878 805348814 805211902 805333138 805841208 806378603 806557477 806404352 806295812
1909.1 806295812 806535840 807004094 807314217 807222188 806980431 807080746 807594061 808079541 808151245 807943881
1929.5 807943881 807878911 808168530 808603525 808822930 808739126 808610082 808748484 809193373 809620082 809741378
1949.9H09741378r6381L3736L84748N22971K72990m8220o6221J98185M48823L96610
1970.3H11788619O9916j71423l3736L23593M32313J53184j66059j62601J19745L54767
1990.7H12708318K56539q3447k63274j14739J78695K60472j4543l69668m11928j54435
2011.1H11991990L1888j01685m62771p18236o41227m49180l41475k54035l16441m26472
2031.5H08312356k88963j03295j82807m64559o04450l92974n2273K7835j99377m04001
2051.9H05647492k93672M4287K58386J26540j61886j95801P9811L20315K53856l9697
2072.3H06039631k38359j09017K16306L77655J88350j29580j80364J04845L90351L58820
2092.7H07018638Q0883j11759J1147K87473L95059K44439J788m6849J63138L51965
$$ plain form
1949.9 809741378 809644997 809678733 810063481 810586452 810859442 810811222 810745001 810943186 811392009 811788619
1970.3 811788619 811858535 811687112 811653376 811976969 812409282 812562466 812396407 812233806 812353551 812708318
1990.7 812708318 812964857 812881410 812618136 812503397 812682092 812942564 812928021 812558353 812146425 811991990
2011.1 811991990 812023878 811922193 811459422 810741186 810099959 809650779 809309304 809055269 808738828 808312356
2031.5 808312356 808023393 807920098 807737291 807272732 806668282 806275308 806223035 806250870 806051493 805647492
2051.9 805647492 805353820 805398107 805656493 805783033 805621147 805425346 805505157 805825472 806079328 806039631
2072.3 806039631 805801272 805692255 805908561 806286216 806474566 806344986 806164622 806269467 806659818 807018638
2092.7 807018638 807099521 806987762 806998909 807286382 807681441 807925880 807927668 807880819 808043957 808395922
2113.1H08395922K62082j3292j80542n9367K15352L02970P9572j85608j82987O9559
2133.5H08703661K75552J87040p5519j78099m590K25127K71678J11818p8439o1751
2153.9H09376478J80006M06981L77476J70350R5248K76327N20587O00636M83811L29137
2174.3H12817037L49879N56708P24673O07669L24309K27332L99173O32226O39796M04179
2194.6H17682981K21074K87116M94063N99265M82678K79605K38359M12941O09339N94794
2215H21902215L74735K20597K81393M23074M88698L93153K20358J79887K85685L82304
2235.4H25152099L58343K14458Q5890J62661L56138L73065K15650J01030J12772K25603
2255.8H27357709L34800L01063J71721P8022J08958K98857M26591L07977J08123O2883
$$ plain form
2113.1 808395922 808658004 808644712 808464170 808404803 808620155 808923125 809002697 808817089 808634102 808703661
2133.5 808703661 808979213 809166253 809090734 808912635 808908045 809133172 809404850 809516668 809438229 809376478
2153.9 809376478 809556484 809963465 810340941 810511291 810606539 810882866 811403453 812004089 812487900 812817037
2174.3 812817037 813166916 813723624 814448297 815055966 815380275 815607607 816006780 816639006 817278802 817682981
2194.6 817682981 817904055 818191171 818685234 819284499 819767177 820046782 820285141 820698082 821307421 821902215
2215 821902215 822276950 822497547 822778940 823202014 823690712 824083865 824304223 824484110 824769795 825152099
2235.4 825152099 825510442 825724900 825810790 825973451 826329589 826702654 826918304 827019334 827132106 827357709
2255.8 827357709 827692509 827993572 828165293 828243315 828352273 828651130 829077721 829385698 829493821 829556704
2276.2H29556704K04563L85940L97444J84416l4451l8564J21176K19583J51515k1994
2296.6H31126332j48654p5698P4447L4630j74522k93077j98841q94R0301j23441m90606
2319.1H29819977n66959k52903M7028J0968k26736l55065l17216k07544m6074n5492
2339.5H27849984k82287k00630L60906N34237p2241q33988j131714q33511k98679O7830
2359.9H25159907j7225k38121n6088M26591O54339M87030K58386K62737M68791O14285
2380.2H28020632M89891J55389j11639j44363l3855L3498r2388l32594m09185k39611
2400.6H27335775n6923r5486l09766m66823m34339l03984k68161m18544n80847n59986
2421H23840916l92794k59817l65377o44385p74801o20544m01437l90590n69284o97612
$$ plain form
2276.2 829556704 829761267 830147207 830544651 830729067 830694616 830656052 830777228 830996811 831148326 831126332
2296.6 831126332 830977678 830901980 830976427 831011057 830836535 830543458 830344617 830343723 830434024 830310583 829819977
2319.1 829819977 829253018 829000115 829047143 829058111 828831375 828476310 828159094 827951550 827905476 827849984
2339.5 827849984 827567697 827367067 827727973 828262210 828189969 827355981 826224267 825390756 825092077 825159907
2359.9 825159907 825142682 824904561 824848473 825275064 825929403 826416433 826674819 826937556 827406347 828020632
2380.2 828020632 828510523 828665912 828554273 828409910 828376055 828409553 828317165 827984571 827575386 827335775
2400.6 827335775 827278852 827183366 826873600 826406777 825972438 825668454 825400293 824981749 824400902 823840916
2421 823840916 823448122 823188305 822822928 822178543 821403742 820783198 820381761 819991171 819421887 818724275
2441.4H18724275o51479n15342m36187n10811o69361p25269o06298m34518l78788n05209
2461.8H13291013o70314o53505m66108l43085m35531o09100o36220m82678l44157l60966
2482.2H08289349m71055n48244m91321l20196k09332l05891m79281m77016k79367j11937
2502.6H04595709j45197l14057m31895l71754k20240j84178l28362m72128m66526l90410
2523H01270962l65436m45724n91695o72102n91755m60386m81487o45160p48456o93381
2543.4G95575380n82993n29825n69761o73354p19428o39558n24878n10872o28471p38144
2563.8G89458096o90401n36084m44472n11288o35922o53565n75543n09917n10991n70774
2584.2G83819139o12438n49316m16041l28958l68774m84347n14805m11213k98500l41236
$$ plain form
2441.4 818724275 818072796 817557454 817121267 816610456 815941095 815215826 814609528 814175010 813796222 813291013
2461.8 813291013 812620699 811967194 811501086 811158001 810722470 810113370 809477150 808994472 808650315 808289349
2482.2 808289349 807818294 807270050 806778729 806458533 806249201 805943310 805464029 804987013 804707646 804595709
2502.6 804595709 804450512 804136455 803704560 803332806 803112566 802928388 802600026 802127898 801661372 801270962
2523 801270962 800905526 800459802 799868107 799196005 798604250 798143864 797662377 797017217 796268761 795575380
2543.4 795575380 794992387 794462562 793892801 793219447 792500019 791860461 791335583 790824711 790196240 789458096
2563.8 789458096 788767695 788231611 787787139 787275851 786639929 785986364 785410821 784900904 784389913 783819139
2584.2 783819139 783206701 782657385 782241344 781912386 781543612 781059265 780544460 780133247 779834747 779493511
2604.6G79493511n11051o49273o97374o47545o00100p16149r28104j029134r76443
2623G72738338q87037r10342j111924j297593j260162j104474j019180j104354j287401
2641.3G62755871j306832j163900j096606j151681j233816j251579j158654j033306
2657.6G53359497j037479j136958j157701j106263j050353r87947r75311j044213j071692
2676G43791580r54270q00371p81179r04441j014232r91881q94785q47817r15944j054943
2696.4G34631717j132130j096547j035273j045406j159966j251876j177669j048982
2712.7G25683868j011849j067936j151800j136661r93192q57890q59677r32217r08732
2731.1G16763914q12054p41899p14958p55429q28266q34406p59601o74486o73116p72059
$$ plain form
2604.6 779493511 778982460 778333187 777635813 776988268 776388168 775672019 774743915 773714781 772738338
2623 772738338 771851301 770940959 769829035 768531442 767271280 766166806 765147626 764043272 762755871
2641.3 762755871 761449039 760285139 759188533 758036852 756803036 755551457 754392803 753359497
2657.6 753359497 752322018 751185060 750027359 748921096 747870743 746882796 745907485 744863272 743791580
2676 743791580 742837310 742036939 741255760 740351319 739337087 738345206 737450421 736602604 735686660 734631717
2696.4 734631717 733499587 732403040 731367767 730322361 729162395 727910519 726732850 725683868
2712.7 725683868 724672019 723604083 722452283 721315622 720322430 719464540 718604863 717672646 716763914
2731.1 716763914 715951860 715209961 714495003 713739574 712911308 712076902 711317301 710642815 709969699 709197640
2751.4G09197640q17000p09773n79714n32568n66363o46591o75023o14166n83887o58334
2771.8G02814221p51376q10086q56936q71838r02950j034081j177073j219272j208127
2790.2F93982482j226723j298547j426339j555860j608670j638293j726151j836538
2806.5F81665361j929939j998842k027630k026737k081037k245545k402604k413928
2822.8F64539099k369464k457082k646148k790451k857805k890110k951383l106654
2839.1F42470002l361404l649890l867269l974259m002928l895224l561615l118694
2855.5F13038719k807021k783180l103077l632963m147351m601001n011022n330265
2871.8E81622839n534053n595863n437731n027235m409671l679216k938449k213955
$$ plain form
2751.4 709197640 708380640 707670867 707091153 706558585 705992222 705345631 704670608 704056442 703472555 702814221
2771.8 702814221 702062845 701252759 700395823 699523985 698621035 697586954 696409881 695190609 693982482
2790.2 693982482 692755759 691457212 690030873 688475013 686866343 685228050 683501899 681665361
2806.5 681665361 679735422 677736580 675708950 673682213 671601176 669355631 666953027 664539099
2822.8 664539099 662169635 659712553 657066405 654275954 651418149 648528039 645576656 642470002
2839.1 642470002 639108598 635458708 631591439 627617180 623614252 619719028 616157413 613038719
2855.5 613038719 610231698 607448518 604345441 600712478 596565127 591964126 586953104 581622839
2871.8 581622839 576088786 570492923 565055192 560027957 555618286 551939070 549000621 546786666
2888.1E46786666j543760j037121p70748p25448p93397q48175r01103j097798j467466
2906.5E37601650j887560k300918k754212l271162l728628l947974l910064l611386
2922.8E12189746l028214k235174j340747l81529P32064J987576L184855M151702M843056
2941.1E20103335N325795N664825N852461N918085N920530N851388N767405N753279
2957.4E66157103N713462N491138N073666M593015M236341M052102L937483L842175
2973.8F03096485L773570L768623L774703L604173L272355K943456K623797K329409
2990.1F29186571K059340J728654J410544J105130P30335L93749J01864k33471n06342
3008.4F35976374o69420r04977j259208j552581j731754j885056k014220k135396k274036
$$ plain form
2888.1 546786666 545242906 544205785 543435037 542709589 541916192 541068017 540166914 539069116 537601650
2906.5 537601650 535714090 533413172 530658960 527387798 523659170 519711196 515801132 512189746
2922.8 512189746 509161532 506926358 505585611 505204082 505936146 507923722 511108577 515260279 520103335
2941.1 520103335 525429130 531093955 536946416 542864501 548785031 554636419 560403824 566157103
2957.4 566157103 571870565 577361703 582435369 587028384 591264725 595316827 599254310 603096485
2973.8 603096485 606870055 610638678 614413381 618017554 621289909 624233365 626857162 629186571
2990.1 629186571 631245911 632974565 634385109 635490239 636220574 636614323 636716187 636482716 635976374
3008.4 635976374 635306954 634401977 633142769 631590188 629858434 627973378 625959158 623823762 621549726
3026.8F21549726k343536k364993k423048k581596k721966k640664k582670k741336
3043.1F01149917k907694k968311k924323k870321k912581k972007l020525l033281
3059.4E77540874k950429k883375k895534k984405l101468l093421k977252k846718
3075.7E53808272k773702k881229l030122l020048k979874k974987k954483k994955
3092.1E30198872l037572k954364k817809k823711k972066k961159k728760k613843
3108.4E07289588k742528k780498k598553k511144k634376k840609l002435k950638
3124.7D85228807k714455k538503k557128k659619k590537k367288k325147k531380
3141D64944750k662659k588957k461583k276301k113074k227932k457410k463252k331376
$$ plain form
3026.8 621549726 619206190 616841197 614418149 611836553 609114587 606473923 603891253 601149917
3043.1 601149917 598242223 595273912 592349589 589479268 586566687 583594680 580574155 577540874
3059.4 577540874 574590445 571707070 568811536 565827131 562725663 559632242 556654990 553808272
3075.7 553808272 551034570 548153341 545123219 542103171 539123297 536148310 533193827 530198872
3092.1 530198872 527161300 524206936 521389127 518565416 515593350 512632191 509903431 507289588
3108.4 507289588 504547060 501766562 499168009 496656865 494022489 491181880 488179445 485228807
3124.7 485228807 482514352 479975849 477418721 474759102 472168565 469801277 467476130 464944750
3141 464944750 462282091 459693134 457231551 454955250 452842176 450614244 448156834 445693582 443362206
3159.4D43362206k228111k183884k206832k220005k148986k048939k004058j998394
3175.7D26322997k011270j980960j893371j858175j865566j862288j895099j891196
3192D11065072j776070j705229j716554j706213j658082j588344j538247j538158j569360
3210.3C96268815j564741j477391j375377j378298j460373j470685j380563j280516
3226.7C84880871j214803j145065j121431j282781j428932j332164j163602j060844
3243C75131249j014828j037777j093745j082569j014740j000493j038611j004160r06706
3261.3C65937620q83728q86351p84158o34611o65814q41051r20236r29207q92281p95454
3281.7C57704729p59185p63416o87152n80996o02365p09891p74324q53300q80093p16924
$$ plain form
3159.4 443362206 441134095 438950211 436743379 434523374 432374388 430325449 428321391 426322997
3175.7 426322997 424311727 422330767 420437396 418579221 416713655 414851367 412956268 411065072
3192 411065072 409289002 407583773 405867219 404161006 402502924 400914580 399376333 397838175 396268815
3210.3 396268815 394704074 393226683 391851306 390473008 389012635 387541950 386161387 384880871
3226.7 384880871 383666068 382521003 381399572 380116791 378687859 377355695 376192093 375131249
3243 375131249 374116421 373078644 371984899 370902330 369887590 368887097 367848486 366844326 365937620
3261.3 365937620 365053892 364167541 363383383 362748772 362082958 361241907 360321671 359392464 358500183 357704729
3281.7 357704729 356945544 356182128 355494976 354913980 354311615 353601724 352827400 351974100 351094007 350377083
3302.1C50377083n26220n66244q30084j068950j109272j008958r18060q73000q56459
3320.5C42619836q41438q23379r31650j076401j040995r37998q47608p45028p89613
3338.8C34585726r38147j004517j074016j051754q66920q98331j145303j192242j001716
3357.2C25412780q54135q77201q77082p24018p06553r70334j217842j170516r39757
3375.5C17075342q25763p90983p44939p06226o16610m30435k29478l30269o94811p28190
3395.9C10977638l18855j05948m34309p55667n55367k48223k41548l31819l99351m07696
3416.3C07178855k59012j34498j42008p5817J05381K30431J87457J80423K83838J71065
3436.7C07726115j27584j61618J44720M21852M36098L56942M13299M78237M76122N80907
$$ plain form
3302.1 350377083 349850863 349284619 348454535 347385585 346276313 345267355 344349295 343476295 342619836
3320.5 342619836 341778398 340955019 340023369 338946968 337905973 336967975 336120367 335375339 334585726
3338.8 334585726 333647579 332643062 331569046 330517292 329650372 328752041 327606738 326414496 325412780
3357.2 325412780 324558645 323681444 322804362 322080344 321373791 320403457 319185615 318015099 317075342
3375.5 317075342 316249579 315458596 314713657 314007431 313390821 312960386 312730908 312400639 311705828 310977638
3395.9 310977638 310658783 310552835 310118526 309362859 308807492 308559269 308317721 307985902 307586551 307178855
3416.3 307178855 306919843 306785345 306643337 306567520 306672901 306903332 307090789 307271212 307555050 307726115
3436.7 307726115 307598531 307436913 307581633 308003485 308439583 308796525 309209824 309688061 310164183 310745090
3457.1C10745090P50035O88196O57111R54360J083195P30067L23117L57807O45488
3475.5C16934466Q86768R19700O65248O32584R31918R43095P49856Q11756R89526J084954
3495.9C25549871J030624R63926R41038P66546O61611Q32141J060277J211226J133829
3514.2C34151089R22620R45956J160085J309663J151473Q85546R20147J128464J299918
3532.6C43874961J454860J396805J191408J349836J646251J519888J116276J129687
3548.9C54679972J443595J564830J593232J704723J872241J992614J949310J807660
3565.2C68608177J956403K299577K368867K355069K477318K624601K808303L026456
3581.5C88524771L084212K862275K638102K922087L180892L178328L312081L555119
$$ plain form
3457.1 310745090 311495125 312183321 312840432 313794792 314877987 315608054 315931171 316288978 316934466
3475.5 316934466 317821234 318740934 319406182 320038766 320970684 321913779 322663635 323475391 324464917 325549871
3495.9 325549871 326580495 327544421 328485459 329252005 329913616 330745757 331806034 333017260 334151089
3514.2 334151089 335073709 336019665 337179750 338489413 339640886 340526432 341446579 342575043 343874961
3532.6 343874961 345329821 346726626 347918034 349267870 350914121 352434009 353550285 354679972
3548.9 354679972 356123567 357688397 359281629 360986352 362858593 364851207 366800517 368608177
3565.2 368608177 370564580 372864157 375233024 377588093 380065411 382690012 385498315 388524771
3581.5 388524771 391608983 394471258 397109360 400031447 403212339 406390667 409702748 413257867
3597.9D13257867L586561L554791L556520L418207L435403L621578L682524L780097
3614.2D41893548L839999L856868M067570M017681L725171L434956L479987M115403
3630.5D72431183M259407M049302L860145L774554L850877L921867L857195L736675
3646.8E03741205L838539M074156L887355L619671L817559L935337L603875L418625
3663.1E33936322L512501L329874L005683L281414L299892K850175K956927L116787
3679.4E59289575L042101L065050L083706K918661K408862K156615K374232K477765
3695.8E80816567K360225K023518J745343K005160K296746K152264J729309J508296
3712.1E96637428J926899K095580J820028J516282J344502J287639J440108J789272
$$ plain form
3597.9 413257867 416844428 420399219 423955739 427373946 430809349 434430927 438113451 441893548
3614.2 441893548 445733547 449590415 453657985 457675666 461400837 464835793 468315780 472431183
3630.5 472431183 476690590 480739892 484600037 488374591 492225468 496147335 500004530 503741205
3646.8 503741205 507579744 511653900 515541255 519160926 522978485 526913822 530517697 533936322
3663.1 533936322 537448823 540778697 543784380 547065794 550365686 553215861 556172788 559289575
3679.4 559289575 562331676 565396726 568480432 571399093 573807955 575964570 578338802 580816567
3695.8 580816567 583176792 585200310 586945653 588950813 591247559 593399823 595129132 596637428
3712.1 596637428 598564327 600659907 602479935 603996217 605340719 606628358 608068466 609857738
3728.4F09857738J802742J505435J255333J347363J694262J717806J061380N54443
3744.7F20796502J273691J312673O19054J013160J649499J467645J082182J144707
3761F30359113J277805J121759R92894R10580R64165J165092J216173J101256Q97109
3779.4F40005946Q56579Q81075Q72076R42469R79483R69231Q85308P77363Q58546O95169
3799.8F48723245N27799J000583Q94308O02484R66787J161873Q20458N37456Q03887
3818.1F56038880O22273M43637Q11815Q34406P94053P86066P76053Q94546N75542M9592
3838.5F62626863K80678O76632Q19623R55224J009524O43075k89798j22369R82583
3856.9F67582035J035869O90162M16279M42803N95093L47018L15726N74827O86526
$$ plain form
3728.4 609857738 611660480 613165915 614421248 615768611 617462873 619180679 620242059 620796502
3744.7 620796502 622070193 623382866 624001920 625015080 626664579 628132224 629214406 630359113
3761 630359113 631636918 632758677 633751571 634662151 635626316 636791408 638007581 639108837 640005946
3779.4 640005946 640862525 641743600 642615676 643558145 644537628 645506859 646392167 647169530 648028076 648723245
3799.8 648723245 649251044 650251627 651145935 651748419 652715206 653877079 654697537 655234993 656038880
3818.1 656038880 656661153 657104790 657916605 658751011 659545064 660331130 661107183 662001729 662577271 662626863
3838.5 662626863 662907541 663584173 664403796 665359020 666368544 667011619 666721821 666599452 667582035
3856.9 667582035 668617904 669308066 669724345 670167148 670762241 671109259 671424985 671999812 672686338
3875.2F72686338P54059M75049L27706N23925N00441O05166N54800K01523L28064O47962
3895.6F77605033N34415K29240O4849P8559L50178N86867N31554M51923M13000K62022
3916F81107640J42575K36988L23355K32875K68877M15265L11315K44916L73244L17991
3936.4F83975041K02954J93774K06531L02910K96831J60695K10046L20018L34263K93552
3956.8F86496615K11180J73449K38300L43799L31402J89900J16527J97113K66254K17318
3977.2F88781857J58728K22861L14594K86162K17437J73390J27077J46330K23696K26617
3997.6F90878749
$$ plain form
3875.2 672686338 673440397 673915446 674243152 674767077 675267518 675872684 676427484 676629007 676957071 677605033
3895.6 677605033 678139448 678368688 678433537 678512096 678862274 679449141 679980695 680432618 680845618 681107640
3916 681107640 681250215 681487203 681810558 682043433 682312310 682727575 683038890 683283806 683657050 683975041
3936.4 683975041 684177995 684371769 684578300 684881210 685178041 685338736 685548782 685868800 686203063 686496615
3956.8 686496615 686707795 686881244 687119544 687463343 687794745 687984645 688101172 688298285 688564539 688781857
3977.2 688781857 688940585 689163446 689478040 689764202 689981639 690155029 690282106 690428436 690652132 690878749
3997.6 690878749
##END=$$ End of the data block
