##TITLE=$$ Begin of the data block
##JCAMP-DX=5.00 $$ ACD/SpecManager v 10.08
##SPECTROMETER/DATA SYSTEM=Alpha
##DATE=26 Dec 2014 10:25:20
##DATA TYPE=INFRARED SPECTRUM
##DATA CLASS=XYDATA
##ORIGIN=
##OWNER=
##NPOINTS=1765
##FIRSTX=399.76428223
##LASTX=3997.64306641
##MAXX=3997.64306641
##MINX=399.76428223
##MAXY=0.83914918
##MINY=0.17088754
##XFACTOR=1.0000000000
##YFACTOR=1.000000000000000e-9
##FIRSTY=0.48362643
##DELTAX=2.03961372
##XUNITS=1/CM
##YUNITS=ARBITRARY UNITS
##XYDATA=(X++(Y..Y))
399.8D83626425k966970l649771m408121k646417J085103L958076L754348J054257
416.1D79806930j910329k215266m56095j033664l285736m617780m164159k649665j677603
434.4D57796633j750111j245588J135081M560619O552667N714923L312081J426458
450.8D77502763J164139J499027Q63522j337618l376096l484994k257109j776844k984405
469.1D65812385m623920m881709l004313j083225p92950j631678k020508q37475Q50559
487.5D47787166J019984n88536k316356k623916j811593j069218j581431l142535m070551
505.8D31603014l766417l024608l117114m293204n562216n720257m499138k936929
522.1C98683131k007187j731544j233846N7280J815498L201961L950566M684329N604059
$$ plain form
399.8 483626425 480659455 477009684 472601563 469955146 471040249 474998325 478752673 479806930
416.1 479806930 477896601 475681335 475225240 474191576 470905840 466288060 462123901 459474236 457796633
434.4 457796633 456046522 454800934 455936015 460496634 467049301 472764224 476076305 477502763
450.8 477502763 478666902 480165929 481029451 479691833 476315737 472830743 470573634 468796790 465812385
469.1 465812385 461188465 456306756 453302443 452219218 451426268 449794590 447774082 446936607 447787166
487.5 447787166 448807150 448218614 445902258 443278342 441466749 440397531 438816100 435673565 431603014
505.8 431603014 427836597 424811989 421694875 417401671 411839455 406119198 401620060 398683131
522.1 398683131 396675944 394944400 393710554 393767834 395583332 398785293 402735859 407420188 413024247
540.5D13024247N964219M905492K427519l53426j907140j997173j878887k654285m318028
558.9D13212538n895317o485224o285786o357581o959557o854683m861057j291752
575.2C68221581K379835M798233N997151O798893P507712P699996O670744M323929
591.5D14398074J575470O4254J73956N73486K22385n88179r36299j93983J371562K441377
611.9D19102103K285271J855255K404779L879756N079120N137831M156351L112227
628.2D47012693K909660L375113L510952K563566J087159O05911J466095K423674K307058
646.6D67261881J272946N27829Q95679J864702K138495J254559K40326L06934J315266
664.9D77078617K772599K903104P41750L06129J382828K598792K886653J970470P63744
$$ plain form
540.5 413024247 418988466 423893958 426321477 425968051 424060911 422063738 420184851 417530566 413212538
558.9 413212538 407317221 400831997 394546211 388188630 381229073 374374390 369513333 368221581
575.2 368221581 370601416 375399649 381396800 388195693 395703405 403403401 410074145 414398074
591.5 414398074 415973544 416037798 416211754 416785240 417007625 416419446 415483147 415289164 416660726 419102103
611.9 419102103 421387374 423242629 425647408 429527164 434606284 439744115 443900466 447012693
628.2 447012693 449922353 453297466 456808418 459371984 460459143 461065054 462531149 464954823 467261881
646.6 467261881 468534827 469062656 469958335 471823037 473961532 475216091 475456417 475763351 477078617
664.9 477078617 479851216 482754320 483496070 483802199 485185027 487783819 490670472 492640942 493404686
683.3D93404686M74215J182139J601219N72503j461804k876252k941817k593517k876640
701.6D84484732l588199l663153k221137L90678K717317L778934M048824M643888O055414
720D96647298P592917Q064866P122755N739689N201042N445718N375505M161119K121389
738.3E47472298O36101K67446l3498j428664l700733n636453o266654n750000n155206
756.7E20404637n182326n257905m206419j664221J559317M325390O139517P453799
773E23571789R031534J0732294J1403024J0283410Q120478O447434N963862O095946
789.3E91649771N714357M571080L752172M281878N572260O037533M933953L009379
805.6F29522383J784623J912057K466739K062022O44863n40018o66678k98083o86586
$$ plain form
683.3 493404686 493878901 495061040 496662259 497234762 495772958 492896706 489954889 487361372 484484732
701.6 484484732 480896533 477233380 475012243 475402921 478120238 481899172 485947996 490591884 496647298
720 496647298 504240215 512305081 519427836 525167525 530368567 535814285 541189790 545350909 547472298
738.3 547472298 548108399 548375845 548342347 546913683 543212950 537576497 531309843 525559843 520404637
756.7 520404637 515222311 509964406 505757987 504093766 505653083 509978473 516117990 523571789
773 523571789 532603323 543335617 554738641 565022051 573142529 579589963 585553825 591649771
789.3 591649771 597364128 601935208 605687380 609969258 615541518 621579051 626513004 629522383
805.6 629522383 631307006 633219063 635685802 637747824 638392687 637852669 637185991 636887908 636201322
824F36201322k372920m534066n888581o133140o000697o271184o881416p061481o192505
842.4E84865332m691422l739238l942371m751563n232989n172789m975260m476249
858.7E47883451k440333J952350P396996J1728346J4106393J4490902J2900711J0085463
875F18104279O979585L625989k25962m084467o918788q083880p992208p676840p632435
893.4E86095273p496178o892979o120503n832672o460607p785618r096146j0016501
909.7E26394069j0724842j1433840j1931390j1558413r820730o997406m069239k002746
926D57855463q69811J17362J511931L031284M156232M818022N273104N323171L940017
944.3D85156775L63200m686087r609908j3282955j5519171j6790599j7688185j8486649
$$ plain form
824 636201322 633828402 629294336 623405755 617272615 611271918 605000734 598119318 591057837 584865332
842.4 584865332 580173910 576434672 572492301 567740738 562507749 557334960 552359700 547883451
858.7 547883451 545443118 547395468 554792464 566520810 580627203 595118105 608018816 618104279
875 618104279 625083864 628709853 628483891 624399424 617480636 609396756 601404548 593727708 586095273
893.4 586095273 578599095 571706116 565585613 559752941 553292334 545506716 536410570 526394069
909.7 526394069 515669227 504235387 492303997 480745584 470924854 463927448 459858209 457855463
926 457855463 456985652 457103014 458614945 461646229 465802461 470620483 475893587 481216758 485156775
944.3 485156775 485519975 480833888 471223980 457941025 442421854 425631255 407943070 389456421
960.7C89456421j9141555j9544452j9724846j9831747j9869953j9600004j8856198
974.9B52887666j7608255j5849322j3670087j1246323q758426o374076m291371k599522
991.3A72490284j277566l25173L20077P69049R74804Q46967M35755j06469n75438p55757
1011.6A72796533n57304q7485N36159J206636J882598K523363L048077L380820L441379
1030A88170776L276020K939910K393812J671388J032427O99267P10726J009226J556188
1048.4B03459740K416879L631323N030200O335169P508636Q671283R764642J0036006
1064.7B56853878Q067996K920419m133493r519637j0530486p867039m084825q41960
1081B30864853J516878L157854M336000N283356O046116O428987O156087N095690L506214
$$ plain form
960.7 389456421 370314866 350770414 331045568 311213821 291343868 271743864 252887666
974.9 252887666 235279411 219430089 205760002 194513679 185755253 179381177 175089806 172490284
991.3 172490284 171212718 170887545 171207622 171976671 172951475 173798442 174234197 174127728 173552290 172796533
1011.6 172796533 172239229 172151744 172687903 173894539 175777137 178300500 181348577 184729397 188170776
1030 188170776 191446796 194386706 196780518 198451906 199484333 200183600 200894326 201903552 203459740
1048.4 203459740 205876619 209507942 214538142 220873311 228381947 237053230 246817872 256853878
1064.7 256853878 264921874 267842293 263708800 254189163 243658677 235791638 231706813 230864853
1081 230864853 232381731 235539585 239875585 245158941 251205057 257634044 263790131 268885821 272392035
1099.4B72392035J961648J070172J096040J897573L041953M001617M498572M459023
1115.7B94418633L880203L005892K261668J973242K380580L416389M517853M871488
1132C20725948L895491J602560j516342m690051p122159q402765q557945p816911o553262
1150.3B81564564n047948l418892j775891j67727J466036L239572N213737P367492
1166.7B88440943R565323J1598289J3246298J4363408J4922113J5121191J5148700
1180.9C82406265J4862239J4069885J2680262J0777682Q692950O691754M850447L331215
1197.3D58362699K328127J915127K075255K648592L378451M105926M849195N547702
1213.6D85211074N910069N629569M623890L117383J538277K57074o50584j359105j915634
$$ plain form
1099.4 272392035 274353683 275423855 276519895 278417468 281459421 285461038 289959610 294418633
1115.7 294418633 298298836 301304728 303566396 305539638 307920218 311336607 315854460 320725948
1132 320725948 324621439 326223999 324707657 320017606 312895447 304492682 295934737 288117826 281564564
1150.3 281564564 276516616 273097724 271321833 271154106 272620142 275859714 281073451 288440943
1166.7 288440943 298006266 309604555 322850853 337214261 352136374 367257565 382406265
1180.9 382406265 397268504 411338389 424018651 434796333 443489283 450181037 455031484 458362699
1197.3 458362699 460690826 462605953 464681208 467329800 470708251 474814177 479663372 485211074
1213.6 485211074 491121143 496750712 501374602 504491985 506030262 506287336 505636752 504277647 502362013
1231.9E02362013k169371k088845j762300j322329q30621j69545P13229J631737K286136
1250.3D98650104K518683K390385K046883J669765J424312J368344J529277J923322
1266.6E13521075K394557K650142K427220J708508P57694j15752o45816p77543p57873
1285E21162212q30293j033544j294077j582145j890600k210736k494336k603769k477527
1303.3E04745185k288103k184748k054572j866311j692385j524210j464098j655817
1319.6D90014941k260566l349155m659325n736202o243259o102204n424589m390151
1336D51849490l123760j673370l91216K64913M09127K88635O229l24011o62684r93819
1356.4D45649534j281261j470625j419872j011312o87510n16474j09643M77880J124084
$$ plain form
1231.9 502362013 500192642 498103797 496341497 495019168 494188547 494019002 494732231 496363968 498650104
1250.3 498650104 501168787 503559172 505606055 507275820 508700132 510068476 511597753 513521075
1266.6 513521075 515915632 518565774 520992994 522701502 523459196 523343444 522697628 521920085 521162212
1285 521162212 520331919 519298375 518004298 516422153 514531553 512320817 509826481 507222712 504745185
1303.3 504745185 502457082 500272334 498217762 496351451 494659066 493134856 491670758 490014941
1319.6 490014941 487754375 484405220 479745895 474009693 467766434 461664230 456239641 451849490
1336 451849490 448725730 447052360 446661144 446926057 447335184 447623819 447630048 447306037 446643353 445649534
1356.4 445649534 444368273 442897648 441477776 440466464 439778954 439262480 439152837 439630717 440754801
1374.7D40754801J437008J310140J197726J556784K603709M137069M737348L642410
1391D61376995K215773R95129p242p59482j232148j644492k040028k084702k088964
1409.4D54730839k171338k006590j659990j431435r48757r5844M61787Q30114J159668
1427.7D48868454J528739J855135J884312K090186K544105K400130K153039J836598
1444.1D65160698J209378L65376m14401r58502j396954k222955k116561j53065J161039
1462.4D60634053K585947M314542N318582O844968J0217726J1750370J0536790R504676
1478.7E21707654Q971870Q570671P645071P079541P337690P360220N925476M959941
1495E79558134N253792N195618M386544L458023L110647L946960L956974L199398K815843
$$ plain form
1374.7 440754801 442191809 443501949 444699675 446256459 448860168 452997237 457734585 461376995
1391 461376995 463592768 464587897 464580655 463821173 462589025 460944533 458904505 456819803 454730839
1409.4 454730839 452559501 450552911 448892921 447461486 446512729 446416885 446878672 447708786 448868454
1427.7 448868454 450397193 452252328 454136640 456226826 458770931 461171061 463324100 465160698
1444.1 465160698 466370076 466735452 466321051 465362549 463965595 461742640 459626079 459473014 460634053
1462.4 460634053 463220000 467534542 472853124 479698092 489915818 501666188 512202978 521707654
1478.7 521707654 530679524 539250195 546895266 553974807 561312497 568672717 574598193 579558134
1495 579558134 584811926 590007544 594394088 597852111 600962758 604909718 608866692 612066090 614881933
1513.4F14881933K580285K638638K540469K666712K734601K406061K324522J991629
1529.7F34764850J615405J658261J582623J012086P28786R75609J138091J083553P51555
1548.1F45310819L98159J47164q1360m10796r66191o34312m3631n77986j050413j321971
1568.5F40769482j388371j070559j398266k081454j701295j333952j584887j856327
1584.8F28354371k114773k304375k388597k409637k542674k757311k989292l250838
1601.1F07596874l374099l441453l706515m128039m191458l972710m443168n036295
1617.4E75303137l849148l410340m042506l755629l384411l198326k562881k317130
1633.7E48782766k419055j279771k64823l0160O2644M52817J509666J843333K120495
$$ plain form
1513.4 614881933 617462218 620100856 622641325 625308037 628042638 630448699 632773221 634764850
1529.7 634764850 636380255 638038516 639621139 640633225 641362011 642337620 643475711 644559264 645310819
1548.1 645310819 645708978 645856142 645774782 645363986 644397795 643763483 643719852 643141866 642091453 640769482
1568.5 640769482 639381111 638310552 636912286 634830832 633129537 631795585 630210698 628354371
1584.8 628354371 626239598 623935223 621546626 619136989 616594315 613837004 610847712 607596874
1601.1 607596874 604222775 600781322 597074807 592946768 588755310 584782600 580339432 575303137
1617.4 575303137 571453989 568043649 564001143 560245514 556861103 553662777 551099896 548782766
1633.7 548782766 546363711 545083940 544819117 544788957 544851601 545304418 546814084 548657417 550777912
1652.1E50777912L681064L673672L251970L634095M452825M892767M333674M599691
1668.4E83297670N756616N609870N807698O375551N642474N003750N607903P745326
1684.7F30846858P063866N501806N437434M831910M735709M920721M402339M566908
1701.1F72307551L729463L003001L185332K901971K408504K081871K093196K923429
1717.4F94634318L450394K842426K422929K405584K306700K210617K002179K195299
1733.7G14470446K586901K201081K196669K529860K555310K395392K311468K710223
1750G33957350L254652K956152K498567K307237K119600K309978K394379J989245J575053
1768.4G55362213J300990J474917J880825J741409J360059J120388J078070J205563
$$ plain form
1652.1 550777912 554458976 558132648 561384618 565018713 569471538 574364305 578697979 583297670
1668.4 583297670 589054286 594664156 600471854 606847405 612489879 617493629 623101532 630846858
1684.7 630846858 637910724 643412530 648849964 653681874 658417583 663338304 667740643 672307551
1701.1 672307551 676037014 679040015 682225347 685127318 687535822 689617693 691710889 694634318
1717.4 694634318 698084712 700927138 703350067 705755651 708062351 710272968 712275147 714470446
1733.7 714470446 717057347 719258428 721455097 723984957 726540267 728935659 731247127 733957350
1750 733957350 737212002 740168154 742666721 744973958 747093558 749403536 751797915 753787160 755362213
1768.4 755362213 756663203 758138120 760018945 761760354 763120413 764240801 765318871 766524434
1784.7G66524434J371622J208186Q49963Q90731J131237J163840J116157J109481J087844
1803G76453495R59635Q98838R65535J050830R67682P44164O69062Q44955R17137P19667
1823.4G85191000N22434M14074N11765R12309R98080O21438L10182K55645K50756L58582
1843.8G90346265N90086M91082K76685K97845M48644N02407L41416J34110Q6963J74106
1864.2G93689609J95503K33710L88324M02927L59297M76897O07431N02765K92778K29895
1884.6G97379136L33607N11468O16371L73781N1737J35958M16279N10335L57628J01030
1905H00787330o4254K5511L11434M16338J60575j30951n9724J98126M32312M86851
1925.4H02563548K14517n4598l099K62260L90590K25007p0631j57774J56224N08547
$$ plain form
1784.7 766524434 767896056 769104242 769954205 770844936 771976173 773140013 774256170 775365651 776453495
1803 776453495 777413130 778311968 779277503 780328333 781296015 782040179 782709241 783554196 784471333 785191000
1823.4 785191000 785713434 786127508 786639273 787551582 788549662 789171100 789481282 789736927 789987683 790346265
1843.8 790346265 790936351 791427433 791704118 792001963 792450607 792953014 793294430 793428540 793515503 793689609
1864.2 793689609 793885112 794118822 794507146 794910073 795269370 795746267 796353698 796856463 797149241 797379136
1884.6 797379136 797712743 798224211 798840582 799214363 799266100 799402058 799818337 800328672 800686300 800787330
1905 800787330 800723076 800748587 801060021 801476359 801636934 801505983 801446259 801644385 802076697 802563548
1925.4 802563548 802778065 802723467 802720368 802982628 803373218 803598225 803527594 803369820 803526044 804034591
1945.8H04034591M66704J68562o914J00016L78073N14149L31581M5121m5002J60218
1966.2H06147099M80175M87983J83642m1366J0133K54094L85464K50816j4126j59443
1986.6H07984471m4763J82212K78353J36614r4354j36852N6684J96874M5776k82943
2007H08322072m59015l49582j56462j54018l69847o13213o97612o06537m22359k32458
2027.4H04260969k92659n46574n58555l09408j85549l49582n80072n82635l08574n2988
2047.8H00494373m7922k19643l33310j98602J01685K91169J61231j29760j64747J00613
2068.2H00055087L42309L39151R1195j51217j35064J22189L37958K61665j1444j49250
2088.6H01102579L8147L46720M51207K34723n5611o2823K16722M74811M07755O7592
$$ plain form
1945.8 804034591 804501295 804669857 804662943 804762959 805141032 805655181 805986762 806031883 805986881 806147099
1966.2 806147099 806627274 807115257 807298899 807257533 807267666 807521760 807907224 808158040 808143914 807984471
1986.6 807984471 807939708 808121920 808400273 808536887 808442533 808305681 808362365 808559239 808605015 808322072
2007 808322072 807863057 807513475 807357013 807202995 806833148 806219935 805522323 804915786 804493427 804260969
2027.4 804260969 803968310 803421736 802863181 802553773 802368224 802018642 801438570 800855935 800547361 800494373
2047.8 800494373 800446451 800226808 799893498 799694896 799796581 800087750 800248981 800119221 799954474 800055087
2068.2 800055087 800397396 800736547 800827742 800676525 800541461 800663650 801001608 801263273 801251829 801102579
2088.6 801102579 801140726 801487446 801938653 802173376 802117765 802054942 802271664 802746475 803154230 803221822
2109H03221822j40488L2961L47495M25279J56999j85788k16067P9751L39270K60293
2129.4H04321527o5565k84433j42395K23577L94403J71602j86503k62439N0545L97861
2149.8H04618180L86119P2002j37448L4332M25398O51539N22613J81556N3108L96907
2170.2H07204306Q61168R20415N69999K64645L56495P03573Q91030P06077L34024J75476
2190.6H12987208M07040P58470Q25882N15937J65999K00153N87642Q45075O63340K89440
2211H18246186J67131L92676P10904P91013M94361R4176N8531M20213P14362N94139
2231.4H22683692J85788m9949J51813N08308O05286L52859K146l9458K94506N85079
2251.8H25280070M94182J43230p0691J05799M88698O24418L44336j3709k0623L09885
$$ plain form
2109 803221822 803081334 803114295 803461790 803887069 804044068 803858280 803642213 803721964 804061234 804321527
2129.4 804321527 804255962 803971529 803829134 804052711 804447114 804618716 804432213 804169774 804220319 804618180
2149.8 804618180 805004299 805076301 804938853 804973185 805398583 806050122 806572735 806754291 806807399 807204306
2170.2 807204306 808065474 808985889 809555888 809820533 810177028 810880601 811771631 812477708 812811732 812987208
2190.6 812987208 813394248 814152718 814978600 815494537 815660536 815860689 816448331 817293406 817956746 818246186
2211 818246186 818413317 818805993 819516897 820307910 820802271 820896447 820954978 821375191 822089553 822683692
2231.4 822683692 822869480 822819531 822971344 823479652 824084938 824437797 824439943 824400485 824694991 825280070
2251.8 825280070 825774252 825917482 825846791 825952590 826441288 827065706 827410042 827396333 827375710 827685595
2272.2H27685595N83469M82738J06395j10865M2498L81053N76436M20869P3194m8280
2292.5H30193102K38479N96463N80847K21789q225J69933N38409P44938N95034K14695
2312.9H34085464M8101L65377Q70407R99331N58615N7518L3021L68834N40912K39015
2333.3H38166595j98305l13878j01984O6698k77698j132131j344502m44472Q15511
2351.7H35235834J638651J497686P47800K9206l85463n74529q15451j321137j787723
2370.1H34264874j758456j337588j010835r89198j155615j187384q63433l85523j00672
2388.4H25476170j90437m63963n23507k77639p987m0710l72290o54638n93126l01302
2408.8H22050571j61349l60012o86646p97331o07252l58940l60310o43730r16242q64029
$$ plain form
2272.2 827685595 828269064 828751802 828858197 828747332 828789830 829170883 829747319 830168188 830241382 830193102
2292.5 830193102 830431581 831028044 831608891 831830680 831822455 831992388 832530797 833275735 833870769 834085464
2312.9 834085464 834133565 834498942 835369349 836368680 836927295 836984813 837017834 837386668 837927580 838166595
2333.3 838166595 837968290 837654412 837552428 837619126 837341428 836209297 834864795 834420323 835235834
2351.7 835235834 836874485 838372171 839119971 839149177 838763714 838189185 837373734 836052597 834264874
2370.1 834264874 832506418 831168830 830157995 829168797 828013182 826825798 825962365 825576842 825476170
2388.4 825476170 825285733 824821770 824298263 824020624 824012637 823971927 823599637 822944999 822351873 822050571
2408.8 822050571 821889222 821529210 820842564 820045233 819437981 819079041 818718731 818075001 817158759 816294730
2429.2H16294730n72920m14193n60045q39233r60172q09133n47647m80950p20203r89854
2449.6H09400380r66668o80030m41551m99308p75397r51409q22902n11885l65674n48959
2470H02836597q22306q40485n90086l67999m26888o96421q51452o86765l46661j94728
2490.4G97012806l70860o27995o58869m18425j59740j85848m58002o22809m92275k31802
2510.8G92786181j28686l06309o16252p15196m98534k94446l68953o46234q67486q47995
2531.2G87496090o38425m83334o04213q85486r88603q16941n93961n72979p85589r97663
2551.6G80128896r41872o67334n20468o77347r15408r37581p51257n74172n60939p26223
2572G72856295r04918q80479o61374n01096n71310p52151q09729o51837m41193m04239
$$ plain form
2429.2 816294730 815721810 815307617 814747572 813908339 812948167 812139034 811591387 811110437 810390234 809400380
2449.6 809400380 808433712 807753682 807312131 806812823 806037426 805086017 804263115 803751230 803385556 802836597
2470 802836597 802014291 801173806 800583720 800215721 799788833 799092412 798240960 797554195 797207534 797012806
2490.4 797012806 796641946 796013951 795355082 794936657 794776917 794591069 794133067 793510258 793017983 792786181
2510.8 792786181 792657495 792351186 791734934 791019738 790521204 790226758 789857805 789211571 788344085 787496090
2531.2 787496090 786857665 786374331 785770118 784884632 783896029 783079088 782485127 781912148 781126559 780128896
2551.6 780128896 779187024 778519690 777999222 777321875 776406467 775468886 774717629 774143457 773582518 772856295
2572 772856295 771951377 771070898 770409524 769908428 769337118 768584967 767775238 767123401 766682208 766277969
2592.4G66277969n58555p02739o61314m83870l66330m42147o70433q70467q91268p74503
2612.8G59856343p38978r05991j144290j272142j223325j114428j140833j308084j446307
2631.1G49561965j449048j377881j324653j349688j459420j525878j449347j344860
2647.4G38281190j345932j420021j481712j451850j331806j250923j290858j356482
2663.7G27351606j355529j294732j204491j160443j184761j204133j165330j083315
2680.1G17698872j031101j044750j085341j135707j156926j091242j039088j100659
2696.4G09014058j231313j343906j359283j298428j278043j358271j448929j430332
2712.7F98265553j302422j168668j151919j220823j247584j181007j031279r27091
$$ plain form
2592.4 766277969 765719414 765016675 764355361 763871491 763505161 763063014 762392581 761522114 760630846 759856343
2612.8 759856343 759117365 758211374 757067084 755794942 754571617 753457189 752316356 751008272 749561965
2631.1 749561965 748112917 746735036 745410383 744060695 742601275 741075397 739626050 738281190
2647.4 738281190 736935258 735515237 734033525 732581675 731249869 729998946 728708088 727351606
2663.7 727351606 725996077 724701345 723496854 722336411 721151650 719947517 718782187 717698872
2680.1 717698872 716667771 715623021 714537680 713401973 712245047 711153805 710114717 709014058
2696.4 709014058 707782745 706438839 705079556 703781128 702503085 701144814 699695885 698265553
2712.7 698265553 696963131 695794463 694642544 693421721 692174137 690993130 689961851 689034760
2729F89034760r52780j018226j023472r40203q41797q16345q91328r94444r75549q33571
2749.4F79747045p31468p60317q53539q80718p84337o51002o00517o74188q16584q92281
2769.8F72102094q72195q47638q84950j029670j177609j202166j174092j200557j334667
2788.2F62378550j513005j584768j573622j626075j747071j878739k013921k087176
2804.5F48354173k096236k167821k312958k439499k497554k499640k526164k636850
2820.8F29177451k800643k933443k997398l020525l075600l221154l412962l563881
2837.1F04151845l655672l760040l978550m318834m560291m506648m233956l877461
2853.4E71260393l559172l420413l518343l815174m261792m854679n513608o001413
$$ plain form
2729 689034760 688081980 687063754 686040282 685100079 684258282 683441937 682550609 681556165 680580616 679747045
2749.4 679747045 679015577 678255260 677401721 676521003 675736666 675085664 674485147 673810959 672994375 672102094
2769.8 672102094 671229899 670382261 669497311 668467641 667290032 666087866 664913774 663713217 662378550
2788.2 662378550 660865545 659280777 657707155 656081080 654334009 652455270 650441349 648354173
2804.5 648354173 646257937 644090116 641777158 639337659 636840105 634340465 631814301 629177451
2820.8 629177451 626376808 623443365 620445967 617425442 614349842 611128688 607715726 604151845
2837.1 604151845 600496173 596736133 592757583 588438749 583878458 579371810 575137854 571260393
2853.4 571260393 567701221 564280808 560762465 556947291 552685499 547830820 542317212 536315799
2869.7E36315799o223023o308258o322503o164551n707144m974783m113227l224850
2886.1D93277460k400189j733959j224905q51989o56962o70195q37565j072615j347274
2904.4D82481807j653492j987934k437294l036946l641069m076391m233658m118413
2920.7D57296610l777474l230632k500891j547188l80367Q81761K174706L425806M525632
2939.1D56867963N427688O065071O424666O621301O760180O855845O857455O845474
2955.4E08725643O876946O782472O467223O057560N655766N255938M918098M717112
2971.7E55456758M591941M469574M368722M222870L914058L540337L232003K945959
2988E86742222K654314K335370J952946J563907J192033Q20935M52161O4552l05534
$$ plain form
2869.7 536315799 530092776 523784518 517462015 511297464 505590320 500615537 496502310 493277460
2886.1 493277460 490877271 489143312 487918407 487066418 486409456 485739261 484901696 483829081 482481807
2904.4 482481807 480828315 478840381 476403087 473366141 469725072 465648681 461415023 457296610
2920.7 457296610 453519136 450288504 447787613 446240425 445860058 446741819 448916525 452342331 456867963
2939.1 456867963 462295651 468360722 474785388 481406689 488166869 495022714 501880169 508725643
2955.4 508725643 515602589 522385061 528852284 534909844 540565610 545821548 550739646 555456758
2971.7 555456758 560048699 564518273 568886995 573109865 577023923 580564260 583796263 586742222
2988 586742222 589396536 591731906 593684852 595248759 596440792 597261727 597713888 597778440 597472906
3006.4E97472906n95271q34764j114964j465321j791238j997114k129912k284884k475143
3024.7E82784295k624929k700031k731442k741277k852440l025472l045142l028274
3041.1E60035288l154874l308594l349244l301919l309905l385723l411710l428996
3057.4E33384323l454566l383279l266751l258706l386378l495753l455400l310263
3073.7E06373227l174842l157139l260612l367394l416926l430396l389299l343046
3090D79833573l396124l417193l284187l142207l174991l305614l258973l074467l053040
3108.4D50726777l191739l138900k923786k897084k983690l114044l288925l242433
3124.7D25946176k996951k870828k943784l006607k889842k690673k634645k800733
$$ plain form
3006.4 597472906 596877635 596042871 594927907 593462586 591671348 589674234 587544322 585259438 582784295
3024.7 582784295 580159366 577459335 574727893 571986616 569134176 566108704 563063562 560035288
3041.1 560035288 556880414 553571820 550222576 546920657 543610752 540225029 536813319 533384323
3057.4 533384323 529929757 526546478 523279727 520021021 516634643 513138890 509683490 506373227
3073.7 506373227 503198385 500041246 496780634 493413240 489996314 486565918 483176619 479833573
3090 479833573 476437449 473020256 469736069 466593862 463418871 460113257 456854284 453779817 450726777
3108.4 450726777 447535038 444396138 441472352 438575268 435591578 432477534 429188609 425946176
3124.7 425946176 422949225 420078397 417134613 414128006 411238164 408547491 405912846 403112113
3141D03112113k934932k841950k673775k518147k423912k546519k733082k702117k563864
3159.4C79173815k485692k441198k416849k423137k396554k310336k232909k191037
3175.7C60276103k197981k199054k135396k065032k032757j996577j965314j982957
3192C43701035j986325j945108j888037j827985j779318j752674j742095j723200j661390
3210.3C27394903j587302j561075j556367j563191j563907j517802j468808j427144
3226.7C15149307j340598j219421j192838j366168j499415j430541j319975j191646
3243C04588705j062393j084924j207232j212925j096040r96947j013696j051784j002073
3261.3B94860691r67592r48936q07434o46055p53552r70423j002967r63927r30190
$$ plain form
3141 403112113 400177181 397335231 394661456 392143309 389719397 387172878 384439796 381737679 379173815
3159.4 379173815 376688123 374246925 371830076 369406939 367010385 364700049 362467140 360276103
3175.7 360276103 358078122 355879068 353743672 351678640 349645883 347649306 345683992 343701035
3192 343701035 341714710 339769602 337881565 336053580 334274262 332521588 330779493 329056293 327394903
3210.3 327394903 325807601 324246526 322690159 321126968 319563061 318045259 316576451 315149307
3226.7 315149307 313808709 312589288 311396450 310030282 308530867 307100326 305780351 304588705
3243 304588705 303526312 302441388 301234156 300021231 298925191 297928244 296914548 295862764 294860691
3261.3 294860691 293893099 292944163 292136729 291490674 290737122 289766699 288763732 287799805 286869615
3279.7B86869615q77350q10921p23392o56396o10620o03646p23332q92014r57429q70109
3300.1B79144406o28531m33176n53638q60542j075834j099706r72658q73715q45999
3318.4B71800607q05586p40886p45624q94785j007527r52214q48890p42614o65545
3336.8B64396936p58142r20355r58592r40620q27492o63489q00103j078635j073778
3355.2B56375730q63373p01458p02023p22975n78790n41181q34584j104236j028180
3373.5B49298930p78451o23763n99086o54295o49736n08621k81051r0718k13653n71400
3393.9B44328156o04078j88619J2398l87833p18847m79206j79678j18971j57207k92391
3414.3B41213724l38688j65418o8486q2746N0425K38911K94149K45660L44902M65721
$$ plain form
3279.7 286869615 285992265 285181344 284457952 283801556 283190936 282587290 281863958 280971944 280014515 279144406
3300.1 279144406 278515875 278082699 277529061 276668519 275592685 274492979 273520321 272646606 271800607
3318.4 271800607 270995021 270254135 269508511 268613726 267606199 266653985 265805095 265062481 264396936
3336.8 264396936 263638794 262718439 261759847 260819227 259991735 259328246 258528143 257449508 256375730
3355.2 256375730 255512357 254810899 254108876 253385901 252807111 252265930 251431346 250327110 249298930
3373.5 249298930 248520479 247896716 247297630 246643335 245993599 245484978 245203927 245113209 244899556 244328156
3393.9 244328156 243724078 243535459 243547857 243160024 242441177 241961971 241782293 241663322 241506115 241213724
3414.3 241213724 240875036 240709618 240641132 240558386 240608811 240847722 241141871 241387531 241732433 242198154
3434.7B42198154K03595j66759j36688J81794M36723N04032M33832M36396N29721O07759
3455.1B45228559P37756Q41305P24614O87465R71347J117587P80910L49999L74347
3473.4B51813889P27266J019150R81718P11203P23123R74208R55820Q35955R56387
3491.8B59698719J088738J125902J092404J044512J016587Q99822Q24451R35137J170636
3510.2B68896908J403868J324534J018942J001000J279056J480013J323283J048028
3526.5B78775632J048327J268446J483947J605064J534522J444816J649350J804829
3542.8B90614933J620769J402200J508623J709044J801669J916200K082795K265781
3559.1C04922014K339423K148509J961142K432734L072530L005862K750516K821296
$$ plain form
3434.7 242198154 242401749 242234990 242098302 242280096 242716819 243220851 243654683 244091079 244620800 245228559
3455.1 245228559 245966315 246807620 247532234 248219699 249191046 250308633 251089543 251439542 251813889
3473.4 251813889 252541155 253560305 254542023 255253226 255976349 256950557 257906377 258742332 259698719
3491.8 259698719 260787457 261913359 263005763 264050275 265066862 265966684 266791135 267726272 268896908
3510.2 268896908 270300776 271625310 272644252 273645252 274924308 276404321 277727604 278775632
3526.5 278775632 279823959 281092405 282576352 284181416 285715938 287160754 288810104 290614933
3542.8 290614933 292235702 293637902 295146525 296855569 298657238 300573438 302656233 304922014
3559.1 304922014 307261437 309409946 311371088 313803822 316876352 319882214 322632730 325454026
3575.4C25454026L077955L333985L521592L459126L168106L237128L747612L740549
3591.7C52740079L611207L881753M130989M144907M199386M115462L780574L843516
3608.1C84447873M211038M373610M504263M349024M245042M818589M942655M337430
3624.4D20229524L646225L846735N028516M992336M589260M507303M401654M401773
3640.7D55643326M422844M094839L626138M009544N053997M840583M197180M473806
3657D90362257M710316M222066L854036L772855L410160L192306L721595L452301L070593
3675.4E23768485L805875L955663L631591L411651L110647K781749K648175K893746
3691.7E50007582L020763K828360K521693K204359K189994K492606K406300J867294
$$ plain form
3575.4 325454026 328531981 331865966 335387558 338846684 342014790 345251918 348999530 352740079
3591.7 352740079 356351286 360233039 364364028 368508935 372708321 376823783 380604357 384447873
3608.1 384447873 388658911 393032521 397536784 401885808 406130850 410949439 415892094 420229524
3624.4 420229524 423875749 427722484 432751000 437743336 442332596 446839899 451241553 455643326
3640.7 455643326 460066170 464161009 467787147 471796691 476850688 481691271 485888451 490362257
3657 490362257 495072573 499294639 503148675 506921530 510331690 513523996 517245591 520697892 523768485
3675.4 523768485 527574360 531530023 535161614 538573265 541683912 544465661 547113836 550007582
3691.7 550007582 553028345 555856705 558378398 560582757 562772751 565265357 567671657 569538951
3708E69538951J412511J776099K534568K481520K097309J811981J611889J603603J892269
3726.4E86760700K057433J614034J100361J103044J679659K096355J655817O86705
3742.7E98754108O42896J629471J223147P01607J682758K162099J566648J161158J453340
3761F10977232J518548J249909J103163R61125J195908J527905J380324J066685R56893
3779.4F21937692J096606J042724J015365J212836J251578J116991Q44002O79791Q03947
3797.7F31001532N07057M62830J208663J093387J000822J438499J268804N37335K62678
3816.1F38781607O31511M58002P96855J348376J097203R41336Q35359P48515P57813
3834.4F46396577L60489J16289O53565J083672J194119J135886P94888o7532r21786
$$ plain form
3708 569538951 570951462 572727561 575262129 577743649 579840958 581652939 583264828 584868431 586760700
3726.4 586760700 588818133 590432167 591532528 592635572 594315231 596411586 598067403 598754108
3742.7 598754108 599397004 601026475 602249622 602951229 604633987 606796086 608362734 609523892 610977232
3761 610977232 612495780 613745689 614848852 615809977 617005885 618533790 619914114 620980799 621937692
3779.4 621937692 623034298 624077022 625092387 626305223 627556801 628673792 629517794 630197585 631001532
3797.7 631001532 631508589 631971419 633180082 634273469 635274291 636712790 637981594 638518929 638781607
3816.1 638781607 639413118 639871120 640667975 642016351 643113554 644054890 644890249 645638764 646396577
3834.4 646396577 646757066 646873355 647526920 648610592 649804711 650940597 651735485 651667953 650746167
3852.8F50746167M37855J813889J332402N74470K26974N70357P34210K69354L51607
3871.2F57057285P65205J006126R04024L58343M20689O43373M98354O83427N17547
3889.5F62854373K57016O43730P51555L08513j013J3948K61366Q19922J029372P07328
3909.9F67646110M00901J94132J02759L09884M94182K93672J17541L38614M33445J81377
3930.3F70512617J92165M89354N07534K84075R2805J81496M58717L93749K25246L38614
3950.7F73676372L99231L04103K39969K33948K38895K82109L20733K76386K39253K52843
3971.1F76463842K45274K35319K68399K60175K56717L25918K92063J73569J67548K02656
3991.5F78891480J98185K56360L21448
$$ plain form
3852.8 650746167 651184022 652997911 654330313 654904783 655131757 655702114 656436324 656705678 657057285
3871.2 657057285 657822490 658828616 659732640 660090983 660511672 661155045 661653399 662336826 662854373
3889.5 662854373 663111389 663755119 664506674 664815187 664814174 664828122 665089488 665909410 666938782 667646110
3909.9 667646110 668047011 668241143 668343902 668653786 669147968 669441640 669559181 669897795 670331240 670512617
3930.3 670512617 670704782 671194136 671701670 671985745 672078550 672260046 672718763 673112512 673337758 673676372
3950.7 673676372 674075603 674379706 674619675 674853623 675092518 675374627 675695360 675971746 676210999 676463842
3971.1 676463842 676709116 676944435 677212834 677473009 677729726 678055644 678347707 678521276 678688824 678891480
3991.5 678891480 679089665 679346025 679667473
3997.6F79667473
$$ plain form
3997.6 679667473
##END=$$ End of the data block
