##TITLE=$$ Begin of the data block
##JCAMP-DX=5.00 $$ ACD/SpecManager v 10.08
##SPECTROMETER/DATA SYSTEM=Alpha
##DATE=26 Dec 2014 10:25:20
##DATA TYPE=INFRARED SPECTRUM
##DATA CLASS=XYDATA
##ORIGIN=
##OWNER=
##NPOINTS=1765
##FIRSTX=399.76428223
##LASTX=3997.64306641
##MAXX=3997.64306641
##MINX=399.76428223
##MAXY=0.83985645
##MINY=0.17097206
##XFACTOR=1.0000000000
##YFACTOR=1.000000000000000e-9
##FIRSTY=0.48352906
##DELTAX=2.03961372
##XUNITS=1/CM
##YUNITS=ARBITRARY UNITS
##XYDATA=(X++(Y..Y))
$$ plain form
399.8 483529061 480605423 477038354 472779572 470420033 471552819 475023568 478306741 479385912
416.1 479385912 477925718 475705951 474496573 473057300 469986647 465697825 461798728 459304839
432.4 459304839 457805067 456417829 455449313 456433892 460629106 467102855 472878993 476108104 477424681
450.8 477424681 478675127 480564892 481822371 480639189 477346182 473850548 471386015 469411254
467.1 469411254 466504037 462007910 456987292 453725815 452449352 451561391 449927151 448075354 447441220
485.4 447441220 448271960 449293345 448957413 446827233 444058657 442061096 440922737 439188689 435866922
503.8 435866922 431793332 428221107 425460666 422483474 418150097 412420809 406573296 402211726
520.1 402211726 399471551 397393256 395383269 393999696 394210994 396227330 399442673 403320462 407975972
$$ packed form
399.8D83529061k923638l567069m258782k359539J132786L470749L283173J079171
416.1D79385912j460194k219767j209378j439273l070653m288822l899097k493889
432.4D59304839j499772j387238r68516R84579M195214O473749N776138L229111J316577
450.8D77424681J250446J889765J257479j183182l293007l495634k464533j974761
467.1D69411254k907217m496127n020618l261477j276463q87961j634240j851797o34134
485.4D47441220Q30740J021385l35932k130180k768576j997561j138359j734048l321767
503.8D35866922m073590l572225k760441k977192m333377n729288n847513m361570
520.1D02211726k740175k078295k009987j383573K11298K016336L215343L877789M655510
$$ plain form
538.5 407975972 413578272 419486314 424318284 426796705 426542729 424543172 422353685 420451611 417905718
556.8 417905718 413720548 408037603 401798218 395558089 388935626 381747544 375037283 370403945
573.1 370403945 369042665 371176690 375917941 382059604 388909072 396313339 403913260 410579294
589.4 410579294 414973736 416595370 416614383 416748762 417454362 417828202 417158812 416103274 415933281
607.8 415933281 417278707 419611424 421866447 423774779 426230073 430137902 435275733 440434545
624.1 440434545 444502860 447541505 450512469 454052478 457614988 460069150 461122662 461834013 463432312
642.5 463432312 465888768 468095005 469249487 469715148 470602840 472536296 474834293 476193815 476348430
660.8 476348430 476490319 477704883 480452478 483402222 484242201 484595716 485944420 488537431 491455048
$$ packed form
538.5D07975972N602300N908042M831970K478421k53976j999557k189487j902074k545893
556.8D17905718m185170n682945o239385o240129o622463p188082o710261m633338
573.1C70403945j361280K134025M741251O141663O849468P404267P599921O666034
589.4D10579294M394442J621634J9013J34379P05600L73840o69390j055538j69993
607.8D15933281J345426K332717K255023J908332K455294L907829N137831N158812
624.1D40434545M068315L038645K970964L540009L562510K454162J053512P11351J598299
642.5D63432312K456456K206237J154482M65661Q87692J933456K297997J359522J54615
660.8D76348430J41889J214564K747595K949744Q39979L53515J348704K593011K917617
$$ plain form
679.2 491455048 493391693 494104058 494612277 495829403 497352123 497848839 496433496 493600667 490618467
697.5 490618467 488036543 485245347 481697470 478043139 475836396 476176441 478814512 482592404 486662805
715.9 486662805 491324544 497457534 505056143 513045788 520219028 526045680 531270325 536809444
732.2 536809444 542264342 546356142 548418224 549033999 549205840 549106538 547677457 543921530 538178563
750.6 538178563 531877816 526176095 521036029 515834272 510598242 506418526 504729569 506253481
766.9 506253481 510567307 516698182 524116397 533128202 543898582 555329740 565616071 573766649
783.2 573766649 580275476 586329281 592458606 598082781 602581799 606310248 610552430 616164625
799.5 616164625 622320890 627338767 630367875 632134318 634045243 636542380 638600707 639168024 638519347
$$ packed form
679.2D91455048J936645P12365N08219J217126J522720M96716j415343k832829k982200
697.5D90618467k581924k791196l547877l654331k206743L40045K638071L777892M070401
715.9D86662805M661739O132990P598609P989645P173240N826652N224645N539119
732.2E36809444N454898M091800K062082O15775J71841r9302j429081l755927n742967
750.6E38178563o300747n701721n140066n201757n236030m179716j688957J523912
766.9E06253481M313826O130875P418215R011805J0770380J1431158J0286331Q150578
783.2E73766649O508827O053805O129325N624175M499018L728449M242182N612195
799.5F16164625O156265N017877L029108J766443J910925K497137K058327N67317o48677
$$ plain form
817.9 638519347 637804449 637486696 636728346 634311140 629784703 623850524 617628098 611616373 605392694
836.2 605392694 598507583 591453016 585316241 580631077 576830268 572803676 568043172 562903821
852.6 562903821 557811916 552837253 548256516 545699120 547636151 555093169 566936255 581124842
868.9 581124842 595548749 608306944 618298292 625261724 628922880 628699541 624585688 617677689
885.2 617677689 609585702 601544797 593876243 586276948 578730762 571751714 565611839 559804022
901.5 559804022 553332448 545500636 536365867 526333988 515619695 504206419 492302448 480772227
917.8 480772227 470975548 464015782 459945738 457877696 456993312 457194030 458763599 461742252 465795219
936.2 465795219 470559120 475870043 481247574 485170126 485463142 480690032 471013904 457716823
$$ packed form
817.9F38519347p14898l17753p58350k417206m526437n934179o222426o011725o223679
836.2F05392694o885111p054567o136775m685164l800809m026592m760504n139351
852.6E62903821n091905m974663m580737k557396J937031P457018J1843086J4188587
868.9E81124842J4423907J2758195R991348O963432L661156k23339m113853o907999
885.2F17677689q091987q040905p668554p599295p546186o979048o139875n807817
901.5E59804022o471574p831812r134769j0031879j0714293j1413276j1903971j1530221
917.8D80772227r796679o959766m070044k068042q84384K00718J569569K978653M052967
936.2D65795219M763901N310923N377531L922552K93016m773110r676128j3297081
$$ plain form
952.5 457716823 442223996 425454795 407731265 389196604 370067835 350583255 330880135
966.8 330880135 311033666 291206837 271659672 252780855 235114038 219235301 205607355
981.1 205607355 194454893 185750678 179364607 175094247 172565237 171309531 170972064 171286166 172017172
999.4 172017172 172947496 173788056 174221754 174108729 173548475 172819436 172297269 172263846 172873914 174129754
1019.8 174129754 175970316 178428710 181477040 184876353 188322455 191588312 194486767 196841702
1036.1 196841702 198507130 199531242 200193152 200877309 201903000 203483373 205906913 209569350 214647993
1054.5 214647993 220984548 228487790 237200499 246989399 256991804 264994711 267827690 263631612
1070.8 263631612 254126906 243652195 235846102 231811613 230993837 232545823 235767052 240126044
$$ packed form
952.5D57716823j5492827j6769201j7723530j8534661j9128769j9484580j9703120
966.8C30880135j9846469j9826829j9547165j8878817j7666817j5878737j3627946
981.1B05607355j1152462q704215o386071m270360k529010j255706l37467L14102P31006
999.4A72017172R30324Q40560M33698j13025n60254p29039n22167l3423O10068J255840
1019.8A74129754J840562K458394L048330L399313L446102L265857K898455K354935
1036.1A96841702J665428J024112O61910O84157J025691J580373K423540L662437N078643
1054.5B14647993O336555P503242Q712709R788900J0002405Q002907K832979m196078
1070.8B63631612r504706j0474711p806093m034489q17776J551986L221229M358992
$$ plain form
1087.1 240126044 245350704 251326650 257728457 263876468 268975645 272504508 274492562 275563478
1103.4 275563478 276631802 278515726 281578064 285613805 290112853 294521362 298362702 301356971
1119.8 301356971 303604543 305590838 308019757 311463296 315969199 320817500 324687660 326275587
1136.1 326275587 324772924 320102036 312967718 304555416 296017379 288216621 281691015 276682973
1152.4 276682973 273267537 271462768 271276265 272743821 275994092 281222045 288601428 298177332
1168.7 298177332 309784085 323018849 337347358 352257371 367398024 382549673 397395253
1183 397395253 411450505 424142689 434965640 443678677 450332075 455144584 458463043 460784435
1199.3 460784435 462725282 464840323 467484117 470825404 474914163 479770392 485317469 491228402
$$ packed form
1087.1B40126044N224660N975946O401807O148011N099177L528863J988054J070916
1103.4B75563478J068324J883924L062338M035741M499048M408509L841340K994269
1119.8C01356971K247572J986295K428919L443539M505903M848301L870160J587927
1136.1C26275587j502663m670888p134318q412302q538037p800758o525606n008042
1152.4B76682973l415436j804769j86503J467556L250271N227953P379383R575904
1168.7B98177332J1606753J3234764J4328509J4910013J5140653J5151649J4845580
1183C97395253J4055252J2692184J0822951Q713037O653398M812509L318459K321392
1199.3D60784435J940847K115041K643794L341287M088759M856229N547077N910933
$$ plain form
1215.6 491228402 496864557 501459658 504529595 506053150 506310046 505643129 504276216 502378523 500232279
1234 500232279 498175323 496439189 495123118 494320363 494191527 494907707 496497691 498757571 501300335
1252.3 501300335 503719330 505768478 507418215 508822858 510194778 511742890 513673127 516050994
1268.6 516050994 518678784 521111667 522841930 523599863 523492277 522869885 522092164 521335125 520526111
1287 520526111 519496679 518179536 516588151 514723897 512534618 510028362 507420182 504980624 502736568
1305.4 502736568 500549078 498450398 496549577 494865596 493374467 491933137 490248531 487915456
1321.7 487915456 484536171 479922891 474250942 468046159 461963087 456542283 452144623 449020773
1338 449020773 447357059 446966439 447227448 447642386 447933048 447930813 447589964 446898192 445867449 444559813
$$ packed form
1215.6D91228402N636155M595101L069937J523555K56896o66917j366913j897693k146244
1234E00232279k056956j736134j316071q02755j28836P16180J589984K259880K542764
1252.3E01300335K418995K049148J649737J404643J371920J548112J930237K377867
1268.6E16050994K627790K432883J730263P57933j07586o22392p77721p57039q09014
1287E20526111j029432j317143j591385j864254k189279k506256k608180k439558k244056
1305.4E02736568k187490k098680j900821j683981j491129j441330j684606k333075
1321.7D87915456l379285m613280n671949o204783o083072n420804m397660l123850
1338D49020773j663714l90620K61009M14938K90662k235l40849o91772j030743j307636
$$ plain form
1358.4 444559813 443086237 441679597 440689921 440015972 439492464 439374864 439862818 441004515 442447424
1376.7 442447424 443737060 444897056 446442246 449068666 453209132 457913131 461525589 463726223
1393.1 463726223 464718312 464709580 463939041 462711871 461102128 459076583 456966907 454860389 452707857
1411.4 452707857 450747460 449119836 447701663 446779758 446723789 447191745 447988153 449127167 450657099
1429.8 450657099 452516288 454418570 456528336 459041864 461396605 463532209 465363801 466589987
1446.1 466589987 467008352 466636837 465693682 464338809 462197691 460089624 459840924 460908383 463460416
1464.5 463460416 467785984 473115116 479970485 490188181 501918614 512441158 521941602 530915558
1480.8 530915558 539497495 547176778 554323554 561711311 569021523 574863911 579803526 585077763
$$ packed form
1358.4D44559813j473576j406640r89676o73949n23508j17600M87954J141697J442909
1376.7D42447424J289636J159996J545190K626420M140466M703999L612458K200634
1393.1D63726223R92089q732p70539j227170j609743k025545k109676k106518k152532
1411.4D52707857j960397j627624j418173r21905n5969M67956P96408J139014J529932
1429.8D50657099J859189J902282K109766K513528K354741K135604J831592J226186
1446.1D66589987M18365l71515r43155j354873k141118k108067k48700J067459K552033
1464.5D63460416M325568N329132O855369J0217696J1730433J0522544R500444Q973956
1480.8E30915558Q581937P679283P146776P387757P310212N842388M939615N274237
$$ plain form
1497.1 585077763 590275228 594670892 598188281 601417959 605448246 609351099 612493813 615307868
1513.4 615307868 617919445 620589972 623166382 625876546 628604829 630961955 633247972 635235369
1529.7 635235369 636866212 638517559 640081584 641151488 642040551 643067360 644103885 645089328 645797968
1548.1 645797968 646190584 646349192 646301806 645970166 645105422 644399166 644234836 643642426 642625213 641292691
1568.5 641292691 639847338 638743401 637333512 635233164 633526504 632203102 630609393 628727973
1584.8 628727973 626603484 624297798 621899724 619472563 616922796 614185393 611226857 607985377
1601.1 607985377 604595661 601155937 597462118 593334675 589160442 585217476 580797076 575759172
1617.4 575759172 571895719 568492115 564465165 560723782 557362616 554186761 551640689 549347579
$$ packed form
1497.1E85077763N197465M395664L517389L229678M030287L902853L142714K814055
1513.4F15307868K611577K670527K576410K710164K728283K357126K286017J987397
1529.7F35235369J630843J651347J564025J069904Q89063J026809J036525R85443P08640
1548.1F45797968L92616J58608m7386l31640q64744p06256j64330n92410j017213j332522
1568.5F41292691j445353j103937j409889k100348j706660j323402j593709j881420
1584.8F28727973k124489k305686k398074k427161k549767k737403k958536l241480
1601.1F07985377l389716l439724l693819m127443m174233l942966m420400n037904
1617.4E75759172l863453l403604m026950l741383l361166l175855k546072k293110
$$ plain form
1633.7 549347579 546945810 545646906 545377254 545398593 545540631 546035290 547524273 549357951 551544249
1652.1 551544249 555278957 558902323 562121809 565759957 570234239 575147271 579482675 584099829
1668.4 584099829 589904785 595535457 601320684 607650995 613279700 618321836 623967052 631679654
1684.7 631679654 638713717 644228637 649644256 654452085 659232438 664191306 668585420 673145533
1701.1 673145533 676870704 679846823 682952285 685789108 688205600 690334380 692450047 695311189
1717.4 695311189 698664129 701481938 703920424 706329286 708652794 710904717 712952793 715189278
1733.7 715189278 717750192 719905555 722115993 724669397 727210283 729599833 731936097 734657466
1750 734657466 737853587 740735948 743229210 745577514 747718036 750011981 752375245 754350781 755920589
$$ packed form
1633.7E49347579k401769j298904k69652K1339J42038M94659J488983J833678K186298
1652.1E51544249L734708L623366L219486L638148M474282M913032M335404M617154
1668.4E84099829N804956N630672N785227O330311N628705N042136N645216P712602
1684.7F31679654P034063N514920N415619M807829M780353M958868M394114M560113
1701.1F73145533L725171K976119L105462K836823K416492K128780K115667K861142
1717.4F95311189L352940K817809K438486K408862K323508K251923K048076K236485
1733.7G15189278K560914K155363K210438K553404K540886K389550K336264K721369
1750G34657466L196121K882361K493262K348304K140522K293945K363264J975536J569808
$$ plain form
1768.4 755920589 757218778 758698821 760563910 762278378 763624012 764750481 765859604 767085075
1784.7 767085075 768435478 769617677 770475984 771394134 772536278 773707926 774829507 775919735 776983857
1803 776983857 777936161 778837085 779821455 780894756 781862497 782601595 783257842 784077525 784984171 785715580
1823.4 785715580 786246955 786660433 787178218 788079917 789039850 789640009 789982975 790284991 790561736 790951431
1843.8 790951431 791559458 792023242 792236984 792477250 792915940 793448746 793816030 793953419 794046044 794251204
1864.2 794251204 794480145 794711888 795080066 795467317 795825183 796306252 796896696 797376633 797653735 797878325
1884.6 797878325 798230350 798771203 799407542 799805701 799887240 800030589 800438046 800945759 801290154 801356673
1905 801356673 801271081 801308215 801632762 802031338 802169383 802057207 802057624 802302301 802721739 803143680 803310633
$$ packed form
1768.4G55920589J298189J480043J865089J714468J345634J126469J109123J225471
1784.7G67085075J350403J182199Q58307R18150J142144J171648J121581J090228J064122
1803G76983857R52304R00924R84370J073301R67741P39098O56247Q19683R06646P31409
1823.4G85715580N31375M13478N17785R01699R59933O00159L42966L02016K76745L89695
1843.8G90951431O08027M63784K13742K40266M38690N32806L67284J37389R2625K05160
1864.2G94251204K28941K31743L68178L87251L57866M81069N90444M79937K77102K24590
1884.6G97878325L52025N40853O36339L98159Q1539J43349M07457N07713L44395O6519
1905H01356673q5592L7134L24547L98576J38045j12176M17K44677M19438M21941J66953
$$ plain form
1927.5 803310633 803295314 803372920 803661227 804009676 804178476 804089427 803945720 804105043 804602206 805090249
1947.9 805090249 805279553 805233955 805300295 805696011 806244731 806604505 806665003 806627512 806783855 807250440
1968.3 807250440 807739913 807927847 807874382 807885408 808166325 808572710 808799446 808734000 808566213 808560848
1988.7 808560848 808777809 809061110 809183359 809074581 808927357 808975160 809165835 809206724 808915377 808458626
2009 808458626 808132410 807998657 807864666 807512164 806891322 806176841 805572391 805158854 804925025 804630518
2029.4 804630518 804092705 803544819 803244710 803069830 802709699 802099407 801492214 801168859 801134527 801137984
2049.8 801137984 800953627 800619781 800416112 800530910 800817072 800951958 800819278 800660253 800755799 801101327
2070.2 801101327 801439285 801513493 801349580 801212788 801349282 801699162 801940799 801904559 801758707 801831007
$$ packed form
1927.5H03310633j5319P7606K88307L48449J68800q9049j43707J59323M97163M88043
1947.9H05090249J89304m5598O6340L95716N48720L59774O0498l7491J56343M66585
1968.3H07250440M89473J87934n3465J1026K80917M06385K26736o5446j67787n365
1988.7H08560848K16961K83301J22249j08778j47224M7803J90675M0889k91347m56751
2009H08458626l26216j33753j33991l52502o20842p14481o04450m13537k33829k94507
2029.4H04630518n37813n47886l00109j74880l60131o10292o07193l23355l4332L457
2049.8H01137984j84357l33846k03669J14798K86162J34886j32680j59025R5546L45528
2070.2H01101327L37958P4208j63913j36792J36494L49880K41637l6240j45852P2300
$$ plain form
2090.6 801831007 802222490 802678466 802881718 802819610 802802801 803089917 803588927 803970575 804028749 803887248
2111 803887248 803892374 804219902 804650128 804809034 804617584 804396927 804463923 804781616 805041552 805001676 804746985
2133.5 804746985 804625690 804837406 805202663 805372298 805198014 804942250 805000007 805406690 805800021 805853009
2153.9 805853009 805677891 805695951 806122899 806777239 807293653 807483494 807582736 808022022 808894396 809798479
2174.3 809798479 810335636 810579658 810932517 811635971 812516987 813197255 813529968 813740313 814161360 814889193
2194.6 814889193 815680027 816199839 816399574 816634178 817250550 818132043 818824828 819092393 819196343 819547951
2215 819547951 820272803 821085155 821567357 821657181 821751893 822206855 822917402 823487401 823655009 823605001
2235.4 823605001 823773086 824300408 824910223 825259268 825273335 825242400 825525224 826101780 826593161 826721907
$$ packed form
2090.6H01831007L91483M55976K03252o2108j6809K87116M99010L81648N8174j41501
2111H03887248N126L27528M30226J58906j91450k20657O6996L17693K59936l9876k54691
2133.5H04746985j21295K11716L65257J69635j74284k55764N7757M06683L93331N2988
2153.9H05853009j75118J8060M26948O54340N16414J89841R9242M39286Q72374R04083
2174.3H09798479N37157K44022L52859P03454Q81016O80268L32713K10345M21047P27833
2194.6H14889193P90834N19812J99735K34604O16372Q81493O92785K67565J03950L51608
2215H19547951P24852Q12352M82202Q9824R4712M54962P10547N69999J67608n0008
2235.4H23605001J68085N27322O09815L49045J4067l0935K82824N76556M91381J28746
$$ plain form
2255.8 826721907 826625884 826722264 827240169 827899098 828246593 828214407 828172982 828470588 829046249 829538167
2276.2 829538167 829663813 829534054 829553962 829966724 830588758 831011653 831060648 831008613 831239939 831812680
2296.6 831812680 832397342 832630873 832604945 832759202 833317339 834087491 834690332 834906936 834931195 835265577
2317 835265577 836136341 837122500 837649703 837703943 837752402 838157773 838733733 838916361 838578701 838185132
2337.4 838185132 838123560 838261783 838028550 836921990 835601330 835194767 836047292 837655246 839079916
2355.8 839079916 839831591 839856446 839407682 838823318 838044465 836757123 835013211 833277464 831940114
2374.1 831940114 830965877 830010891 828858376 827693701 826899946 826583147 826475322 826238036 825759351
2392.5 825759351 825241268 824971676 824980259 824944973 824551582 823867142 823244333 822925568 822772145 822420776
$$ packed form
2255.8H26721907r6023R6380N17905O58929L47495l2186m1425K97606N75661M91918
2276.2H29538167J25646j29759J9908M12762O22034M22895M8995n2035K31326N72741
2296.6H31812680N84662K33531k5928J54257N58137P70152O02841K16604K4259L34382
2317H35265577Q70764R86159N27203N4240M8459M05371N75960J82628l37660l93569
2337.4H38185132o1572J38223k33233j106560j320660m06563Q52525J607954J424670
2355.8H39079916P51675K4855m48764n84364p78853j287342j743912j735747j337350
2374.1H31940114r74237r54986j152515j164675p93755l16799j07825k37286m78685
2392.5H25759351n18083k69592Q583l5286l93391o84440o22809l18765j53423l51369
$$ plain form
2412.9 822420776 821716547 820890784 820281327 819950342 819617212 818979979 818067312 817203462 816605210 816167057
2433.3 816167057 815619111 814808369 813858151 813040555 812492371 812011003 811276972 810292244 809363484 808719337
2453.7 808719337 808275461 807751775 806962550 806010246 805204213 804714203 804353178 803794742 802951694 802081347
2474.1 802081347 801473856 801104844 800687313 800021529 799203634 798529267 798169792 797951341 797566950 796930909
2494.5 796930909 796268344 795884669 795795739 795659006 795206904 794570088 794052005 793797433 793658376 793323457
2514.9 793323457 792690635 791999340 791511834 791206241 790840387 790225625 789379537 788539827 787926376 787438989
2535.3 787438989 786796093 785896242 784906209 784070790 783467472 782899737 782120824 781137466 780205548 779537141
2555.6 779537141 779023647 778369963 777469218 776529372 775779843 775190473 774591148 773860157 772996485 772158086
$$ packed form
2412.9H22420776p04229q25763o09457l30985l33130o37233r12667q63850n98252m38153
2433.3H16167057n47946q10742r50218q17596n48184m81368p34031r84728r28760o44147
2453.7H08719337m43876n23686p89225r52304q06033m90010l61025n58436q43048q70347
2474.1H02081347o07491l69012m17531o65784q17895o74367l59475k18451l84391o36041
2494.5G96930909o62565l83675q8930j36733m52102o36816n18083k54572j39057l34919
2514.9G93323457o32822o91295m87506l05593l65854o14762q46088q39710o13451m87387
2535.3G87438989o42896q99851r90033q35419o03318n67735p78913r83358r31918o68407
2555.6G79537141n13494o53684r00745r39846p49529n89370n99325p30991q63672q38399
$$ plain form
2576 772158086 771513999 771011114 770422101 769651771 768848896 768198490 767745435 767362833 766844034 766141474
2596.4 766141474 765459597 764982104 764612138 764117897 763408303 762580812 761756420 760969758 760167599 759231567
2616.8 759231567 758104324 756883025 755719602 754624844 753460526 752118111 750632644 749160767
2633.2 749160767 747795284 746472716 745097756 743640900 742153823 740717471 739351749 737995684
2649.5 737995684 736576736 735099852 733651817 732328653 731101155 729829848 728485525 727128983
2665.8 727128983 725817740 724596322 723433614 722272813 721095264 719905674 718765914 717726171
2682.1 717726171 716725051 715674520 714543164 713380933 712258637 711152256 709986985 708738089
2698.4 708738089 707438171 706143200 704885244 703604162 702228308 700790644 699387372 698101282
$$ packed form
2576G72158086o44087n02885n89013p70330q02875o50406m53055l82602n18799p02560
2596.4G66141474o81877m77493l69966m94241p09594q27491q24392p86662q02159r36032
2616.8G59231567j127243j221299j163423j094758j164318j342415j485467j471877
2633.2G49160767j365483j322568j374960j456856j487077j436352j365722j356065
2649.5G37995684j418948j476884j448035j323164j227498j271307j344323j356542
2665.8G27128983j311243j221418j162708j160801j177549j189590j139760j039743
2682.1G17726171j001120j050531j131356j162231j122296j106381j165271j248896
2698.4G08738089j299918j294971j257956j281082j375854j437664j403272j286090
$$ plain form
2714.7 698101282 696926296 695759833 694545269 693312883 692135394 691097736 690177202 689261734 688267052
2733.1 688267052 687217116 686252415 685427487 684627295 683738351 682755470 681776583 680908561 680149674
2751.4 680149674 679407060 678584397 677702427 676891744 676214874 675583959 674871683 674070895 673248351 672425270
2771.8 672425270 671582282 670673430 669621825 668436050 667242050 666091084 664902985 663560808 662019968
2790.2 662019968 660383582 658774197 657163918 655435383 653539181 651515424 649435699 647326648
2806.5 647326648 645160258 642891347 640481949 637983263 635485172 632979512 630377114 627579808
2822.8 627579808 624612510 621616244 618632257 615565479 612320840 608882010 605302691 601630270
2839.1 601630270 597840607 593839049 589530826 584989369 580474257 576228559 572342634 568752527
$$ packed form
2714.7F98101282j174986j166463j214564j232386j177489j037658r20534r15468r94682
2733.1F88267052j049936r64701q24928q00192q88944r82881r78887q68022p58887
2751.4F80149674p42614q22663q81970q10683o76870o30915p12276q00788q22544q23081
2771.8F72425270q42988r08852j051605j185775j194000j150966j188099j342177j540840
2790.2F62019968j636386j609385j610279j728535j896202k023757k079725k109051
2806.5F47326648k166390k268911k409398k498686k498091k505660k602398k797306
2822.8F27579808k967298k996266k983987l066778l244639l438830l579319l672421
2839.1F01630270l789663m001558m308223m541457m515112m245698l885925l590107
$$ plain form
2855.5 568752527 565294981 561765313 557944894 553635716 548728228 543228090 537257969 531006694
2871.8 531006694 524626076 518239498 512057602 506365657 501396060 497290015 494079173 491667569
2888.1 491667569 489913672 488682687 487811238 487118483 486434549 485615402 484565109 483245075 481620073
2906.5 481620073 479609370 477122039 474062830 470410824 466343284 462122023 457968116 454146862
2922.8 454146862 450918198 448448986 446926773 446532816 447376490 449541539 452987373 457524329 462926835
2941.1 462926835 468942404 475352287 482017875 488843232 495754927 502657831 509518206 516373694
2957.4 516373694 523142219 529626429 535683990 541316509 546610475 551608920 556352735 560943604
2973.8 560943604 565438986 569835365 574087918 578053415 581622362 584860921 587859690 590587914
$$ packed form
2855.5E68752527l457546l529668l820419m309178m907488n500138n970121o251275
2871.8E31006694o380618o386578o181896n691945m969597m106045l210842k411604
2888.1D91667569j753897j230985q71449o92755o83934q19147j050293j320034j625002
2906.5D81620073k010703k487331l059209l652006m067540m221261m153907l821254
2922.8D54146862l228664k469212j522213l93957Q43674K165049L445834M536956N402506
2941.1D62926835O015569O409883O665588O825357O911695O902904O860375O855488
2957.4E16373694O768525O484210O057561N632519N293966M998445M743815M590869
2973.8E60943604M495382M396379M252553L965497L568947L238559K998769K728224
$$ plain form
2990.1 590587914 592945993 594880641 596427798 597632706 598508000 599032640 599156797 598893821 598318219
3008.4 598318219 597499490 596415222 594963074 593168020 591177106 589049339 586766899 584336042
3024.7 584336042 581741035 579006374 576255322 573523700 570671320 567647457 564602911 561566412
3041.1 561566412 558418512 555118680 551749349 548442423 545177162 541837692 538428783 534985006
3057.4 534985006 531530261 528136909 524838269 521583736 518215656 514662623 511128724 507790864
3073.7 507790864 504627526 501480639 498183787 494780779 491375864 487974972 484620124 481325060
3090 481325060 477974266 474536866 471159607 467924535 464703679 461395949 458138943 455066383 452024758
3108.4 452024758 448826104 445670813 442753345 439868957 436849594 433660001 430328935 427080333
$$ packed form
2990.1E90587914K358079J934648J547157J204908Q75294N24640J24157k62976n75602
3008.4E98318219q18729j084268j452148j795054j990914k127767k282440k430857
3024.7E84336042k595007k734661k751052k731622k852380l023863l044546l036499
3041.1E61566412l147900l299832l369331l306926l265261l339470l408909l443777
3057.4E34985006l454745l393352l298640l254533l368080l553033l533899l337860
3073.7E07790864l163338l146887l296852l403008l404915l400892l354848l295064
3090D81325060l350794l437400l377259l235072l220856l307730l257006l072560l041625
3108.4D52024758l198654l155291k917468k884388l019363l189593l331066l248602
$$ plain form
3124.7 427080333 424073845 421201378 418262273 415237457 412327290 409622461 406934857 404070705
3141 404070705 401128918 398298681 395616770 393109709 390707195 388144702 385346919 382573098 379988730
3159.4 379988730 377514988 375076622 372666508 370272040 367906034 365591824 363317281 361075044
3175.7 361075044 358855665 356672496 354539812 352455139 350434721 348466694 346474588 344439268
3192 344439268 342444152 340502232 338600874 336767793 334991008 333255142 331535727 329793483 328070700
3210.3 328070700 326428622 324842125 323277801 321734339 320214599 318718672 317233741 315773636
3226.7 315773636 314419717 313224345 312042832 310639471 309104413 307712108 306474984 305304378
3243 305304378 304190636 303053051 301813960 300600290 299539238 298547626 297496945 296421409 295403093
$$ packed form
3124.7D27080333l006488k872467k939105l024816k910167k704829k687604k864152
3141D04070705k941787k830237k681911k507061k402514k562493k797783k773821k584368
3159.4C79988730k473742k438366k410114k394468k366006k314210k274543k242237
3175.7C61075044k219379k183169k132684k084673k020418j968027j992106k035320
3192C44439268j995116j941920j901358j833081j776785j735866j719415j742244j722783
3210.3C28070700j642078j586497j564324j543462j519740j495927j484931j460105
3226.7C15773636j353919j195372j181513j403361j535058j392305j237124j170606
3243C05304378j113742j137585j239091j213670j061052r91612j050681j075536j018316
$$ plain form
3261.3 295403093 294417858 293478817 292667359 291961730 291184723 290248930 289232284 288223416 287307292
3279.7 287307292 286476195 285675704 284903675 284172356 283532619 282936871 282234758 281396002 280485511 279637963
3300.1 279637963 278990030 278481007 277871609 277009487 275956690 274864107 273871660 272995383 272169888
3318.4 272169888 271375507 270606458 269822478 268913656 267883211 266910851 266063958 265314609 264644593
3336.8 264644593 263889968 262957811 261988610 261035055 260180861 259517998 258767754 257740319 256669492
3355.2 256669492 255761623 255008340 254285753 253547937 252955437 252456427 251692951 250591487 249527276
3373.5 249527276 248755410 248124078 247461230 246755615 246124104 245657504 245377108 245264128 245040774 244469225
3393.9 244469225 243867755 243705481 243794665 243504345 242772967 242169887 241956621 241902888 241764858 241455436
$$ packed form
3261.3B95403093r85235r39041q11458p05629p77007r35793j016646j008868r16124
3279.7B87307292q31097q00491p72029p31319o39737n95748p02113q38756r10491q47548
3300.1B79637963o47933n09023o09398q62122j052797j092583r92447q76277q25495
3318.4B72169888p94381p69049p83980r08822j030445r72360q46893p49349o70016
3336.8B64644593p54625r32157r69201r53555q54194o62863p50244j027435j070827
3355.2B56669492r07869p53283p22587p37816n92500m99010p63476j101464j064211
3373.5B49527276p71866o31332o62848p05615o31511m66600k80396j12980k23354n71549
3393.9B44469225o01470j62274Q9184k90320p31378o03080k13266n3733j38030l09422
$$ plain form
3414.3 241455436 241095230 240879893 240749791 240621179 240686521 241029695 241436020 241681144 241902575 242273003
3434.7 242273003 242529735 242477342 242399544 242568895 242933571 243361667 243799701 244282648 244834274 245449573
3455.1 245449573 246162653 246965930 247662470 248333037 249340907 250516593 251313090 251642436 251988679
3473.4 251988679 252687424 253706813 254708380 255399615 256088555 257053524 258019090 258864969 259807408
3491.8 259807408 260876209 261998594 263103426 264178306 265225768 266142577 266953081 267851621 268988907
3510.2 268988907 270351052 271675587 272772968 273832709 275099963 276571244 277901173 278926790
3526.5 278926790 279984027 281348854 282936186 284572840 286106020 287547857 289169222 290968508
3542.8 290968508 292652220 294101745 295569956 297209948 299013406 301005423 303140551 305413961
$$ packed form
3414.3B41455436l60206k15337j30102j28612O5342L43174M06325K45124K21431L70428
3434.7B42273003K56732n2393p7798J69351L64676M28096M38034M82947N51626O15299
3455.1B45449573P13080Q03277O96540O70567J007870J175686P96497L29346L46243
3473.4B51988679O98745J019389J001567O91235O88940R64969R65566Q45879R42439
3491.8B59807408J068801J122385J104832J074880J047462R16809Q10504Q98540J137286
3510.2B68988907J362145J324535J097381J059741J267254J471281J329929J025617
3526.5B78926790J057237J364827J587332J636654J533180J441837J621365J799286
3542.8B90968508J683712J449525J468211J639992J803458J992017K135128K273410
$$ plain form
3559.1 305413961 307738602 309848338 311782807 314231753 317318529 320310950 323089659 325982153
3575.4 325982153 329097539 332445800 335994452 339489788 342696995 345928401 349661916 353476673
3591.7 353476673 357131869 360951722 365082711 369282097 373458505 377553225 381415963 385369778
3608.1 385369778 389588654 393911511 398423612 402815253 407110482 411954135 416850001 421179622
3624.4 421179622 424926370 428856194 433825523 438748062 443317950 447813898 452215046 456624508
3640.7 456624508 461036742 465112448 468777984 472906202 478019506 482836097 487022787 491512775
3657 491512775 496219277 500418007 504275799 508076072 511486292 514651299 518374264 521844029 524905741
3675.4 524905741 528709173 532676697 536340058 539812207 542946458 545695007 548316479 551169813
$$ packed form
3559.1C05413961K324641K109736J934469K448946L086776K992421K778709K892494
3575.4C25982153L115386L348261L548652L495336L207207L231406L733515L814757
3591.7C53476673L655196L819853M130989M199386M176408M094720L862738L953815
3608.1C85369778M218876M322857M512101M391641M295229M843653M895866M329621
3624.4D21179622L746748L929824M969329M922539M569888M495948M401148M409462
3640.7D56624508M412234M075706L665536M128218N113304M816591M186690M489988
3657D91512775M706502M198730L857792L800273L410220L165007L722965L469765L061712
3675.4E24905741L803432L967524L663361L472149L134251K748549K621472K853334
$$ plain form
3691.7 551169813 554150045 557019114 559583127 561754584 563927889 566462517 568936169 570854843
3708 570854843 572240233 573922396 576437533 578994155 581120014 582876027 584459662 586040676 587862194
3726.4 587862194 589942455 591702878 592912972 593987405 595634222 597789645 599471867 600106657
3742.7 600106657 600675344 602239549 603505313 604346097 606018603 608041525 609501541 610675275 612198770
3761 612198770 613708258 614906609 616036177 617107511 618349075 619827271 621168196 622236669 623195648
3779.4 623195648 624275148 625292838 626252949 627396107 628631473 629808784 630733550 631475627 632346034
3797.7 632346034 632955015 633464098 634523988 635453343 636434734 637879431 639135122 639770508 640212178
3816.1 640212178 640883744 641275108 642017782 643332601 644428551 645391226 646201074 646891892 647674978
$$ packed form
3691.7E51169813K980232K869069K564013K171457K173305K534628K473652J918674
3708E70854843J385390J682163K515137K556622K125859J756013J583635J581014J821518
3726.4E87862194K080261J760423J210094J074433J646817K155423J682222O34790
3742.7F00106657N68687J564205J265764Q40784J672506K022922J460016J173734J523495
3761F12198770J509488J198351J129568J071334J241564J478196J340925J068473R58979
3779.4F23195648J079500J017690R60111J143158J235366J177311R24766P42077Q70407
3797.7F32346034O08981N09083J059890R29355R81391J444697J255691O35386M41670
3816.1F40212178O71566L91364P42674J314819J095950R62675Q09848O90818P83086
$$ plain form
3834.4 647674978 648118734 648248076 648871243 649956048 651143551 652266860 653079629 653048396 652151585
3852.8 652151585 652566731 654361010 655720532 656319916 656525135 657050431 657758415 658060074 658476591
3871.2 658476591 659257114 660244763 661155403 661528766 661932886 662553072 663008392 663639188 664147556 664393067
3891.6 664393067 665040076 665866673 666223347 666140258 666009843 666205883 667047143 668122470 668897092 669376254
3912 669376254 669613421 669667363 669852257 670270383 670599818 670809805 671213329 671661139 671872258 672116816
3932.3 672116816 672591269 673031449 673295498 673435926 673600376 673935175 674278378 674561083 674931586 675307453
3952.7 675307453 675587118 675829947 676124752 676467419 676811576 677131772 677375495 677556574 677774847 678068280
3973.1 678068280 678383350 678671658 678905368 679156184 679449499 679629028 679698050 679859340 680131733 680376887
$$ packed form
3834.4F47674978M43756J29342O23167J084805J187503J123309Q12769l1233q96811
3852.8F52151585M15146J794279J359522N99384K05219N25296P07984L01659M16517
3871.2F58476591P80523R87649R10640L73363M04120O20186M55320O30796N08368K45511
3891.6F64393067O47009Q26597L56674q3089j30415J96040Q41260J075327P74622M79162
3912F69376254K37167N3942J84894M18126L29435K09987M03524M47810K11119K44558
3932.3F72116816M74453M40180K64049J40428J64450L34799L43203K82705L70503L75867
3952.7F75307453K79665K42829K94805L42667L44157L20196K43723J81079K18273K93433
3973.1F78068280L15070K88308K33710K50816K93315J79529O9022J61290K72393K45154
$$ plain form
3993.5 680376887 680605888 680856705
3997.6 680856705
$$ packed form
3993.5F80376887K29001K50817
3997.6F80856705
##END=$$ End of the data block
