##TITLE=$$ Begin of the data block
##JCAMP-DX=5.00 $$ ACD/SpecManager v 10.08
##SPECTROMETER/DATA SYSTEM=Alpha
##DATE=26 Dec 2014 10:25:20
##DATA TYPE=INFRARED SPECTRUM
##DATA CLASS=XYDATA
##ORIGIN=
##OWNER=
##NPOINTS=1765
##FIRSTX=399.76428223
##LASTX=3997.64306641
##MAXX=3997.64306641
##MINX=399.76428223
##MAXY=0.84047163
##MINY=0.17084409
##XFACTOR=1.0000000000
##YFACTOR=1.000000000000000e-9
##FIRSTY=0.48187760
##DELTAX=2.03961372
##XUNITS=1/CM
##YUNITS=ARBITRARY UNITS
##XYDATA=(X++(Y..Y))
399.8D81877595l046334l291338l912807k386570J141131L694147L197581P64489j576334
$$ 481877595 478831261 475539923 471627116 469240546 470381677 474075824 477273405 478037894 476461560
418.1D76461560k011896o59912j051665l161520m393041l974735k656579j625479j447409
$$ 476461560 474449664 473789752 472738087 469576567 465183526 461208791 458552212 456926733 455479324
436.5D55479324j015008J099140M512876O600678N811721L353238J171798R03517J651287
$$ 455479324 454464316 455563456 460076332 466677010 472488731 475841969 477013767 477917284 479568571
454.8D79568571J172155r55313k936513l256082k282471j982987l155201m681588n066126
$$ 479568571 480740726 479785413 476848900 473592818 471310347 469327360 466172159 461490571 456424445
473.2D56424445l226876j122982q20636j616508j757413o80209P76470J068384m85093
$$ 456424445 453197569 452074587 451253951 449637443 447880030 447199821 447976291 449044675 448559582
491.5D48559582k354592k702176j796753j107186j821577l325343m015118l613472
$$ 448559582 446204990 443502814 441706061 440598875 438777298 435451955 431436837 427823365
507.9D27823365k932549l158182m300177n490899n760163m433244k696574j961678
$$ 427823365 424890816 421732634 417432457 411941558 406181395 401748151 399051577 397089899
524.2C97089899j860649j202583K20209J817644L128856L998638M664391N462825N899996
$$ 397089899 395229250 394026667 394246876 396064520 399193376 403192014 407856405 413319230 419219226
542.5D19219226M944443K491296k91080j934021k133072k003789k765208m350901n717277
$$ 419219226 424163669 426654965 426363885 424429864 422296792 420293003 417527795 413176894 407459617
560.9D07459617o264717o260872o547480p116259o687700m517883j198054K128959
$$ 407459617 401194900 394934028 388386548 381270289 374582589 370064706 368866652 370995611
577.2C70995611M618496O077110O881655P548749P753432O686658M328727J565934
$$ 370995611 375614107 381691217 388572872 396121621 403875053 410561711 414890438 416456372
593.5D16456372M559J19359N94467K88128m95553q46713j68622J345843K407491K341360
$$ 416456372 416460931 416580290 417174757 417462885 416967332 416120619 415951997 417297840 419705331 422046691
613.9D22046691J945019K323449L782570N228132N284667M047245K989262L031731
$$ 422046691 423991710 426315159 430097729 435325861 440610528 444657773 447647035 450678766
630.2D50678766L640055L571064K435893J107335P56293J550317K380490K191484J174957
$$ 450678766 454318821 457889885 460325778 461433113 462189406 463739723 466120213 468311697 469486654
648.6D69486654M98265R42349J985848K335370J392156J64270J26422J179277K624333
$$ 469486654 469984919 470927268 472913116 475248486 476640642 476804912 476931334 478110611 480734944
667D80734944K808750Q17060M00752J512289K753318K908259J894236P70479N65440
$$ 480734944 483543694 484360754 484761506 486273795 489027113 491935372 493829608 494600087 495165527
685.3D95165527J208901J503706M80920j434326k844095k989382k565205k788365l628939
$$ 495165527 496374428 497878134 498359054 496924728 494080633 491091251 488526046 485737681 482108742
703.7D82108742l751040k191483M52637K698481L745467M017740M633487O151676P684141
$$ 482108742 478357702 476166219 476618856 479317337 483062804 487080544 491714031 497865707 505549848
722E05549848Q108199P247269N821466N173505N534827N463839M037917K002716O13391
$$ 505549848 513658047 520905316 526726782 531900287 537435114 542898953 546936870 548939586 549552977
740.4E49552977K29478m7088j428961l799141n787492o312310n703032n173505n284309
$$ 549552977 549782455 549735367 548306406 544507265 538719773 532407463 526704431 521530926 516246617
758.7E16246617n339682m210532j575887J661300M341245O135822P462501Q981586
$$ 516246617 510906935 506696403 505120516 506781816 511123061 517258883 524721384 533702970
775.1E33702970J0723710J1508703J0353744Q086026O448745O041169O097973N639851
$$ 533702970 544426680 555935383 566289127 574375153 580823898 586865067 592963040 598602891
791.4E98602891M510760L711582M284620N641818O136298M960477K963424J801789
$$ 598602891 603113651 606825233 611109853 616751671 622887969 627848446 630811870 632613659
807.7F32613659J988768K460182J955271N29706o10828o67036k76148p17103k451778
$$ 632613659 634602427 637062609 639017880 639547586 638936758 638269722 637993574 637276471 634824693
826F34824693m666030o062389o242394n981326o231845o920456p081628o160438m741133
$$ 634824693 630158663 624096274 617853880 611872554 605640709 598720253 591638625 585478187 580737054
844.4E80737054l884494m039466m692734n051791n018890m975975m616618k555132
$$ 580737054 576852560 572813094 568120360 563068569 558049679 553073704 548457086 545901954
860.7E45901954J977265P478893J1807740J4159381J4417052J2728930R936332O863714
$$ 545901954 547879219 555358112 567165852 581325233 595742285 608471215 618407547 625271261
877F25271261L530264l07203m196226p016242q095622p957160p651389p635474p522583
$$ 625271261 628801525 628494322 624298096 617281854 609186232 601229072 593577683 585942209 578419626
895.4E78419626o917835o116390n819022o502867p891834r166300r993434j0705114
$$ 578419626 571501791 565385401 559566379 553063512 545171678 536005378 526011944 515306830
911.7E15306830j1466622j1948168j1524678r740948o915540m060596k038091q50201
$$ 515306830 503840208 491892040 480367362 470626414 463710874 459650278 457612187 456761986
928D56761986J81794J549661L011883M094332M763395N238682N286276L905565L10033
$$ 456761986 456943780 458493441 461505324 465599656 470363051 475601733 480888009 484793574 485103607
946.4D85103607m786700r694874j3281942j5480637j6808063j7754733j8534184j9135892
$$ 485103607 480316907 470622033 457340091 441859454 425051391 407296658 388762474 369626582
962.7C69626582j9487828j9663275j9798517j9854992j9599975j8860101j7573759
$$ 369626582 350138754 330475479 310676962 290821970 271221995 252361894 234788135
977B34788135j5766025j3558760j1140004q709520o369308m265547k546668j255408
$$ 234788135 219022110 205463350 194323346 185613826 179244518 174978971 172432303 171176895
993.3A71176895l32802L15651P35060R24900Q55416M84511r0018n87851p58990n12168
$$ 171176895 170844093 171159744 171894804 172819704 173675120 174159631 174069613 173481762 172722772 172210604
1013.7A72210604j7002N63264J189664J828551K487913L077894L410369L446043L271401
$$ 172210604 172193602 172756866 173946530 175775081 178262994 181340888 184751257 188197300 191468701
1032A91468701K911910K346158J603365R43363O48394P57635J111805J614779K439753
$$ 191468701 194380611 196726769 198330134 199273497 199921891 200679526 201791331 203406110 205845863
1050.4B05845863L675192N053029O320357P499591Q678481R753361R956360P930159
$$ 205845863 209521055 214574084 220894441 228394032 237072513 246825874 256782234 264712393
1066.7B64712393K804637m137844r415388j0421499p804409m050687q43510J507849
$$ 264712393 267517030 263379186 253963798 243542299 235737890 231687203 230843693 232351542
1083B32351542L180637M345939N270004O043017O407202O096452N051047L527402K026618
$$ 232351542 235532179 239878118 245148122 251191139 257598341 263694793 268745840 272273242 274299860
1101.4B74299860J112729J110643J939983L089666M014492M489452M411637L829599
$$ 274299860 275412589 276523232 278463215 281552881 285567373 290056825 294468462 298298061
1117.7B98298061L002822K268970J984567K404213L396779M439801M794508L877312
$$ 298298061 301300883 303569853 305554420 307958633 311355412 315795213 320589721 324467033
1134C24467033J618892j514554m674941p093549q387178q544177p803351o528258n003363
$$ 324467033 326085925 324571371 319896430 312802881 304415703 295871526 288068175 281539917 276536554
1152.4B76536554l369540j733869j32054J478106L215104N205601P382781R550303
$$ 276536554 273167014 271433145 271301091 272779197 275994301 281199902 288582683 298132986
1168.7B98132986J1576950J3241023J4329940J4891446J5134454J5154898J4861852
$$ 298132986 309709936 322950959 337280899 352172345 367306799 382461697 397323549
1183C97323549J4078200J2676626J0778368Q685708O660461M822135L305405K313525
$$ 397323549 411401749 424078375 434856743 443542451 450202912 455025047 458330452 460643977
1199.3D60643977J965284K157778K664029L331185M072189M852891N554199N900473
$$ 460643977 462609261 464767039 467431068 470762253 474834442 479687333 485241532 491142005
1215.6D91142005N602389M567504L053367J519382K81155o42955j363933j881301k122224
$$ 491142005 496744394 501311898 504365265 505884647 506165802 505522847 504158914 502277613 500155389
1234E00155389k072900j748592j281679p84725j45703P15554J619398K282650K541512
$$ 500155389 498082489 496333897 495052218 494267493 494121790 494837344 496456742 498739392 501280904
1252.3E01280904K403080K045811J679599J436591J380086J536727J919150K371669
$$ 501280904 503683984 505729795 507409394 508845985 510226071 511762798 513681948 516053617
1268.6E16053617K610207K417087J727522P62939r9122o07610p41005p23422q10921
$$ 516053617 518663824 521080911 522808433 523571372 523472250 522864640 522123635 521400213 520589292
1287E20589292j053572j330852j569450j844645k199709k505958k579570k421260k252459
$$ 520589292 519535720 518204868 516635418 514790773 512591064 510085106 507505536 505084276 502831817
1305.4E02831817k188564k097249j907408j686186j510590j481324j693547k295256
$$ 502831817 500643253 498546004 496638596 494952410 493441820 491960496 490266949 487971693
1321.7D87971693l342092m604757n680233o214797o093264n417615m376948l102958
$$ 487971693 484629601 480024844 474344611 468129814 462036550 456618935 452241987 449139029
1338D49139029j649171l78222K68579L93450K44945j4185l06845o69152j034230j309901
$$ 449139029 447489858 447111636 447380215 447773665 448018610 448004425 447697580 447028428 445994198 444684297
1358.4D44684297j465351j403540j026153p20650n37605j01625N13792J128137J400947
$$ 444684297 443218946 441815406 440789253 440068603 439530998 439429373 439943165 441071302 442472249
1376.7D42472249J302779J218170J567423K591402M082113M660100L604203K208740
$$ 442472249 443775028 444993198 446560621 449152023 453234136 457894236 461498439 463707179
1393.1D63707179R86397k6226p84278j216918j589984k028525k112478k080649k126127
$$ 463707179 464693576 464667350 463883072 462666154 461076170 459047645 456935167 454854518 452728391
1411.4D52728391j961232j640319j431644r30548m9591N06431Q55386J172006J537383
$$ 452728391 450767159 449126840 447695196 446764648 446715057 447221488 448076874 449248880 450786263
1429.8D50786263J854270J899243K134234K548813K358616K127200J840800J235455
$$ 450786263 452640533 454539776 456674010 459222823 461581439 463708639 465549439 466784894
1446.1D66784894M08411l86476r59039j394123k205908k098828j70947J116515K560585
$$ 466784894 467193305 466806829 465847790 464453667 462247759 460148931 459977984 461094499 463655084
1464.5D63655084M312635N326271O875336J0246128J1740744J0514140R482265Q945763
$$ 463655084 467967719 473293990 480169326 490415454 502156198 512670338 522152603 531098366
1480.8E31098366Q544922P647037P118464P367313P336437N889893M967928N291700
$$ 531098366 539643288 547290325 554408789 561776102 569112539 575002432 579970360 585262060
1497.1E85262060N193293M364252L476441L177881M047871M003585L184437K802074
$$ 585262060 590455353 594819605 598296046 601473927 605521798 609525383 612709820 615511894
1513.4F15511894K573967K609790K521038K704620K803802K448142K322376J960933
$$ 615511894 618085861 620695651 623216689 625921309 628725111 631173253 633495629 635456562
1529.7F35456562J570046J616955J602888J116514Q75294R97007J042187J022816P74443
$$ 635456562 637026608 638643563 640246451 641362965 642238259 643235266 644277453 645300269 646074712
1548.1F46074712M40538J62244o7055l63112q80301o58810j53780o39140j053334j304269
$$ 646074712 646515250 646677494 646610439 646247327 645367026 644708216 644554436 643915296 642861962 641557693
1568.5F41557693j383960j072883j417697k133906j725316j330375j592637j858890
$$ 641557693 640173733 639100850 637683153 635549247 633823931 632493556 630900919 629042029
1584.8F29042029k118468k311587k357960k383888k563655k769470k974213l230869
$$ 629042029 626923561 624611974 622254014 619870126 617306471 614537001 611562788 608331919
1601.1F08331919l364563l436208l692925m115462m166246l938556m426956n036890
$$ 608331919 604967356 601531148 597838223 593722761 589556515 585617959 581191003 576154113
1617.4E76154113l844619l393769m026592l734410l350437l173947k547920k294778
$$ 576154113 572309494 568915725 564889133 561154723 557804286 554630339 552082419 549787641
1633.7E49787641k371610j216948j99854N8711J47163M79818J513004J886606K210021
$$ 549787641 547416031 546199083 545999229 546057940 546205103 546684921 548197925 550084531 552294552
1652.1E52294552L762782L673851L238202L640055M495383M945397M339576M577160
$$ 552294552 556057334 559731185 562969387 566609442 571104825 576050222 580389798 584966958
1668.4E84966958N767822N635798N802631O362140N661846N044281N621255P704734
$$ 584966958 590734780 596370578 602173209 608535349 614197195 619241476 624862731 632567465
1684.7F32567465P018745N469084N393803M800260M738331M933775M406392M516482
$$ 632567465 639586210 645055294 650449097 655249357 659987688 664921463 669327855 673844337
1701.1F73844337L639877K941966L153682K874375K377212K078890K125502K881885
$$ 673844337 677484214 680426180 683579862 686454237 688831449 690910339 693035841 695917726
1717.4F95917726L336787K815008K460241K439618K341450K251744K023518K156198
$$ 695917726 699254513 702069521 704529762 706969380 709310830 711562574 713586092 715742290
1733.7G15742290K499759K180696K247810K549589K500236K340853K315581K730131
$$ 715742290 718242049 720422745 722670555 725220144 727720380 730061233 732376814 735106945
1750G35106945L222406K909303K486407K318800K140283K320052K373874J967549J558244
$$ 735106945 738329351 741238654 743725061 746043861 748184144 750504196 752878070 754845619 756403863
1768.4G56403863J288772J484931J894652J743079J361608J140416J114905J219451
$$ 756403863 757692635 759177566 761072218 762815297 764176905 765317321 766432226 767651677
1784.7G67651677J350701J191914Q50320R00030J141429J162410J112819J095652J066506
$$ 767651677 769002378 770194292 771044612 771944642 773086071 774248481 775361300 776456952 777523458
1803G77523458R77397R42945R83119J031995R39608P36892O71983Q31246R00090P29442
$$ 777523458 778500855 779443800 780426919 781458914 782398522 783135414 783807397 784638643 785538733 786268175
1823.4G86268175N45740M24325N38051R46522R82344N77390K95222K90871L26812M14551
$$ 786268175 786813915 787238240 787776291 788722813 789705157 790282547 790577769 790868640 791195452 791610003
1843.8G91610003N63800M30524K26140K58148M27902N15341L58403J38164R5188J87338
$$ 791610003 792173803 792604327 792830467 793088615 793516517 794031858 794390261 794528425 794623613 794810951
1864.2G94810951K19583K50340L77595L86656L56197M90546O17802M92871K67744K17497
$$ 794810951 795030534 795280874 795658469 796045125 796401322 796891868 797509670 798002541 798270285 798487782
1884.6G98487782L57450N39481O17981L71993O4254J52111M28676N08785L18885L7730
$$ 798487782 798845232 799384713 800002694 800374687 800438941 800591052 801019728 801528513 801847398 801885128
1905H01885128r6261O3478L64364M10258J27912j41561l1769K54035M62353M71949
$$ 801885128 801788867 801852345 802216709 802626967 802754879 802613318 802581549 802835584 803297937 803769886
1925.4H03769886J98126m7564J8000K84076L86536J83702j01447j29581K13206N23210
$$ 803769886 803968012 803920448 803938448 804222524 804609060 804792762 804691315 804561734 804774940 805298150
1945.8H05298150M40895J38223l2007J06930M05372N22077L31938M3630m0709J79529
$$ 805298150 805739045 805877268 805845261 805952191 806357563 806879640 807211578 807255208 807214499 807394028
1966.2H07394028M91202M92036J84536m6194K3187K71677L84033K34902k9445j38104
$$ 807394028 807885230 808377266 808561802 808515608 808538795 808810472 809194505 809429407 809399962 809261858
1986.6H09261858L219K18213K75016P3134j61349j26481J16288K24948L6836k99454
$$ 809261858 809265077 809483290 809758306 809831440 809670091 809543610 809659898 809884846 809921682 809622228
2007H09622228m60863l35336j49846j49965l66688o20305o87242n72979m03524k38299
$$ 809622228 809161365 808826029 808676183 808526218 808159530 807539225 806851983 806279004 805875480 805637181
2027.4H05637181k93851n23031n32329k97129j94192l85165n94378n53310k75731m0173
$$ 805637181 805343330 804820299 804287970 803990841 803796649 803411484 802817106 802263796 801988065 801947892
2047.8H01947892n6744k24292l20792j95861R7751K87831J66834j00255j43946J11878
$$ 801947892 801891148 801666856 801346064 801150203 801247954 801535785 801702619 801602364 801458418 801570296
2068.2H01570296L51906L20256N2273j73449j11282J68383L55661K31564o4731j59740
$$ 801570296 801922202 802242458 802294731 802121282 802010000 802178383 802534044 802765608 802700877 802541137
2088.6H02541137J07050M25696M54366K01941l2067N245K44379M47869L84748P6592
$$ 802541137 802648187 803073883 803528249 803730190 803698123 803703368 803947747 804395616 804780364 804856956
2109H04856956j29044J5676L33130M19736J22309k00689j68085J25110L41296K60950
$$ 804856956 804727912 804743588 805076718 805496454 805618763 805418074 805249989 805375099 805716395 805977345
2129.4H05977345o2347k95877j31727K42114L79682J49131j87278k44677P0810M07160
$$ 805977345 805914998 805619121 805487394 805729508 806109190 806258321 806071043 805826366 805897176 806304336
2149.8H06304336L85165M5240j87338K2829M72009O94931N07235J53125Q7559M64022
$$ 806304336 806689501 806734741 806547403 806570232 807042241 807737172 808244407 808397532 808485091 808949113
2170.2H08949113Q76188Q73029N23031K50518L54827P07388R15289P42316L58522J74940
$$ 808949113 809825301 810698330 811221361 811471879 811826706 812534094 813449383 814191699 814550221 814725161
2190.6H14725161L93629P46250P98046M85361J66118K33650O23048Q55624O43373K57134
$$ 814725161 815118790 815865040 816663086 817148447 817314565 817548215 818171263 819026887 819670260 819927394
2211H19927394J62125M23431P54893P99716M46915O8844J18673N00321P26759N42045
$$ 819927394 820089519 820512950 821267843 822067559 822514474 822583318 822701991 823202312 823929071 824471116
2231.4H24471116J48892j5199J94907N02706N71072L14295j311P808L46601N80669
$$ 824471116 824620008 824604809 824799716 825302422 825873494 826187789 826186478 826194286 826540887 827121556
2251.8H27121556M45723J10448p9334J21593N20111O22391L08693j6451L2604L56495
$$ 827121556 827567279 827677727 827598393 827719986 828240097 828862488 829171181 829154730 829187334 829543829
2272.2H29543829N70238M51505R7453j30355K7418M06981N90861L93092N9903j8180
$$ 829543829 830114067 830565572 830663025 830532670 830560088 830967069 831557930 831951022 832010925 831992745
2292.5H31992745K73347O00815N46157J61589m1485J91331N73218P43985N56826J79232
$$ 831992745 832266092 832866907 833413064 833574653 833533168 833724499 834297717 835041702 835598528 835777760
2312.9H35777760L4749L45886Q22425R24706M83692J4365L3259M30405O15835K50280
$$ 835777760 835812509 836158395 836980820 837905526 838389218 838403583 838436842 838867247 839483082 839733362
2333.3H39733362k46703m04358j89901N6029k02418j043260j293123m24087P79271
$$ 839733362 839486659 839082301 838892400 838948429 838746011 837702751 836409628 835985541 836764812
2351.7H36764812J525939J429439P51435p4207m71950m84347p27713j287938j709997
$$ 836764812 838290751 839720190 840471625 840397418 839925468 839441121 838713408 837425470 835715473
2370.1H35715473j645804j232266r15647r27388j094222j096070p92504l61085j18970
$$ 835715473 834069669 832837403 831921756 830994368 829900146 828804076 828011572 827650487 827531517
2388.4H27531517k04862m53889n39780l00109p033n4062l86834o36041n69165k80917
$$ 827531517 827326655 826872766 826332986 826032877 826025844 825971782 825584948 824948907 824379742 824098825
2408.8H24098825j44183l76105p22051p98583n70476l23475l40223o61612r61899q77202
$$ 824098825 823954642 823578537 822856486 822057903 821487427 821163952 820823729 820162117 819200218 818323016
2429.2H18323016n47767l93986n67377q69989r92298p97034m94539m55499p42495j015544
$$ 818323016 817775249 817381263 816813886 815943897 814951599 814154565 813660026 813204527 812462032 811446488
2449.6H11446488r37998o21438m32730n32150q05080r41038p71761m98116m00842n61535
$$ 811446488 810508490 809887052 809454322 808922172 808117092 807176054 806404293 805906177 805505335 804943800
2470H04943800q07941q47399n98550l56495m30465p08521q30769o36518l21388j99795
$$ 804943800 804135859 803288460 802689910 802333415 801902950 801194429 800363660 799727142 799405754 799205959
2490.4G99205959l79086o52015o69181l71158q8454j37567m46618o56247n52595k59637
$$ 799205959 798826873 798174858 797505677 797134519 797046065 796908498 796461880 795805633 795253038 794993401
2510.8G94993401j12534l11851o36638p06613m82082k79009l69490o89208r12130q19087
$$ 794993401 794880867 794569016 793932378 793225765 792743683 792464674 792095184 791405976 790493846 789674759
2531.2G89674759n64218m62651o37829r23693j000643p93398n68389n69702p83145
$$ 789674759 789110541 788647890 788010061 787086368 786085725 785292327 784723938 784154236 783371091
2549.5G83371091r66966r00805o50108n22316o77943r30071r82463p75337n39124n16534
$$ 783371091 782404125 781503320 780853212 780330896 779652953 778722882 777740419 776965082 776425958 775909424
2569.9G75909424p13706q98421q62777o45399m85659n82218q07405q53598o50704m16755
$$ 775909424 775195718 774297297 773434520 772789121 772303462 771721244 770913839 770060241 769409537 768992782
2590.3G68992782l65258n04911o60836o48856m95255m16756n21183p18892q52883q29041
$$ 768992782 768627524 768122613 767461777 766812921 766317666 765900910 765379727 764660835 763807952 762978911
2610.7G62978911p32064p55668r57548j164258j207947j135409j102507j184225j331866
$$ 762978911 762246847 761491179 760533631 759369373 758161426 757026017 755923510 754739285 753407419
2629.1G53407419j438141j420558j341819j325310j393854j485408j515567j446128
$$ 753407419 751969278 750548720 749206901 747881591 746487737 745002329 743486762 742040634
2645.4G42040634j348436j331448j404643j481533j467824j329899j219034j262129
$$ 742040634 740692198 739360750 737956107 736474574 735006750 733676851 732457817 731195688
2661.7G31195688j337707j352250j299739j196683j141250j162827j205802j219928
$$ 731195688 729857981 728505731 727205992 726009309 724868059 723705232 722499430 721279502
2678G21279502j130462r85920r79603j101255j171589j142442j088500j085281j143814
$$ 721279502 720149040 719163120 718183517 717082262 715910673 714768231 713679731 712594450 711450636
2696.4G11450636j235962j303076j307905j276553j268267j335085j429379j417577
$$ 711450636 710214674 708911598 707603693 706327140 705058873 703723788 702294409 700876832
2712.7G00876832j280963j163900j159549j219928j240433j136243r82523r44197j001477
$$ 700876832 699595869 698431969 697272420 696052492 694812059 693675816 692693293 691749096 690747619
2731.1F90747619j053036j046001r46343q35538q09312q76844r81450r81808q58903
$$ 690747619 689694583 688648582 687702239 686866701 686057389 685180545 684199095 683217287 682358384
2749.4F82358384p63178p76648q35717q33213p43866o41644o29545p13944q14617q52763
$$ 682358384 681595206 680818558 679982841 679149628 678405762 677764118 677134573 676420629 675606012 674753249
2769.8F74753249q19147q17060q94726j020908j157284j234472j220286j207351j327455
$$ 674753249 673934102 673117042 672222316 671201408 670044124 668809652 667589366 666382015 665054560
2788.2F65054560j537025j645506j605630j578927j701891j910448k029240k057612
$$ 665054560 663517535 661872029 660266399 658687472 656985581 655075133 653045893 650988281
2804.5F50988281k104998k182960k273322k385437k484202k507985k525330k631902
$$ 650988281 648883283 646700323 644427001 642041564 639557362 637049377 634524047 631892145
2820.8F31892145k813936k958297k988041k996981l084481l255844l451168l598154
$$ 631892145 629078209 626119912 623131871 620134890 617050409 613794565 610343397 606745243
2837.1F06745243l687203l791153m000128m309594m547000m518867m243850l871799
$$ 606745243 603058040 599266887 595266759 590957165 586410165 581891298 577647448 573775649
2853.4E73775649l570855l484666l606558l864348m298866m925370n555868o005585
$$ 573775649 570204794 566720128 563113570 559249222 554950356 550024986 544469118 538463533
2869.7E38463533o279945o412864o399572o218016n769611n012452m092843l197789
$$ 538463533 532183588 525770724 519371152 513153136 507383525 502371073 498278230 495080441
2886.1D95080441k419561j779586j270890q80927o57559o63578q21590j043797j340866
$$ 495080441 492660880 490881294 489610404 488729477 488071918 487408340 486586750 485542953 484202087
2904.4D84202087j686961k040654k467006l042311l665328m105717m242152m133999
$$ 484202087 482515126 480474472 478007466 474965155 471299827 467194110 462951958 458817959
2920.7D58817959l821790l270924k468110j468241l72231Q26538K157241L461391M558831
$$ 458817959 454996169 451725245 449257135 447788894 447416663 448243201 450400442 453861833 458420664
2939.1D58420664N409390O025016O438851O665439O766528O861239O949336O966710
$$ 458420664 463830054 469855070 476293921 482959360 489725888 496587127 503536463 510503173
2955.4E10503173O902337O753385O494105O126523N691230N290210N007029M814386
$$ 510503173 517405510 524158895 530653000 536779523 542470753 547760963 552767992 557582378
2971.7E57582378M649938M496693M413068M317403M035473L646910L313303L009677
$$ 557582378 562232316 566729009 571142077 575459480 579494953 583141863 586455166 589464843
2988E89464843K699554K363384J979411J615345J269221R23515N57601J29342k60055
$$ 589464843 592164397 594527781 596507192 598122537 599391758 600315273 600872874 601002216 600742161
3006.4F00742161n36203p69079j096725j502931j796186j969219k126753k272129k429783
$$ 600742161 600205958 599436879 598340154 596837223 595041037 593071818 590945065 588672936 586243153
3024.7E86243153k588749k668917k711118k783894k901972l014743l019154l016114
$$ 586243153 583654404 580985487 578274369 575490475 572588503 569573760 566554606 563538492
3041.1E63538492l137291l290117l357827l288686l236831l350675l450870l483773
$$ 563538492 560401201 557111084 553753257 550464571 547227740 543877065 540426195 536942422
3057.4E36942422l484547l381610l279268l269136l373266l528714l528595l382623
$$ 536942422 533457875 530076265 526796997 523527861 520154595 516625881 513097286 509714663
3073.7E09714663l223777l155708l268957l413767l442764l412515l357351l338456
$$ 509714663 506490886 503335178 500066221 496652454 493209690 489797175 486439824 483101368
3090D83101368l407598l433376l339380l228605l240377l327995l266961l092050l068119
$$ 483101368 479693770 476260394 472921014 469692409 466452032 463124037 459857076 456765026 453696907
3108.4D53696907l207505l177256k948016k887666l033250l223568l332764l235162
$$ 453696907 450489402 447312146 444364130 441476464 438443214 435219646 431886882 428651720
3124.7D28651720l009617k879143k957195l058851k953529k732307k675056k861083
$$ 428651720 425642103 422762960 419805765 416746914 413793385 411061078 408386022 405524939
3141D05524939k982944k854764k665848k502054k426088k598375k829969k791852k614975
$$ 405524939 402541995 399687231 397021383 394519329 392093241 389494866 386664897 383873045 381258070
3159.4C81258070k526521k469242k422929k407521k366215k327472k314448k276093
$$ 381258070 378731549 376262307 373839378 371431857 369065642 366738170 364423722 362147629
3175.7C62147629k214253k154290k128840k116293k066493k015501k010077k016395
$$ 362147629 359933376 357779086 355650246 353533953 351467460 349451959 347441882 345425487
3192C45425487j993031j961618j934082j879841j797229j742929j736581j733870j698374
$$ 345425487 343432456 341470838 339536756 337656915 335859686 334116757 332380176 330646306 328947932
3210.3C28947932j655668j625807j594722j569271j562595j567275j540362j474619
$$ 328947932 327292264 325666457 324071735 322502464 320939869 319372594 317832232 316357613
3226.7C16357613j360655j198411j142383j348495j549483j457154j294643j204252
$$ 316357613 314996958 313798547 312656164 311307669 309758186 308301032 307006389 305802137
3243C05802137j117140j131922j240850j229346j082807j014799j068861j082360j026810
$$ 305802137 304684997 303553075 302312225 301082879 300000072 298985273 297916412 296834052 295807242
3261.3B95807242r75847r02206p66754o92934q44091j018285r85504r00864q89182
$$ 295807242 294831395 293929189 293162435 292469501 291625410 290607125 289621621 288720757 287831575
3279.7B87831575q84772q43048p90804p25568o37054o25760p33524q58247r14336q51929
$$ 287831575 286946803 286103755 285312951 284587383 283950329 283324569 282591045 281732798 280818462 279966533
3300.1B79966533o75887n14269n95927q84682j064419j044781r57280q91119q35657
$$ 279966533 279290646 278776377 278180450 277295768 276231349 275186568 274229288 273338169 272502512
3318.4B72502512p98434p87080q06421r42379j051426r61065q31694p14421o13481
$$ 272502512 271704078 270916998 270110577 269168198 268116772 267155707 266324013 265609592 264996111
3336.8B64996111p30633r44406r88901r80258r10669p28220p74711j005978j028776
$$ 264996111 264265478 263321072 262332171 261351913 260441244 259713024 258938313 257932335 256903559
3355.2B56903559q74788p52419p44253p48188o08265n25683p44015j065940j078948
$$ 256903559 256028771 255276352 254532099 253783911 253175646 252649963 251905948 250840008 249761060
3373.5B49761060q12009o57857o47455o64204o48067n30422l04535r4652k10717n69075
$$ 249761060 248949051 248291194 247643739 246979535 246331468 245801046 245496511 245401859 245191142 244622067
3393.9B44622067o18577k35141Q65l19466o62908m95300k12520j38492j63898k75731
$$ 244622067 244003490 243768349 243769214 243449748 242786840 242291540 242079020 241940528 241776630 241500899
3414.3B41500899l32981j95637j00479q8424O9365K80396L50534K44618K42457L79443
$$ 241500899 241167918 240972281 240871802 240783378 240852743 241133139 241483673 241728291 241970748 242350191
3434.7B42350191K45958o0662q4415J64836M03151M86106M26501M36202N45785O28426
$$ 242350191 242596149 242535487 242451072 242615908 243019059 243505165 243931666 244367868 244913653 245542079
3455.1B45542079P16612P75263O85587O90788R68084J108050P87705L68119L66121
$$ 245542079 246258691 247033954 247719541 248410329 249378413 250486463 251274168 251642287 252008408
3473.4B52008408O87898J025050J026988P11680P07030R95189R94265Q49933R49502
$$ 252008408 252696306 253721356 254748344 255460024 256167054 257162243 258156508 259006441 259955943
3491.8B59955943J098007J123458J074165J056194J050323R35793Q57026R59515J147956
$$ 259955943 261053950 262177408 263251573 264307767 265358090 266293883 267150909 268110424 269258380
3510.2B69258380J315474J257509J067132J109809J327753J488447J329899J033902
$$ 269258380 270573854 271831363 272898495 274008304 275336057 276824504 278154403 279188305
3526.5B79188305J081497J362949J547754J646876J582683J429826J589387J817674
$$ 279188305 280269802 281632751 283180505 284827381 286410064 287839890 289429277 291246951
3542.8B91246951J722335J506061J561254J705915J790613J947999K120226K274275
$$ 291246951 292969286 294475347 296036601 297742516 299533129 301481128 303601354 305875629
3559.1C05875629K344042K191276K017825K435923L054202L003567K788067K906799
$$ 305875629 308219671 310410947 312428772 314864695 317918897 320922464 323710531 326617330
3575.4C26617330L149569L373057L546089L494829L217280L236711L741026L805101
$$ 326617330 329766899 333139956 336686045 340180874 343398154 346634865 350375891 354180992
3591.7C54180992L675431L932655M236787M231006M212439M141241L848613L901839
$$ 354180992 357856423 361789078 366025865 370256871 374469310 378610551 382459164 386361003
3608.1C86361003M242539M409880M540741M356921M279762M895300M956693M336118
$$ 386361003 390603542 395013422 399554163 403911084 408190846 413086146 418042839 422378957
3624.4D22378957L721297L935158N058050N020351M611492M500806M386008M348814
$$ 422378957 426100254 430035412 435093462 440113813 444725305 449226111 453612119 457960933
3640.7D57960933M343480M092276L731817M151255N148679M849583M171670M463404
$$ 457960933 462304413 466396689 470128506 474279761 479428440 484278023 488449693 492913097
3657D92913097M675776M167437L849328L817081L450096L207266L739536L480315L047288
$$ 492913097 497588873 501756310 505605638 509422719 512872815 516080081 519819617 523299932 526347220
3675.4E26347220L767490L929496L599346L459334L212333K792418K561986K844572
$$ 526347220 530114710 534044206 537643552 541102886 544315219 547107637 549669623 552514195
3691.7E52514195L028870K879024K598643K237856K155543K478122K469719J943469
$$ 552514195 555543065 558422089 561020732 563258588 565414131 567892253 570361972 572305441
3708E72305441J403332J669645K513528K573788K107382J711368J570940J629532J883328
$$ 572305441 573708773 575378418 577891946 580465734 582573116 584284484 585855424 587484956 589368284
3726.4E89368284K083599J727760J191735J084209J644850K116739J700461P03514
$$ 589368284 591451883 593179643 594371378 595455587 597100437 599217176 600917637 601621151
3742.7F01621151N45680J499117J221061P98225J721919K099156J467228J125395J529098
$$ 601621151 602166831 603665948 604887009 605685234 607407153 609506309 610973537 612098932 613628030
3761F13628030J614511J288712J117229R76384J158655J521766J454115J106620R26911
$$ 613628030 615242541 616531253 617648482 618624866 619783521 621305287 622759402 623866022 624792933
3779.4F24792933J077891J059711J010120J166224J198352J083314Q30650O89209Q45551
$$ 624792933 625870824 626930535 627940655 629106879 630305231 631388545 632219195 632908404 633753955
3797.7F33753955N95391N45204J140654R59933R36150J416147J287997O50883M30047
$$ 633753955 634349346 634894550 636035204 636995137 637931287 639347434 640635431 641286314 641716361
3816.1F41716361P15911M09484P08700J342475J107514Q91983P95782P48932P43628
$$ 641716361 642432272 642841756 643550456 644892931 646000445 646892428 647688210 648437142 649180770
3834.4F49180770L39031J05500O55949J113058J223564J158178Q08179o5148r22739
$$ 649180770 649519801 649625301 650281250 651394308 652617872 653776050 654584229 654519081 653596342
3852.8F53596342M30762J836300J372814N99087K05755N01215O89567K72154L82901
$$ 653596342 654027104 655863404 657236218 657835305 658041060 658542275 659231842 659503996 659886897
3871.2F59886897Q34703J076460R28104L16620L62396O66976N24282O47426N00500
$$ 659886897 660721600 661798060 662726164 663042784 663405180 664072156 664596438 665243864 665744364
3889.5F65744364K48790O64175Q38160L59953k9266m3214J49310O98388J010239P63893
$$ 665744364 665993154 666657329 667495489 667855442 667826176 667782962 667932272 668630660 669640899 670404792
3909.9F70404792M95672L12507R0778J25468M16577M21941K55346L44873L83973J94549
$$ 670404792 670900464 671212971 671303749 671429217 671845794 672267735 672523081 672867954 673251927 673446476
3930.3F73446476K26975M84526N13792L14117J29819J84476L82721L50893K64645L59356
$$ 673446476 673673451 674157977 674671769 674985886 675115705 675300181 675682902 676033795 676298440 676657796
3950.7F76657796L69966K72393K53737K58625K44140L03984L62277K81870J96457K64108
$$ 676657796 677027762 677300155 677553892 677812517 678056657 678360641 678722918 679004788 679201245 679465353
3971.1F79465353K96355K03550J77979K14279K88665L66271K89440J46806J40131J97470
$$ 679465353 679761708 679965258 680143237 680357516 680646181 681012452 681301892 681448698 681588829 681786299
3991.5F81786299K00152K47002L09288
$$ 681786299 681986451 682233453 682542741
3997.6F82542741
$$ 682542741
##END=$$ End of the data block
