##TITLE=100% Samsung $$ Begin of the data block
##JCAMP-DX=5.00 $$ ACD/SpecManager v 10.08
##SPECTROMETER/DATA SYSTEM=Alpha
##DATE=02 Dec 2014 10:08:34
##DATA TYPE=INFRARED SPECTRUM
##DATA CLASS=XYDATA
##ORIGIN=
##OWNER=
##NPOINTS=1765
##FIRSTX=399.76428223
##LASTX=3997.64306641
##MAXX=3997.64306641
##MINX=399.76428223
##MAXY=0.83605450
##MINY=0.11982544
##XFACTOR=1.0000000000
##YFACTOR=1.000000000000000e-9
##FIRSTY=0.83605450
##DELTAX=2.03961372
##XUNITS=1/CM
##YUNITS=ARBITRARY UNITS
##XYDATA=(X++(Y..Y))
399.8H36054504k510369j776099o90520m91261j61469M31776J78396k09689J10090
418.1H30935359M20988p4447j312792j910508r89079l33786l97682o9797J65939J42157
438.5H26576352L66867N7518o90639q29995p34448o96838n24938p17699j413405j757861
458.9H19634914j242816o94752n36084n43058l32355k3783O2347M40419Q46326P84874
479.3H18396032P16805Q41737R49383P33077K79665J38343J53541k04205m89593m78327
499.7H21036458o86109j081348j438260j966953k659500l339827m122912n578340p711410
518.1G92451799r074330r103775q873821q743524p939339o943405o643533o736458
534.4G28393614o777167o480873n924523n151987l801584j988768k99514J049459J995981
$$ plain form
399.8 836054504 833544135 831768036 831077516 830586255 830424786 830856562 831034958 830825269 830935359
418.1 830935359 831356347 831281900 829969108 828058600 827069521 826735735 826338053 826268256 826434195 826576352
438.5 826576352 826943219 827000737 826310098 825480103 824745655 824048817 823523879 822806180 821392775 819634914
458.9 819634914 818392098 817697346 817161262 816618204 816285849 816262066 816324413 816764832 817611158 818396032
479.3 818396032 819112837 819954574 820903957 821637034 821916699 822055042 822208583 822004378 821514785 821036458
499.7 821036458 820350349 819269001 817830741 815863788 813204288 809864461 805741549 800163209 792451799
518.1 792451799 783377469 774273694 765399873 756656349 748717010 741773605 735130072 728393614
534.4 728393614 721616447 715135574 709211051 704059064 700257480 698268712 697969198 699018657 701014638
552.7G01014638K508223K634346K473355K396226K612889L181994M001438M689694
569.1G25512803N091548N443990O002128O399274O399333O438852O269455N514204
585.4G73071587M380941L283084K363026J522422J232028J753449K383709K586663
601.7G92576909K301872J428306M50432M8399k8133m92871j621008k861142k042413
620G89760351J248956L535390L135800K054870J617790J406610J183152P97927P1883
638.4H04812729n22613p28607j005590j372040j399636j219809j255929j720369k251387
656.8G93336749k741933l317773l718019m128635n698680o349326l830254l380775
673.1G60171354m218459m532039m698754n575836p738590j1527180j8366158l2389701
$$ plain form
552.7 701014638 703522861 706157207 708630562 711026788 713639677 716821671 720823109 725512803
569.1 725512803 730604351 736048341 742050469 748449743 754849076 761287928 767557383 773071587
585.4 773071587 777452528 780735612 783098638 784621060 785853088 787606537 789990246 792576909
601.7 792576909 794878781 796307087 796757519 796805918 796777785 796284914 794663906 791802764 789760351
620 789760351 791009307 794544697 797680497 799735367 801353157 802759767 803942919 804740846 804812729
638.4 804812729 804290116 803561509 802555919 801183879 799784243 798564434 797308505 795588136 793336749
656.8 793336749 790594816 787277043 783559024 779430389 773731709 767382383 763552129 760171354
673.1 760171354 755952895 751420856 746722102 741146266 733407676 721880496 703514338 671124637
689.4F71124637o1704993j09003127j48105293j36555895p7811629j8118262K1992281
703.7A41817719N6000828R2590720J22110844J27518355J03697479O6016138L3995867
717.9G43747950J4890015N493879J053572j400948l507674o360113j0704518j6084849
734.3G27127314k0263732k1001220j9087135j8229723k1007300k6567280l2911956
748.5E68058968l8958371m4022322m6319425m2968422l1984419j4128059O749541K6132017
764.9C82559508M0413141M7746480M8598975M5742035M2063594L8396358L3995509
779.1F79515600K8609574K2885978J7543912J3172627R892761P465244N717575M448295
795.4G89251566L500462K818763K265394J780569J313865Q49307O53446P41660P53284
$$ plain form
689.4 671124637 609419644 500416517 352311224 215755329 137943700 119825438 141817719
703.7 141817719 197818547 290409267 412520111 540038466 643735945 709752083 743747950
717.9 743747950 758637965 764131844 765185416 763784468 760276794 753916681 743212163 727127314
734.3 727127314 706863582 685862362 666775227 648545504 627538204 600970924 568058968
748.5 568058968 529100597 485078275 438758850 395790428 363806009 349677950 356427491 382559508
764.9 382559508 422972649 470719129 519318104 565060139 607123733 645520091 679515600
779.1 679515600 708125174 731011152 748555064 761727691 771620452 779085696 784803271 789251566
795.4 789251566 792752028 795570791 797836185 799616754 800930619 801779926 802433372 803175032 803928316
813.8H03928316O73532N69403M00961K73823K84136L31938J23561l92795j281262k780914
834.2H02130699m631758o023645o228328n081594l023565o52432J638174L351152M158795
852.6G85637498M189253L563285K571046J698911J015186L46959j71244m08769n47886
870.9G97894239o87480p18295o90401p05838p88033r74536j217365j515687j862824
889.3G88733780k239942k833605l947794o073416r862542j5688836k2979260k9099882
905.6F96008503k9413044k0623267m731536J1703611K2627473K6092589K3762941J8627167
921.9G44054437J3122737Q567810N298317K976417J221180j31488j111567j833796
938.2G72164047k438605k837658l077686l575563m750729o891847j0295629j5382946
$$ plain form
813.8 803928316 804601848 805171251 805572212 805846035 806130171 806462109 806585670 806192875 804911613 802130699
834.2 802130699 797498941 791475296 785246968 780165374 777141809 776489377 778127551 781478703 785637498
852.6 785637498 789826751 793390036 795961082 797659993 798675179 799022138 798850894 798442125 797894239
870.9 797894239 797206759 796488464 795798063 795092225 794304192 793329656 792112291 790596604 788733780
889.3 788733780 786493838 783660233 779712439 773639023 763776481 748087645 725108385 696008503
905.6 696008503 666595459 645972192 641240656 652944267 675571740 701664329 725427270 744054437
921.9 744054437 757177174 765744984 771043301 774019718 775240898 775109410 773997843 772164047
938.2 772164047 769725442 766887784 763810098 760234535 755483806 748591959 738296330 722913384
954.5G22913384k2625744l1426072l8353264l7806332k6594222p707417J1690795K5317490
970.9E95408618L0739248K9039860K3012221J5779257R652137N371392K447248L3915
987.2G11483896k102196k929926j088798K715349M819751K160608k071917j944184
1003.5G11042583J327753K671123J642286J44184j226187k663552m358531o658315
1019.8G01921344j0286689j5241802j8465638j3666630J669705J9457937K7913570
1034.1F93301797K4305403J5229106P323504K529621P3015j083552j680971k057492
1050.4G37940431k376497k924323l784299m712999n667090o836534p931709p968307
1066.7F95738673n898893j670837L149867O559670P984459Q281947Q248329P835567
$$ plain form
954.5 722913384 700287640 668861568 630508304 592701972 566107750 558400333 570091128 595408618
970.9 595408618 626147866 655187726 678199947 693979204 703631341 709002733 711449981 711483896
987.2 711483896 709381700 706451774 705362976 708078325 712898076 715058684 712986767 711042583
1003.5 711042583 712370336 715041459 716683745 716827929 715601742 712938190 708579659 701921344
1019.8 701921344 691634655 676392853 657927215 644260585 645930290 665388227 693301797
1034.1 693301797 717607200 732836306 740159810 742689431 742762446 741678894 739997923 737940431
1050.4 737940431 735563934 732639611 728855312 724142313 718475223 711638689 703706980 695738673
1066.7 695738673 689839780 688168943 691318810 697878480 705862939 714144886 722393215 730228782
1083G30228782O805360N436838M127502L027260K251029J783789J496374J334250J352370
1101.4G57843554J484275J449585J107931N88179J49846Q5950O30498J636266K546013
1119.8G67522097K938151K832770K446950J951933J420915Q88824M61042J62542k10643
1138.1G80414581p91549j538515k643049m564405p887125j2451768j5432596j2533784
1154.4G22571790l638625N531907R606004Q510828N467474K939463J423717L76165
1170.7G52788723q10743k669930n547941q386314q365571l952921K296627O206453
1187.1G31558383O035089L138483r7990k186835k863467k508700j634002p02381k4318
1205.4G30714262M88042J116813J859605K458393K711654K556563K013325J223922
$$ plain form
1083 730228782 737034142 742470980 746598482 749625742 751876771 753660560 755156934 756491184 757843554
1101.4 757843554 759327829 760777414 761885345 762473524 762623370 762709320 763339818 764976084 767522097
1119.8 767522097 770460248 773293018 775739968 777691901 779112816 780001640 780462682 780625224 780414581
1138.1 780414581 779623032 778084517 775441468 770877063 762989938 750538170 735105574 722571790
1154.4 722571790 718933165 724465072 734071076 742581904 748049378 750988841 752412558 752788723
1170.7 752788723 751977980 749308050 743760109 735373795 727008224 723055303 725351930 731558383
1187.1 731558383 737593472 740731955 740633965 738447130 735583663 733074963 731440961 730738580 730714262
1205.4 730714262 731202304 732319117 734178722 736637115 739348769 741905332 743918657 745142579
1221.7G45142579L71099m09484j067400j476944j554012j474738j387239j165032o18816
1240.1G36360013P0870M57228M19736M54425Q50380J133203R10044M22001N4657k6881
1260.5G41105676J18613K67684L22879K63870R119m86612j048565j478672j749277
1278.8G37324715j938224k054334k068400k123237k271891k376198k285421k158940
1295.2G20048070k320468k868891l544808l968835l900110l383518k751827k202689
1311.5F95106924j708806j102984m24266Q6546K38240P5579l83616r41634j019955
1329.8F89926028l80635M70936O04987m66525k499700m049241m314780l932059l432334
1348.2F71926677k986669k583206k255261j844108j311898o83844k19703J09613P53343
$$ plain form
1221.7 745142579 745513678 745104194 744036794 742559850 741005838 739531100 738143861 736978829 736360013
1240.1 736360013 736430883 736888111 737307847 737762272 738612652 739745855 740655899 741077900 741132557 741105676
1260.5 741105676 741224289 741491973 741814852 742078722 742087841 741601229 740552664 739073992 737324715
1278.8 737324715 735386491 733332157 731263757 729140520 726868629 724492431 722207010 720048070
1295.2 720048070 717727602 714858711 711313903 707345068 703444958 700061440 697309613 695106924
1311.5 695106924 693398118 692295134 691870868 691957414 692195654 692271233 691887617 690945983 689926028
1329.8 689926028 689545393 690016329 690621316 690154791 687655091 683605850 679291070 675359011 671926677
1348.2 671926677 668940008 666356802 664101541 662257433 660945535 660261691 660041988 660151601 660904944
1366.6F60904944J811862K925336M470408O616354Q255244R596288J0332286R625852
1382.9G14538574Q285046P427931O230652M830420M464924M105449K586544J015305
1399.2G53484845L06785M07756O77228J77800p50363k033710l612757m666209m522264
1417.5G39469111l184319k234876l834963p963299j3206959j9996286k4804890k5641799
1433.9F38601720l0121147l4450710l1221986l2833695l9177776m5792371n4078430
1448.1C70925605n5833608l9684146M900276R0743483J49163365R1311097M5085728
1462.4F56611800L1699896K1513581J1805714Q125662P852376N647003J653612k033412
1478.7G42876232o584943j3512492k3213386m0900112p9258263j15167439q1397324
$$ plain form
1366.6 660904944 662716806 665642142 670112550 676728904 684984148 694580436 704912722 714538574
1382.9 714538574 722823620 730251551 736482203 741312623 745777547 749882996 752469540 753484845
1399.2 753484845 753791630 754199386 754876614 755054414 754304051 752270341 748657584 743991375 739469111
1417.5 739469111 736284792 734049916 730214953 722251654 709044695 689048409 664243519 638601720
1433.9 638601720 608480573 574029863 542807877 509974182 470796406 425004035 370925605
1448.1 370925605 315091997 275407851 280308127 371051610 520214975 611526072 656611800
1462.4 656611800 688311696 709825277 721630991 729756653 737609029 743256032 744909644 742876232
1478.7 742876232 736291289 722778797 699565411 658665299 579407036 464239597 382842273
1493C82842273Q046448J05893045J25444353P4236691L4685373J9377411J4062226
1507.3G64587820N587816J651048J505316J734912J454354J076102O87361p8142n64218
1525.6G77642369p66635q01861o01053j104117j514554q19206q18729k121508k422035
1544G66672671j964450j450062j150727j033902n45681O95408K855837K620399N03898
1562.4G67203391O78956J097381J021743r0301j621366l403842q659840j5625238j9237399
1580.7G21363485j4002979K434850J4603078J1672735J078844q686304j8301546l0426383
1597F79735780l9063394l0180872L02494L1176269M1084826L2521188J8651307R125828
1613.4G43353426N158663L256142J329899O94394N40614k19464j520812l566265n200387
$$ plain form
1493 382842273 390888721 496781766 622226119 696462810 731148183 750525594 764587820
1507.3 764587820 770175636 771826684 773332000 775066912 776521266 777597368 778284729 778206587 777642369
1525.6 777642369 776875734 776073873 775472820 774368703 772854149 772034943 771216214 769094706 766672671
1544 766672671 764708221 763258159 762107432 761073530 760527849 761223257 764079094 766699493 767203391
1562.4 767203391 767882347 768979728 770001471 769911170 768289804 764885962 756226122 740600884 721363485
1580.7 721363485 707360506 709795356 724398434 736071169 737150013 728463709 710162163 679735780
1597 679735780 640672386 610491514 610794008 641970277 683055103 715576291 734227598 743353426
1613.4 743353426 748512089 751768231 753098130 753792524 754333138 754113674 752592862 749026597 743826210
1631.7G43826210o335616p374823l611445L304303Q093535R700537R329677O015003
1648G62947381J995921J107454K12073j192748j051903q33631j231730j817882j403212
1666.4G58731723m24326J38462K70247O04093P22707O37829R13501J364171R83358
1684.7G63941765k42889m25875m11153m41432j22070N52892K164245L539503K284288
1703.1G70839274R89795R9420p10964r75966j062394j310110k247631k900183k118826
1721.5G60602415j251519o20365R4592P64549J197398J324177O86109M13775P70807
1739.8G63981938P70688N14567M20392M24147K58803r5666K6525O02006J012624J287400
1760.2G69203424J551748J425206J402915J511753J338541Q57532K96116L95417R64165
$$ plain form
1631.7 743826210 737490594 730115771 726504326 729808629 737902164 747602701 756932378 762947381
1648 762947381 764943302 766050756 766262829 765070081 764018178 763184547 761952817 760134935 758731723
1666.4 758731723 758307397 758445859 758716106 759320199 760042906 760680735 761594236 762958407 763941765
1684.7 763941765 763698876 763273001 762861848 762420416 762298346 762851238 765015483 768554986 770839274
1703.1 770839274 771829069 771928489 771217525 770241559 769179165 767869055 765621424 762721241 760602415
1721.5 760602415 759350896 758730531 758825123 759589672 760787070 762111247 762797356 763211131 763981938
1739.8 763981938 764752626 765267193 765687585 766111732 766370535 766274869 766301394 766903400 767916024 769203424
1760.2 769203424 770755172 772180378 773583293 775095046 776433587 777291119 777587235 777982652 778946817
1778.6G78946817J286209J027524N24402J7583l08394o90341j696945k519905k641559
1796.9G73945391k744257k919019k818167k289951j535534p88868k92361J8239M42863
1815.3G61018336Q66771J105785J359463J721322J935721J959026K017915J757502
1831.6G73741841J521588J655042J586676J345336J317203J305163P77423K04981l7909
1850G83417344k30789m70042p60734j144648j614273k051591k355218k558530l014862
1868.3G69216657l402233k968133k164900j436651p73787j88232K90632O44327R31441
1886.7G60149121J204491J293898J293063J471877J648605J770615J898051J896441
1903G72626162J813292J721919J531183J222730R70304Q39949O31511K32458j04606
$$ plain form
1778.6 778946817 780233026 781260550 781784952 781802535 781494141 780803800 779106855 776586950 773945391
1796.9 773945391 771201134 768282115 765463948 763173997 761638463 760849595 760557234 760575473 761018336
1815.3 761018336 761885107 762990892 764350355 766071677 768007398 769966424 771984339 773741841
1831.6 773741841 775263429 776918471 778505147 779850483 781167686 782472849 783250272 783455253 783417344
1850 783417344 783186555 782716513 781955779 780811131 779196858 777145267 774790049 772231519 769216657
1868.3 769216657 765814424 762846291 760681391 759244740 758470953 758282721 758573353 759217680 760149121
1886.7 760149121 761353612 762647510 763940573 765412450 767061055 768831670 770729721 772626162
1903 772626162 774439454 776161373 777692556 778915286 779885590 780725539 781357050 781589508 781484902
1921.3G81484902l80337o93500q88408j057326j368404j808584k284586k689600k948821
1939.7G67365336l216266l369749l014564k337456j560211p77066o1810O00398J103997
1958.1G54732609J393616J532793J626313J722991J707793J632392J673758J739740
1974.4G67762005J656890J473785J276910J046777Q63969R27448J214087J491130J511931
1992.7G79224932J296461J091003Q85666O89685N52475L94047K53677J85847J27316
2011.1G84701109J00851J57237J65224Q7559O4969Q1420O4075N1737L3260J967J6391
2033.5G85525799N5432P1287P5460M7803J1086J5974q523n0366k9326J2040K9266J0968
2058G85766900l2962l0100j7166p3970j10924o8903j1563O378j6749m6313l1650K4676
$$ plain form
1921.3 781484902 781104565 780411065 779522657 778465331 777096927 775288343 773003757 770314157 767365336
1939.7 767365336 764149070 760779321 757764757 755427301 753867090 753090024 753028214 753628612 754732609
1958.1 754732609 756126225 757659018 759285331 761008322 762716115 764348507 766022265 767762005
1974.4 767762005 769418895 770892680 772169590 773216367 774080336 775007784 776221871 777713001 779224932
1992.7 779224932 780521393 781612396 782498062 783187747 783740222 784134269 784387946 784573793 784701109
2011.1 784701109 784801960 784959197 785124421 785211980 785276949 785358369 785422444 785474181 785507441 785509408 785525799
2033.5 785525799 785581231 785652518 785727978 785775781 785786867 785802841 785794318 785743952 785714626 785726666 785755932 785766900
2058 785766900 785733938 785703838 785686672 785612702 785501778 785432875 785421312 785427690 785410941 785364628 785332978 785357654
2082.5G85357654L6121O139l2306q8990q3685l7133m3750o3658o0260m0054k7359l5405
2106.9G84887314k8372k2829k5212j1444j1802m2856o8545m3690j5676k4856j8000
2129.4G84574032R477J0729l0518o0618o1333p8201r5606j00672q3089k8432k2471
2151.8G84033298p6651q3268o3777p7665q3506o8664p9096j23858k01702k98917l84808
2174.3G82491386m88579o59585q31128q58545o91652l58343N2690L57986M40657L42131
2194.6G79797018J73628K0504j52230l71039n30362n94140o24418o30140o35445p62701
2215G75690675j119554j725614k759338m768014q751034j6246617k7974248m0650070
2231.4F71696186m6050310l6838770j4521718J0963857K9559553L7092209L5134732
$$ plain form
2082.5 785357654 785393775 785399914 785367608 785278618 785194933 785157800 785114050 785050392 784990132 784950078 784922719 784887314
2106.9 784887314 784858942 784836113 784810901 784799457 784787655 784744799 784676254 784632564 784616888 784592032 784574032
2129.4 784574032 784583509 784594238 784563720 784503102 784441769 784363568 784267962 784167290 784084201 784055769 784033298
2151.8 784033298 783956647 783873379 783809602 783731937 783648431 783579767 783500671 783376813 783175111 782876194 782491386
2174.3 782491386 782002807 781343222 780512094 779653549 778961897 778603554 778656244 779014230 779454887 779797018
2194.6 779797018 779970646 779991150 779838920 779467881 778937519 778343379 777718961 777088821 776453376 775690675
2215 775690675 774571121 772845507 770086169 765318155 756567121 740320504 712346256 671696186
2231.4 671696186 625645876 588807106 574285388 585249245 614808798 651901007 687035739
2245.6F87035739K8064430K0022333J3305604Q541584N462230L514528K302408J617312
2262G69866168J232923R84311Q01742O41465M96864L95715L01958K03430J67668J21057
2282.3G75213301J7286j07885k33352k79307k76149k95162k91705k66910k78055l38912
2302.7G72863150n05507p66039r48012r32932p68006n13911k29001m9293J1503K1041
2323.1G68182993q4460l92794p73013j024425j272321j491189j280963o70970J7464
2341.5G61210322Q48592J737654J736045P56442k81512q28207p87616m84526k57015
2359.9G63650179K980M74334R09448J114428J123070J069129J049995J005948R10163
2378.2G71309674P81774O48976M98295K90572J37091R2029N0426n424m2081l8564P391
$$ plain form
2245.6 687035739 715100169 735122502 748428106 756969690 762431920 765946448 768248856 769866168
2262 769866168 771099091 772083402 772885144 773526609 774023473 774419188 774721146 774924576 775092244 775213301
2282.3 775213301 775230587 775122702 774889350 774610043 774333894 774038732 773747027 773480117 773202062 772863150
2302.7 772863150 772357643 771591604 770643592 769710660 768942654 768428743 768199742 768150449 768161952 768182993
2323.1 768182993 768098533 767705739 766932726 765908301 764635980 763144791 761863828 761192858 761210322
2341.5 761210322 762058914 763796568 765532613 766289055 766007543 765179336 764391720 763907194 763650179
2359.9 763650179 763653159 764127493 765036941 766151369 767274439 768343568 769393563 770399511 771309674
2378.2 771309674 772091448 772740424 773238719 773529291 773666382 773758411 773808837 773803413 773761332 773722768 773730159
2400.6G73730159J0073k9206j3531O0976J03354O5923M5598P3671N6446J430j8894
2423.1G74085999k5571k4974K324k8252q0526p3552p4506q7023p9989q0347r7931j00970
2447.6G73334682p3254k6286K1458M5121M1663n781o5029o8784m8697m4107q8752j43528
2472G72878706j11699j07169j98126k86400l39150l14653k22266j96338k59280k89798
2492.4G70553827k65538k15531j38044j13189k19942l29256k93910k30610k38777k39193
2512.8G68269837j97947j46568p6473p748K1636L9339O4433O9857K4437l7968l8683
2535.3G67984152J669l4094j30057j73271j76549j62780j19806n3823M1902J04070
2555.6G67281413O0320o139p630J1504J7762L338k0564o7949k11179l66509m07338
$$ plain form
2400.6 773730159 773740232 773711026 773697495 773758471 773861825 773927748 773973346 774047017 774103463 774104893 774085999
2423.1 774085999 774060428 774035454 774037778 774009526 773929000 773855448 773780942 773693919 773613930 773533583 773435652 773334682
2447.6 773334682 773261428 773235142 773256600 773301721 773343384 773337603 773272574 773203790 773155093 773110986 773022234 772878706
2472 772878706 772767007 772659838 772461712 772175312 771836162 771521509 771299243 771102905 770843625 770553827
2492.4 770553827 770288289 770072758 769934714 769821525 769601583 769272327 768978417 768747807 768509030 768269837
2512.8 768269837 768071890 767925322 767848849 767841101 767862737 767902076 767966509 768036366 768060803 768022835 767984152
2535.3 767984152 767985821 767951727 767821670 767648399 767471850 767309070 767189264 767135441 767177343 767281413
2555.6 767281413 767341733 767335594 767327964 767339468 767357230 767360568 767340004 767272055 767060876 766694367 766287029
2578.1G66287029l56794j79648J00553K46227J87337O0022j33216l83377n59867o38604
2598.5G64629662o27160m80652k37465M9830K86877L22997K51830J97232Q7738m4108
2618.9G64436781j74939l50178n04314o08981o92666p41720o47962l19898P4565L03328
2639.3G60774016L46840K70307J59621R9897O1572m17o2108q9765n1856k8491r3520
2661.7G61386096j63793k10285k66195k66730j88649r6500l397P6949Q5414L3855O557
2684.1G60393322L7074Q4877O9797m4465j10627m2200j2815p3313n9486R418k1220
2706.6G60230362j13129j45614j38879j15216p1347o2883o4849n0307m3630l1531l2425
2729G59360552n8651l2962L7194O6101O7830N8294O1750P2420K2828q8512j87934k02060
$$ plain form
2578.1 766287029 765930235 765750587 765851140 766097367 766284704 766344726 766211510 765828133 765268266 764629662
2598.5 764629662 764002502 763521850 763284385 763334215 763621092 763944089 764195919 764393151 764480889 764436781
2618.9 764436781 764261842 763911664 763407350 762798369 762105703 761363983 760716021 760396123 760470688 760774016
2639.3 760774016 761120856 761391163 761550784 761650681 761712253 761711836 761649728 761559963 761508107 761479616 761386096
2661.7 761386096 761222303 761012018 760745823 760479093 760290444 760193944 760190547 760267496 760352910 760386765 760393322
2684.1 760393322 760430396 760515273 760585070 760540605 760429978 760387778 760374963 760301650 760242164 760251582 760230362
2706.6 760230362 760117233 759971619 759832740 759717524 759646177 759583294 759518445 759468138 759424508 759392977 759360552
2729 759360552 759301901 759268939 759306133 759372234 759440064 759498358 759560108 759632528 759655356 759566844 759378910 759176850
2753.5G59176850j98781k63095l27349l38137l61264m26411m74692n25474o23405p48217
2773.9G54890025r03190j034259j048267r55463q20279p16090p06017q28266r93788
2792.2G46884406j019717r82344j054525j138747j156926j207292j304507j405001
2808.6G37615347j571059j851619k182543k584636l216505m177869n485177p182061
2824.9G09363878r282589j1676789j4100670j6199053j7824411j9084632k0138562
2839.1F01057172k0924330k1090805k0009041j6408325r861171k724886K112448M643977
2855.5E16795039O538034Q315265R571910J0014832R534538Q283495O497443M240871
2871.8E79791427J599073j247406m100323o710767q834303j0407746j1505067j2210071
$$ plain form
2753.5 759176850 758978069 758714974 758387625 758049488 757688224 757261813 756787121 756261647 755638242 754890025
2773.9 754890025 753986835 752952576 751904309 750948846 750128567 749412477 748706460 747878194 746884406
2792.2 746884406 745864689 744882345 743827820 742689073 741532147 740324855 739020348 737615347
2808.6 737615347 736044288 734192669 732010126 729425490 726208985 722031116 716545939 709363878
2824.9 709363878 700081289 688404500 674303830 658104777 640280366 621195734 601057172
2839.1 601057172 580132842 559042037 539032996 522624671 512763500 510038614 512151062 516795039
2855.5 516795039 523333073 531648338 541220248 551235080 560769618 569053113 575550556 579791427
2871.8 579791427 581390500 580143094 576042771 569332004 560497701 550089955 538584888 526374817
2888.1E26374817j2571395j2655198j2662500j2758345j3088435j3867974j5093684
2902.4D33677286j6455025j7746597j9036800k0368039k1249950k0345629j6929507
2916.6C01545739j2142658p526785l574431k58595K451927M619628O251096P624686
2933B98990607R058148J0552585J2205839J4146149J6109288J7642051J8642277J9423663
2949.3D16770607K0238400K0996719K1609694K1987289K1779776K0754397J8938005
2963.6E63074887J6545951J3929010J1263549Q685648O436468M756033L980458M089474
2979.9F32761478M384458M182995L351152K144098O55651j529097n079568r997546
2996.2F30873621j4539600j5515745j0862887k363145N416095Q976043P706463K585769
$$ plain form
2888.1 526374817 513803422 501148224 488485724 475727379 462638944 448770970 433677286
2902.4 433677286 417222261 399475664 380438864 360070825 338820875 318475246 301545739
2916.6 301545739 289403081 281876296 278301865 278043270 280495197 285114825 291365921 298990607
2933 298990607 308048755 318601340 330807179 344953328 361062616 378704667 397346944 416770607
2949.3 416770607 437009007 458005726 479615420 501602709 523382485 544136882 563074887
2963.6 563074887 579620838 593549848 604813397 613499045 619935513 624691546 628672004 632761478
2979.9 632761478 637145936 641328931 644680083 646824181 647479832 645950735 640871167 630873621
2996.2 630873621 616334021 600818276 589955389 587592244 593008339 601984382 609690845 612276614
3012.5F12276614n400360j5632033k7054489l6763132l9913326l2705128j5897602
3026.8D38910544N278051K4013251L5006910L6983371L2809019K6391208K0025075
3041.1F19417429J4154196Q437514K462268l632963r224057j3774574j6816735j7309785
3057.4E83713293j3568759n129278N601228J4361858J7853320J6160667J1965096P346391
3073.7F38303816K562404k679288p107616p234514q28087R387612J7754913K0535648
3090F70694888J7954826J2702703P213831K601505o03140j778185m12226K796293N906164
3108.4G17076659P429421P363200O350279M876912L412008K203524J341284R87172
3124.7G51040459Q78989O82235M85063L58820L06785L85701M10855J96159m172j2636
$$ plain form
3012.5 612276614 606876254 591244221 564189732 527426600 487513274 454808146 438910544
3026.8 438910544 444188595 468201846 503208756 540192127 573001146 599392354 619417429
3041.1 619417429 633571625 642009139 644471407 640838444 631614387 617839813 601023078 583713293
3057.4 583713293 570144534 565015256 570616484 584978342 602831662 618992329 630957425 638303816
3073.7 638303816 640866220 638186932 631079316 623844802 623016715 632404327 650159240 670694888
3090 670694888 688649714 701352417 708566248 711167753 710564613 708786428 708374202 711170495 717076659
3108.4 717076659 724506080 731869280 738219559 743096471 746508479 748712003 750053287 751040459
3124.7 751040459 751919448 752601683 753086746 753445566 753752351 754138052 754548907 754745066 754740894 754728258
3145.1G54728258N2750J45137J67251k4975l29136n14627n13017l58462l5763L83675
3165.5G53701091O56605O35624M52816K79069J41978N3525K1339q583p3016j15991
3185.9G55744457m2796P2777N3466n8234q3864m8995l3200K1637P2241O2406N4717
3208.3G55814612M6551J9848k5868m7803K1637O1810J0907J20Q4459J60337J59383
3230.7G56305993J61469R4831m0591o2049k6106J8119J06514R7811q5711k01822r3102
3253.2G56275356j7286j55150k62022j98007j68324k13265j98662k05219l74973n72503
3273.6G53909945o96539q77262j054704j174986j326144j382053j306295j228988j192093
3291.9G43670881j229167j158238o48558M21763J747429K618492K644241K142310J573682
$$ plain form
3145.1 754728258 754781008 754926145 755093396 755068421 754739285 754224658 753711641 753353179 753317416 753701091
3165.5 753701091 754357696 754993320 755446136 755725205 755867183 755920708 755942047 755933464 755860448 755744457
3185.9 755744457 755701661 755774438 755827904 755769670 755685806 755636811 755603611 755625248 755697489 755759895 755814612
3208.3 755814612 755861163 755881011 755855143 755807340 755828977 755890787 755901694 755901814 755986273 756146610 756305993
3230.7 756305993 756467462 756562293 756521702 756459653 756433547 756451666 756558180 756655991 756570280 756368458 756275356
3253.2 756275356 756258070 756102920 755840898 755642891 755474567 755261302 755062640 754857421 754482448 753909945
3273.6 753909945 753213406 752336144 751281440 750106454 748780310 747398257 746091962 744862974 743670881
3291.9 743670881 742441714 741283476 740634918 741056681 742804110 745422602 748066843 750209153 751782835
3310.3G51782835J129329Q45551O61731M90665L65496L44634L32654J61469l5227n6028
3330.7G56023109R060J04070J81615R4652q2195j70111j55032n1618R9779P5817j43886
3353.1G55985260j84000L3439J86383R2209r0301n0605J31250M8518k69473l78012
3373.5G55504668k23875j16170j14143j32560j61648j43349m1962R7394J38164K6464
3393.9G54832983l9220L8564J05501n5552k84493j86801N2929P8201j8000r9719q8513
3416.3G54335880N1320J19269j4127j50978p1049P7784L7432m9472k2590j07646k92003
3438.8G53913820k45035r2387m5657k4796l8385o3181p0632p9333p8023p8678q3447
3461.2G53014266q7440l7193j073j65701m00185m41551k92600p2717K9683j44720l85285
$$ plain form
3310.3 751782835 752912164 753757715 754419446 754910111 755275607 755620241 755952895 756114364 756079137 756023109
3330.7 756023109 756032169 756136239 756317854 756412506 756330311 756160200 756005168 755953550 756053329 756129146 755985260
3353.1 755985260 755801260 755834699 756021082 756113291 756022990 755972385 756103635 756152153 755882680 755504668
3373.5 755504668 755280793 755164623 755050480 754917920 754756272 754612923 754570961 754668355 754806519 754832983
3393.9 754832983 754793763 754832327 754937828 754882276 754597783 754410982 754463911 754542112 754524112 754424393 754335880
3416.3 754335880 754387200 754506469 754492342 754341364 754270315 754348099 754385531 754336059 754313469 754205823 753913820
3438.8 753913820 753668785 753576398 753530741 753505945 753467560 753404379 753333747 753254414 753176391 753097713 753014266
3461.2 753014266 752926826 752889633 752888560 752722859 752322674 751881123 751588523 751515806 751545489 751400769 751015484
3483.6G51015484m03225l54767l85940l65376l09706k66254k34366k11894j97411m08292
3504G47878253o17086m80295l83436m82202n49853n43356m75645l52740k28882l30686
3524.4G43434072n69880n51105m06086l72768k69413j37448j37270M769L18646M04000
3544.8G41717517J29760n9843J13725K87652L20316L75569M89234O22988P10428Q59857
3565.2G45567203Q20994K66373p5698P5400K52009L00884L76105N05447N94736O00397
3585.6G49283850L04997k57075k81155O9440Q4221j31249k62559m34637m81725k63393
3606G47630715k25722m97282o17921p73251r87232q76069r12547j107514q28445r5844
3626.4G40708888M08053k74897q87394q25166q16405r13143j034320j102328p84874
$$ plain form
3483.6 751015484 750612259 750257492 749871552 749506176 749196470 748930216 748695850 748483956 748286545 747878253
3504 747878253 747261167 746780872 746397436 745915234 745365381 744822025 744346380 743993640 743764758 743434072
3524.4 743434072 742864192 742313087 741907001 741534233 741264820 741127372 740990102 740994871 741313517 741717517
3544.8 741717517 741847277 741787434 741901159 742188811 742509127 742884696 743373930 743996918 744707346 745567203
3565.2 745567203 746388197 746654570 746578872 746654272 746906281 747207165 747583270 748088717 748683453 749283850
3585.6 749283850 749588847 749331772 749050617 749120057 749204278 749073029 748810470 748375833 747894108 747630715
3606 747630715 747404993 746907711 746289790 745516539 744529307 743653238 742740691 741633177 740804732 740708888
3626.4 740708888 741116941 740842044 739954650 739129484 738313079 737399936 736365616 735263288 734478414
3644.8G34478414M3571P48336K53559l47138K37703R67205Q80122P38084P64370Q00908
3665.2G39565134J197398J835942J589239J260638J811802J329303N52893O84678R09269
3683.5G50736296J172185J809478J747847K88665l84927j05619J19268K30313J51574
3701.9G55765080j45793P0751P07925J025617N02109l79622n73158l12209o676J43170
3722.3G56797194J23859K3305o9976K10703Q30769J003325K98501m37618n12004R1076
3742.7G58359134N08905j11163j54912L38017j45375o58512l86000o2764k53498l60728
3763.1G57073104r7394J17898K25604o5327m54843l27527N9008J99378p6473k03550
3783.5G56449878j27435j75654k48671k70486j32859J38224J43230J46865J27495k46525
$$ plain form
3644.8 734478414 734521985 735270321 735523880 735176742 735414445 736381650 737261772 737999856 738764226 739565134
3665.2 739565134 740762532 742598474 744187713 745448351 747260153 748589456 749142349 749827027 750736296
3683.5 750736296 751908481 753717959 755465806 755754471 755369544 755263925 755383193 755613506 755765080
3701.9 755765080 755619287 755690038 756397963 757423580 757925689 757546067 756972909 756660700 756654024 756797194
3722.3 756797194 756921053 756944358 756874382 757085085 757915854 758919179 759217680 758780062 758268058 758359134
3742.7 758359134 758868039 758756876 758601964 758939981 758794606 758136094 757750094 757687330 757433832 757073104
3763.1 757073104 756975710 757093608 757319212 757253885 756799042 756471515 756530523 756729901 756653428 756449878
3783.5 756449878 756322443 756146789 755898118 755627632 755494773 755632997 755776227 755923092 756050587 755804062
3803.9G55804062j31548j36554n59211m37676J11401L33190R6440K95102J16349m56810
3824.3G55034745k88666n9068r358O3479J76430M06384L80874L2067j86264l08275
3844.6G55242348l85523k92778K25186R85980M34280o01948n58614j00851K83002P7010
3865G55308092j81854K31325K19346l27468m78566l06666R0897J19448j12236j38223
3885.4G54424095l30090r5904K67803k28345n46217p5042L47555L40998J11103l94225
3905.8G53821731p10369m69267j47104M6134K17140R7215k13445j63614M4644q7619
3926.2G52435446k26677m8160N5432j08719k43604k27749o3718Q4997M768j3411K7835
3948.7G51676440j33216k26498j33931q2910o9678n126l6300j77919k24352r9719M1425
$$ plain form
3803.9 755804062 755672514 755535960 754976749 754539073 754650474 754983664 755080104 755375206 755491555 755034745
3824.3 755034745 754746079 754687011 754677653 754741132 754917562 755323946 755704820 755736887 755550623 755242348
3844.6 755242348 754856825 754564047 754789233 755775213 756209493 755607545 755048931 754948080 755231082 755308092
3865 755308092 755126238 755357563 755576909 755249441 754770875 754464209 754555106 754674554 754562318 754424095
3885.4 754424095 754094005 753998101 754265904 754037559 753491342 753416300 753763855 754104853 754215956 753821731
3905.8 753821731 753111362 752642095 752494991 752541125 752758265 752855480 752642035 752478421 752523065 752435446
3926.2 752435446 752208769 752160609 752216041 752107322 751863718 751635969 751572251 751657248 751662016 751648605 751676440
3948.7 751676440 751543224 751316726 751182795 751099885 751030207 751025081 750988781 750810862 750586510 750486791 750528216
3971.1G50528216r000j60992k31624k20656j21176l2246r5308j76728j83046k17557
3991.5G49079883k69532l14653l59356
3997.6G48136342
$$ plain form
3971.1 750528216 750519216 750358224 750126600 749905944 749784768 749752522 749657214 749480486 749297440 749079883
3991.5 749079883 748810351 748495698 748136342
3997.6 748136342
##END=$$ End of the data block
