##TITLE=100% LG $$ Begin of the data block
##JCAMP-DX=5.00 $$ ACD/SpecManager v 10.08
##SPECTROMETER/DATA SYSTEM=Alpha
##DATE=02 Dec 2014 10:08:34
##DATA TYPE=INFRARED SPECTRUM
##DATA CLASS=XYDATA
##ORIGIN=
##OWNER=
##NPOINTS=1765
##FIRSTX=399.76428223
##LASTX=3997.64306641
##MAXX=3997.64306641
##MINX=399.76428223
##MAXY=0.85640895
##MINY=0.16984120
##XFACTOR=1.0000000000
##YFACTOR=1.000000000000000e-9
##FIRSTY=0.85533577
##DELTAX=2.03961372
##XUNITS=1/CM
##YUNITS=ARBITRARY UNITS
##XYDATA=(X++(Y..Y))
$$ plain form
399.8 855335772 856408954 855823636 854697406 854635119 855475485 856074214 855780602 854250908 852416813
418.1 852416813 852690339 853689373 854145229 854827046 855003178 854275942 853772163 853680670 853417337 853277922
438.5 853277922 853266478 852786064 851589739 850647688 850562334 850400329 849745572 848644555 847221494 846455336
458.9 846455336 846346915 845943689 845083535 844028413 843116581 842574000 842702389 843191683 843275189 842991829
479.3 842991829 842450798 842051625 842492223 843371630 843727291 843498528 843185782 842732847 842059910 841219187
499.7 841219187 840174794 838858426 837200820 835411191 833174407 829966128 825722992 820190907
516 820190907 813508213 806227386 798540413 790691853 783296466 776833355 770796239 764761448 758959889
534.4 758959889 753263652 747421622 741954684 737407863 734008372 732211709 731953204 732879937 734842837
$$ packed form
399.8H55335772J073182n85318j126230o2287Q40366N98729k93612j529694j834095
418.1H52416813K73526R99034M55856O81817J76132p27236n03779r1493k63333j39415
438.5H53277922j1444m80414j196325r42051q5354j62005o54757j101017j423061p66158
458.9H46455336j08421m03226q60154j055122r11832n42581J28389M89294Q3506k83360
479.3H42991829n41031l99173M40598Q79407L55661k28763l12746m52935o72937q40723
499.7H41219187j044393j316368j657606j789629k236784l208279m243136n532085
516H20190907o682694p280827p686973p848560p395387o463111o037116o034791n801559
534.4G58959889n696237n842030n466938m546821l399491j796663k58505R26733J962900
$$ plain form
552.7 734842837 737248540 739341259 741106510 743007660 745248318 747955739 751213670 754948795
569.1 754948795 759014666 763112068 767348111 772061944 776793718 781300128 786035657 790905058
585.4 790905058 795149267 798198044 800177157 801601589 802820921 804171920 805919170 807866693
601.7 807866693 809564710 810541630 810754418 810557663 810142577 809452236 808083355 805732608 804056108
620 804056108 805268288 808457851 811173141 812805295 813903153 814554691 814908326 815247178 815354526
638.4 815354526 814964831 814208448 813345551 812317312 811054409 809740007 808462262 806927264 804744840
656.8 804744840 801902533 798625171 795020759 791258037 786459565 780321956 775386572 770871043
673.1 770871043 766026855 761344910 756731391 751809239 745702207 736524642 721100390 693053961
$$ packed form
552.7G34842837K405703K092719J765251J901150K240658K707421L257931L735125
569.1G54948795M065871M097402M236043M713833M731774M506410M735529M869401
585.4G90905058M244209L048777J979113J424432J219332J350999J747250J947523
601.7H07866693J698017R76920K12788j96755m15086o90341j368881k350747j676500
620H04056108J212180L189563K715290J632154J097858O51538L53635L38852J07348
638.4H15354526l89695p56383q62897j028239j262903j314402j277745j534998k182424
656.8H04744840k842307l277362l604412l762722m798472o137609m935384m515529
673.1G70871043m844188m681945m613519m922152o107032r177565j5424252k8046429
$$ plain form
689.4 693053961 638395250 539128661 399538845 265468687 186241165 169841200 199111059
703.7 199111059 264164835 361599773 479624152 594273388 681599021 734150112 761118710
717.9 761118710 774292469 780063391 781827211 781542122 779327750 774287343 765304208 751911581
734.3 751911581 735253692 717659295 701111376 685289085 667122543 643747568 614592731
748.5 614592731 580113947 541003406 499483138 460584849 431602448 419344842 426818699 452306032
764.9 452306032 490295559 533765078 576915205 616930664 653411031 686452687 715357006
779.1 715357006 739390731 758559644 773178995 783961773 791933775 797881365 802267432 805561900
795.4 805561900 808298945 810676932 812538564 813801110 814636648 815288067 815854371 816363275 816865325
$$ packed form
689.4F93053961n4658711r9266589j39589816j34070158p9227522j6399965K9269859
703.7A99111059O5053776R7434938J18024379J14649236Q7325633N2551091K6968598
717.9G61118710J3173759N770922J763820k85089k214372n040407q983135j3392627
734.3G51911581j6657889j7594397j6547919j5822291j8166542k3374975k9154837
748.5F14592731l4478784l9110541m1520268l8898289k8982401j2257606P473857K5487333
764.9D52306032L7989527M3469519M3150127M0015459L6480367L3041656K8904319
779.1G15357006K4033725J9168913J4619351J0782778P972002N947590M386067L294468
795.4H05561900K737045K377987J861632J262546Q35538O51419N66304N08904N02050
$$ plain form
813.8 816865325 817368686 817758560 817944705 818060160 818255246 818426073 818311989 817645550 816216707 813737094
834.2 813737094 809856951 804859459 799789786 795700669 793316662 793013275 794561684 797336757 800772250
852.6 800772250 804251492 807146132 809189081 810444474 811062157 811230183 811128378 810871482 810460925
870.9 810460925 809860766 809175014 808502495 807831228 807047844 806033194 804821908 803400576 801675797
889.3 801675797 799642384 797079146 793327689 787454963 778089941 763101697 740580976 711396515
905.6 711396515 681315243 659993470 655407429 668255627 692343354 719466984 743570685 761944950
921.9 761944950 774496078 782418787 786998749 789251208 789992273 789681733 788426638 786393464 783918500
940.3 783918500 781139255 777900696 773872733 768418252 760552347 748898149 731420279 705945492
$$ packed form
813.8H16865325N03361L89874J86145J15455J95086J70827j14084o66439j428843k479613
834.2H13737094l880143m997492n069673m089117k384007l03387J548409K775073L435493
852.6H00772250L479242K894640K042949J255393O17683J68026j01805k56896m10557
870.9H10460925o00159o85752o72519o71267p83384j014650j211286j421332j724779
889.3H01675797k033413k563238l751457n872726r365022j4988244k2520721k9184461
905.6G11396515l0081272k1321773m586041J2848198K4087727K7123630K4103701J8374265
921.9G61944950J2551128P922709M579962K252459P41065l10540j255095k033174k474964
940.3G83918500k779245l238559m027963n454481p865905j1654198j7477870k5474787
$$ plain form
956.6 705945492 671733439 631394386 592601895 566332459 560466290 575159550 604007125 638109982
972.9 638109982 669873893 694974840 712384224 723252892 729410887 732243598 732206225 729480803
989.2 729480803 725617290 723867893 726611078 732232928 736022413 736083806 735878050 738057554 741022468
1007.6 741022468 742899179 743472159 742838085 740892649 737400115 731747031 722833157 709640801
1023.9 709640801 693678260 681874037 683401644 700360239 724475503 745202780 757923484
1038.2 757923484 763820052 765652537 765391290 764145732 762543440 760774255 758645713 756004035
1054.5 756004035 752750099 748637915 743494451 737293482 730248213 723288655 718199492 716773212
1070.8 716773212 719441712 724992692 731774151 738853991 746001005 752970994 759322345 764706135
$$ packed form
956.6G05945492l4212053m0339053l8792491k6269436n866169J4693260K8847575L4102857
972.9F38109982L1763911K5100947J7409384J0868668O157995K832711l7373k725422
989.2G29480803l863513j749397K743185N621850L789485O1393k05756K179504K964914
1007.6G41022468J876711N72980o34074j945436l492534n653084q913874j3192356
1023.9G09640801j5962541j1804223J527607J6958595K4115264K0727277J2720704
1038.2G57923484N896568J832485k61247j245558j602292j769185k128542k641678
1054.5G56004035l253936m112184n143464o200969p045269o959558n089163j426280
1070.8G16773212K668500N550980O781459P079840P147014O969989O351351N383790
$$ plain form
1087.1 764706135 768971860 772150934 774457276 776225686 777726293 779029071 780163586 781162739
1103.4 781162739 781944752 782416165 782529593 782348514 782222867 782672048 784023225 786178350 788644969
1121.8 788644969 790875733 792592049 793773174 794519126 794930279 795020401 794757009 794113278 793054402
1140.1 793054402 791476548 789048612 785076797 778359056 767819405 754855871 744526863 741812825
1156.5 741812825 746715009 754794002 761736691 766101539 768406689 769378960 769438207 768550575 766061008
1174.8 766061008 761092722 753790677 746605814 743180454 744938672 749863148 754748106 757389843
1191.1 757389843 757305861 755475640 753130078 751059830 749663591 748916566 748676360 749013007 750151038
1209.5 750151038 752160430 754711628 757281780 759455204 760970116 761722088 761817217 761418223 760563791
$$ packed form
1087.1G64706135M265725L179074K306342J768410J500607J302778J134515R99153
1103.4G81162739P82013M71413J13428j81079j25647M49181J351177K155125K466619
1121.8G88644969K230764J716316J181125P45952M11153R0122k63392o43731j058876
1140.1G93054402j577854k427936l971815o717741j0539651j2963534j0329008k714038
1156.5G41812825M902184Q078993O942689M364848K305150R72271N9247q87632k489567
1174.8G66061008m968286p302045p184863l425360J758218M924476M884958K641737
1191.1G57389843q3982j830221k345562k070248j396239p47025k40206L36647J138031
1209.5G50151038K009392K551198K570152K173424J514912P51972R5129l98994q54432
$$ plain form
1227.9 760563791 759535789 758696675 757827878 756618142 755356669 754621685 754678190 755209148 755725622
1246.2 755725622 756247044 757056832 758070946 758875847 759290278 759522915 759755313 759897947 759815156 759652674
1266.6 759652674 759558558 759331822 758670568 757570982 756188631 754598081 752835035 750897825 748783052
1285 748783052 746550262 744245768 741905034 739669561 737519443 735208750 732496619 729316652 725863874
1303.3 725863874 722512066 719571412 717069745 714859962 713004112 711882532 711684823 712250888 713028669
1321.7 713028669 713410020 713100791 712161124 711160183 710798085 711069465 711109459 710098147 707914352
1340 707914352 704991937 701626718 698244929 695390403 693248510 691749990 690755069 690216780 689767480
1358.4 689767480 689150393 688913524 689663351 690919399 692527294 694638073 697467446 702054918 708597481
$$ packed form
1227.9G60563791j028002q39114q68797j209736j261473p34984N6505N30958N16474
1246.2G55725622N21422Q09788J014114Q04901M14431K32637K32398J42634q2791j62482
1266.6G59652674r4116k26736o61254j099586j382351j590550j763046j937210k114773
1285G48783052k232790k304494k340734k235473k150118k310693k712131l179967l452778
1303.3G25863874l351808k940654k501667k209783j855850j121580j97709N66065P77781
1321.7G13028669L81351l09229r39667j000941l62098K71380L9994j011312k183795
1340G07914352k922415l365219l381789k854526k141893j498520r94921n38289m49300
1358.4F89767480o17087k36869P49827J256048J607895K110779K829373M587472O542563
$$ plain form
1376.7 708597481 716353178 724506378 731778562 737435222 742475808 747549534 751682818 754629374
1393.1 754629374 756985128 758704662 759630263 760091960 760269821 760662675 761026025 760207415 757480800
1411.4 757480800 752712786 746170819 739296079 734918594 732578456 728497684 721248209 710088253
1427.7 710088253 692892373 671526372 649364233 623586535 595570326 570726931 543382704
1442 543382704 509352446 468575835 419757754 368842542 332544625 337618083 421229899 556774914
1458.3 556774914 638093114 675927460 700155735 715189457 720902681 721385956 724542797 734660208
1474.7 734660208 744104862 747436643 744038522 733426511 713652313 677661717 607716739 506284416
1491 506284416 434915185 443181157 538040400 648408175 712044537 739740968 751875222 760308921
$$ packed form
1376.7G08597481P755697Q153200P272184N656660N040586N073726M133284K946556
1393.1G54629374K355754J719534R25601M61697J77861L92854L63350q18610k726615
1411.4G57480800m768014o541967o874740m377485k340138m080772p249475j1159956
1427.7G10088253j7195880k1366001k2162139k5777698k8016209k4843395k7344227
1442E43382704l4030258m0776611m8818081n0915212l6297917N073458Q3611816J35545015
1458.3E56774914Q1318200L7834346K4228275J5033722N713224M83275L156841J0117411
1474.7G34660208R444654L331781l398121j0612011j9774198l5990596o9944978j01432323
1491E06284416p1369231Q265972R4859243J10367775O3636362K7696431J2134254Q433699
$$ plain form
1507.3 760308921 766665876 770073354 771408916 771335006 770859182 770435870 770205021 770856977 771542549
1525.6 771542549 771971881 771869838 770668566 769137740 767822087 765198529 761150002 759430170 759526908
1544 759526908 758979678 756347120 750633419 741910696 731647909 724453211 729156554 746683776
1560.3 746683776 757877827 763545990 767003238 768604517 769323885 768823802 765480816 758138001
1576.6 758138001 746818841 732281506 721404314 723946095 736313522 745895326 746524036 738938749
1593 738938749 723223984 697193205 663710833 637875319 638380826 665116251 699641407 726615250
1609.3 726615250 742015064 748989046 751973867 754383385 756197274 756403506 755828857 754998863 752832234
1627.6 752832234 748206377 740216672 725446284 700863063 684024453 687772453 704336584 723058164
$$ packed form
1507.3G60308921O356955L407478J335562p3910m75824m23312k30849O51956O85572
1525.6G71542549M29332j02043j201272j530826j315653k623558m048527j719832R6738
1544G59526908n47230k632558n713701q722723j0262787p194698M703343J7527222
1560.3G46683776J1194051N668163L457248J601279P19368n00083l342986p342815
1576.6G58138001j1319160j4537335j0877192K541781J2367427R581804O28710p585287
1593G38938749j5714765k6030779l3482372k5835514N05507K6735425L4525156K6973843
1609.3G26615250J5399814O973982K984821K409518J813889K06232n74649q29994k166629
1627.6G52832234m625857p989705j4770388k4583221j6838610L748000J6564131J8721580
$$ plain form
1643.9 723058164 739007771 750591338 755436540 756173849 757878363 760634542 761612952 760803640
1660.3 760803640 759146452 757870555 756637394 755255759 755483925 757207870 759316981 761985838
1676.6 761985838 764146924 764986575 765217245 767627418 771442533 773930609 775483489 775811553 774765849
1694.9 774765849 773654938 773892939 776115119 778368115 779565454 780796945 781833708 781887472 780793071
1713.3 780793071 778970778 778131664 779258370 780250490 780252934 779796302 778929770 777492404 775606215
1731.7 775606215 774112284 774158955 774215817 773612142 773114383 772644937 771759629 770637155 770207822 770974755
1752 770974755 771766782 772165000 772738457 773484468 774718344 776332200 777301431 777428150 777092218 777412057
1772.4 777412057 778968632 780461252 781393111 782264829 783216119 783900738 784078956 783308804 781449139
$$ packed form
1643.9G23058164J5949607J1583567M845202P37309J704514K756179R78410q09312
1660.3G60803640j657188j275897j233161j381635K28166J723945K109111K668857
1676.6G61985838K161086Q39651K30670K410173L815115K488076J552880L28064j045704
1694.9G74765849j110911K38001K222180K252996J197339J231491J036763N3764j094401
1713.3G80793071j822293q39114J126706R92120K444m56632q66532j437366j886189
1731.7G75606215j493931M6671N6862o03675m97759m69446q85308j122474m29333P66933
1752G70974755P92027L98218N73457P46011J233876J613856R69231J26719l35932L19839
1772.4G77412057J556575J492620R31859Q71718R51290O84619J78218p70152j859665
$$ plain form
1790.8 781449139 779583812 778302789 776546359 773973465 771452188 769693792 768377602 767119408
1807.1 767119408 766086698 765763283 766181588 766771138 767408490 768272400 769113421 769813120 770772934
1825.5 770772934 771951020 773524821 775883019 778094590 779699266 781108439 782235026 782623231
1841.8 782623231 782801449 783692598 784771383 785414398 785552621 785237730 784544826 783481777 782077074
1860.2 782077074 780286670 777879894 774732351 771466196 769207597 767796397 766516984 765446424
1876.5 765446424 764839768 764695406 764938056 765449703 766000986 766639829 767746866 769096315 770427763
1894.8 770427763 771939874 773562551 775143921 776695073 778134406 779334545 780416548 781522155
1911.1 781522155 782438338 782856226 782930434 783027589 783005595 782817602 782570899 782041490 781151116 779968083
$$ packed form
1790.8G81449139j865327j281023j756430k572894k521277j758396j316190j258194
1807.1G67119408j032710l23415M18305N89550O37352Q63910Q41021O99699R59814
1825.5G70772934J178086J573801K358198K211571J604676J409173J126587L88205
1841.8G82623231J78218Q91149J078785O43015J38223l14891o92904j063049j404703
1860.2G82077074j790404k406776l147543l266155k258599j411200j279413j070560
1876.5G65446424o06656j44362K42650N11647N51283O38843J107037J349449J331448
1894.8G70427763J512111J622677J581370J551152J439333J200139J082003J105607
1911.1G81522155R16183M17888P4208R7155k1994j87993k46703n29409q90374j183033
$$ plain form
1931.5 779968083 778460205 776559114 774208188 771368206 768227339 765421212 763270795 761580884
1947.9 761580884 760379791 759816706 759887874 760490298 761462748 762665570 763998091 765287519 766541660
1966.2 766541660 767992616 769583106 771085739 772505760 773886859 775178373 776274264 777142406
1982.5 777142406 777861953 778551400 779357672 780395627 781709909 783070087 784166098 784965456 785557330
2000.9 785557330 786011994 786356211 786609232 786799252 786924183 786970973 786940157 786970556 787181854 787426651
2021.3 787426651 787566900 787615597 787624121 787639201 787667572 787715733 787775218 787773788 787738919 787778556 787858307 787920773
2045.8 787920773 787978709 788024545 788056195 788069844 788048923 787995160 787941635 787887633 787812114 787780643 787789702 787748992
2070.2 787748992 787688315 787668288 787654221 787608206 787566125 787577629 787580967 787505269 787419498 787374616 787349463 787316799
$$ packed form
1931.5G79968083j507878j901091k350926k839982l140867k806127k150417j689911
1947.9G61580884j201093n63085P1168O02424R72450J202822J332521J289428J254141
1966.2G66541660J450956J590490J502633J420021J381099J291514J095891Q68142
1982.5G77142406P19547O89447Q06272J037955J314282J360178J096011P99358N91874
2000.9G85557330M54664L44217K53021J90020J24931M6790l0816L0399K11298K44797
2021.3G87426651J40249M8697Q524J5080K8371M8161N9485j430l4869L9637P9751O2466
2045.8G87920773N7936M5836L1650J3649k0921n3763n3525n4002p5519l1471R059m0710
2070.2G87748992o0677k0027j4067m6015m2081J1504L338p5698q5771m4882k5153l2664
$$ plain form
2094.7 787316799 787250221 787174940 787122607 787075400 787019551 786948800 786876619 786807537 786721170 786660969 786625683
2117.1 786625683 786545157 786443830 786368608 786295772 786227584 786188126 786131918 786030769 785927415 785851240 785782397
2139.6 785782397 785684228 785557628 785461068 785414815 785344899 785211205 785093904 785048008 785001457 784884512 784695685
2162 784695685 784516335 784421742 784338057 784186542 783988357 783736944 783365309 782800257 782043278 781256616
2182.4 781256616 780670047 780446529 780581892 780886650 781181216 781417429 781581521 781591952 781412482 781114459
2202.8 781114459 780737936 780271590 779738605 779233396 778791189 778229177 777310848 775871038 773611963
2221.2 773611963 769743025 762577772 749168873 725948691 692100823 653793156 623393714 612046421
2237.5 612046421 622331202 647954583 679192722 708165228 730918109 746922493 757472694
$$ packed form
2094.7G87316799o6578p5281n2333m7207n5849p0751p2181o9082q6367o0201l5286
2117.1G86625683q0526j01327p5222p2836o8188l9458n6208j01149j03354p6175o8843
2139.6G85782397r8169j26600r6560m6253o9916j33694j17301m5896m6551j16945j88827
2162G84695685j79350r4593q3685j51515j98185k51413l71635n65052p56979p86662
2182.4G81256616n86569k23518J35363L04758K94566K36213J64092J0431j79470k98023
2202.8G81114459l76523m66346n32985n05209m42207n62012r18329j439810k259075
2221.2G73611963l868938p165253j3408899k3220182l3847868l8307667l0399442j1347293
2237.5F12046421J0284781K5623381L1238139K8972506K2752881J6004384J0550201
$$ plain form
2251.8 757472694 764194965 768413246 771122456 772977054 774311543 775299668 776061296 776706100 777293622
2270.1 777293622 777769566 778095603 778339982 778559804 778748930 778872788 778910935 778880119 778769732 778570831
2290.5 778570831 778355062 778188050 778062463 777943790 777807117 777639747 777356446 776837289 776160598 775534451
2310.9 775534451 775076449 774829209 774810314 774995089 775264204 775459886 775499046 775320292 774906635 774270833
2331.3 774270833 773318648 772104740 770979464 770330071 770395517 771216154 772494912 773484170 773855567
2349.7 773855567 773922682 773913920 773730516 773449838 773324132 773402870 773632228 773978055 774426520 774984539
2370.1 774984539 775561452 775970459 776188612 776369750 776582062 776767135 776889622 776962698 776988029 776974738
2390.4 776974738 776944697 776892662 776816487 776757240 776732743 776707768 776686847 776688457 776690125 776708424 776762784 776802540
$$ packed form
2251.8G57472694O722271M218281K709210J854598J334489R88125P61628O44804N87522
2270.1G77293622M75944L26037K44379K19822J89126J23858L8147l0816j10387j98901
2290.5G78570831k15769j67012j25587j18673j36673j67370k83301n19157o76691o26147
2310.9G75534451m58002k47240j8895J84775K69115J95682L9160j78754m13657o35802
2331.3G74270833r52185j213908j125276o49393O5446Q20637J278758R89258L71397
2349.7G73855567O7115q762j83404k80678j25706P8738K29358L45827M48465N58019
2370.1G74984539N76913M09007K18153J81138K12312J85073J22487P3076K5331j3291
2390.4G76974738l0041n2035p6175n9247k4497k4975k0921J610J668J8299N4360L9756
$$ plain form
2414.9 776802540 776808798 776818633 776800990 776720703 776638448 776588023 776540577 776478708 776404142 776326180 776271820 776244044
2439.4 776244044 776190281 776095390 775997281 775928020 775882959 775832772 775783122 775782943 775816023 775791883 775722563 775679588
2463.9 775679588 775644124 775570035 775470078 775381863 775298119 775164187 774952888 774713039 774490237 774273515
2484.3 774273515 774051368 773872316 773768961 773662388 773472905 773255110 773059249 772861242 772679269 772518873
2504.7 772518873 772336602 772110403 771882415 771701634 771556973 771438003 771366656 771367311 771426916 771498740 771561027
2527.1 771561027 771620214 771679521 771738112 771786451 771801651 771742404 771612465 771468043 771329701 771216989 771163702
2549.5 771163702 771177232 771224618 771263719 771312118 771385074 771419525 771393418 771381438 771405220 771426797 771370828
2572 771370828 771151423 770813167 770463347 770187795 770082235 770168960 770341933 770469546 770490766 770367146
$$ packed form
2414.9G76802540O258R835j7643q0287q2255n0425m7446o1869p4566p7962n4360k7776
2439.4G76244044n3763r4891r8109o9261m5061n0187m9650j79L3080k4140o9320m2975
2463.9G75679588l5464p4089r9957q8215q3744j33932k11299k39849k22802k16722
2484.3G74273515k22147j79052j03355j06573j89483k17795j95861j98007j81973j60396
2504.7G72518873j82271k26199k27988j80781j44661j18970p1347O55N9605P1824O2287
2527.1G71561027N9187N9307N8591M8339J5200n9247j29939j44422j38342j12712n3287
2549.5G71163702J3530M7386L9101M8399P2956L4451k6107j1980K3782K1577n5969
2572G71370828k19405l38256l49820k75552j05560Q6725J72973J27613K1220j23620
$$ plain form
2592.4 770367146 770058990 769586682 769020975 768490016 768115520 767929435 767944753 768122733 768355787 768570185
2612.8 768570185 768709183 768731058 768620193 768374979 768033028 767612278 767097294 766502500 765880883 765337527
2633.2 765337527 764999330 764955699 765166342 765465558 765703380 765795469 765787601 765786409 765777647 765731573 765666962
2655.6 765666962 765576184 765466034 765348196 765210629 765038073 764807284 764564276 764395595 764296055 764240563
2676 764240563 764244616 764319897 764461219 764581740 764598727 764579952 764574647 764560819 764580905 764650166 764671922 764624417
2700.5 764624417 764578521 764542520 764527380 764486551 764358699 764209628 764106631 764065444 764039218 763971329 763872385
2722.9 763872385 763750315 763636947 763574481 763534248 763509691 763521612 763534606 763528347 763534248 763582170 763624489
2745.3 763624489 763556838 763378561 763180673 762971580 762708008 762404919 762097120 761783838 761450946 761073947
$$ packed form
2592.4G70367146l08156m72308n65707n30959l74496j86085J5318J77980K33054K14398
2612.8G68570185J38998K1875j10865k45214l41951m20750n14984n94794o21617n43356
2633.2G65337527l38197m3631K10643K99216K37822R2089p868j192q762m6074o4611
2655.6G65666962r0778j10150j17838j37567j72556k30789k43008j68681r9540n5492
2676G64240563M053P5281J41322J20521J6987j8775n305j3828K0086O9261K1756m7505
2700.5G64624417m5896l6001j5140m0829j27852j49071j02997m1187k6226o7889r8944
2722.9G63872385j22070j13368o2466m0233k4557J1921J2994o259N901M7922M2319
2745.3G63624489o7651j78277j97888k09093k63572l03089l07799l13282l32892l76999
$$ plain form
2765.7 761073947 760622919 760086775 759442627 758682132 757849693 757008314 756187081 755378425 754617512 753937423
2786.1 753937423 753252029 752452552 751568615 750686228 749837756 748970211 747997403 746903300 745725274
2804.5 745725274 744489133 743133247 741540313 739650071 737414837 734690726 731252789 726784348
2820.8 726784348 720882714 713142455 703155875 690581024 675361156 657854378 638742685 618579328
2837.1 618579328 597553670 575903535 553849399 531575561 511537552 500056505 501468778
2851.4 501468778 511859357 524261355 535936654 547262847 558494866 569262087 578956604
2865.7 578956604 586840808 592386007 595425785 595958769 594030082 589634538 582827091 573961079
2882 573961079 563542843 552014291 539853096 527468503 515006661 502415955 489574134 476265550
$$ packed form
2765.7G61073947m51028n36144o44148p60495q32439q41379q21233q08656p60913o80089
2786.1G53937423o85394p99477q83937q82387q48472q67545r72808j094103j178026
2804.5G45725274j236141j355886j592934j890242k235234k724111l437937m468441
2820.8G26784348n901634p740259r986580j2574851j5219868j7506778j9111693k0163357
2837.1F18579328k1025658k1650135k2054136k2273838k0038009j1481047J412273
2851.4E01468778J0390579J2401998J1675299J1326193J1232019J0767221R694517
2865.7E78956604P884204N545199L039778N32984j928687m395544o807447q866012
2882E73961079j0418236j1528552j2161195j2384593j2461842j2590706j2841821j3308584
$$ plain form
2898.3 476265550 462191045 447033823 430498034 412350625 392128736 368916154 343182743
2912.6 343182743 319598764 304002970 297072440 295437276 296733379 300280750 305688858 312424928
2928.9 312424928 320064664 328687847 338663936 350219041 363496244 378584564 395276845 413050354
2945.2 413050354 431291580 449635059 468037099 486585587 505545676 525113523 544911444
2959.5 544911444 563996792 581314147 596188664 608385980 617961824 625196636 630458951 634248137
2975.8 634248137 637359679 640632212 644262195 647739947 650536656 652395546 653091133 651966989
2992.1 651966989 647682548 638934433 626064718 612319112 602714241 600562394 605214655 613116026
3008.4 613116026 620185435 623111427 619421363 607054114 584658384 553402305 518934786 490603596
$$ packed form
2898.3D76265550j4074505j5157222j6535789j8147409k0221889k3212582k5733411
2912.6C43182743k3583979j5595794o930530j635164J296103L547371N408108O736070
2928.9C12424928P639736Q623183R976089J1555105J3277203J5088320J6692281J7773509
2945.2D13050354J8241226J8343479J8402040J8548488J8960089J9567847J9797921
2959.5E44911444J9085348J7317355J4874517J2197316R575844P234812N262315L789186
2975.8F34248137L111542L272533L629983L477752K796709J858890O95587j124144
2992.1F51966989m284441q748115j2869715j3745606r604871k151847M652261P901371
3008.4F13116026P069409K925992l690064j2367249k2395730l1256079l4467519k8331190
$$ plain form
3024.7 490603596 477186948 482595831 504538894 536094010 569280207 598662496 622286618
3039 622286618 640230179 652939439 660555005 662904680 659899235 651949227 639987230 625292182
3055.3 625292182 610052645 598064005 593474209 598143935 610207200 625094593 638435006 648265004
3071.7 648265004 654406309 656713545 654765129 649321795 644028068 644299984 653246880 669189990
3088 669189990 687228680 702787220 713712156 719875157 722087741 721614540 720252991 720158875 722751796
3106.3 722751796 727861047 734176040 740389109 745705843 749737442 752524793 754386187 755620062
3122.6 755620062 756491423 757211030 757789910 758166790 758482873 758898258 759328961 759599328 759691000 759745777
3143 759745777 759846509 759953260 760039210 760068893 759942353 759635985 759232283 758850634 758609891 758605719 758869708
$$ packed form
3024.7D90603596j3416648N408883K1943063L1555116L3186197K9382289K3624122
3039F22286618J7943561J2709260P615566K349675l005445p950008j1961997j4695048
3055.3F25292182j5239537j1988640m589796M669726J2063265J4887393J3340413R829998
3071.7F48265004O141305K307236j948416n443334n293727K71916Q946896J5943110
3088F69189990J8038690J5558540J0924936O163001K212584m73201j361549r4116K592921
3106.3G22751796N109251O314993O213069N316734M031599K787351J861394J233875
3122.6G55620062Q71361P19607N78880L76880L16083M15385M30703K70367R1672N4777
3143G59745777J00732J06751Q5950K9683j26540l06368m03702l81649k40743m172K63989
$$ plain form
3165.5 758869708 759320259 759834528 760248959 760432243 760445833 760420084 760379195 760281682 760131299 760006487
3185.9 760006487 759946406 759915113 759867430 759800851 759756446 759707272 759636283 759621024 759698451 759814560 759891152
3208.3 759891152 759897292 759872198 759895325 759947479 759986222 760086536 760260463 760412633 760493994 760554552 760677457
3230.7 760677457 760803759 760778904 760671854 760621727 760582626 760537922 760507286 760446668 760329783 760163724 760016084
3253.2 760016084 759892642 759667933 759360731 759050965 758671939 758244932 757878244 757474184 756780803 755764246
3273.6 755764246 754639208 753468573 752079129 750313759 748082995 745325148 741919696 737511337
3289.9 737511337 731686592 724455655 716949284 711703360 711320579 716368973 724814951 733699143
3306.2 733699143 741132379 746584535 750367939 753064096 754987240 756323576 757276356 757975340 758519888
$$ packed form
3165.5G58869708M50551N14269M14431J83284J3590k5749m0889r7513j50383j24812
3185.9G60006487o0081l1293m7683o6579m4405m9174p0989j5259P7427J16109P6592
3208.3G59891152O140k5094K3127N2154L8743J00314J73927J52170Q1361O0558J22905
3230.7G60677457J26302k4855j07050n0127l9101m4704l0636o0618j16885j66059j47640
3253.2G60016084j23442k24709l07202l09766l79026m27007l66688m04060o93381j016557
3273.6G55764246j125038j170635j389444j765370k230764k757847l405452m408359
3289.9G37511337n824745p230937p506371n245924l82781N048394Q445978Q884192
3306.2G33699143P433236N452156L783404K696157J923144J336336R52780O98984N44548
$$ plain form
3324.6 758519888 758901298 759090781 759179413 759260118 759405494 759629726 759756565 759727776 759703219 759699702 759712338
3347 759712338 759762287 759724259 759534478 759358585 759365082 759441316 759412408 759298146 759214520 759184062 759025335
3369.4 759025335 758696318 758464515 758392513 758334041 758220434 757985234 757713795 757591069 757591248 757571518 757509708
3391.9 757509708 757474303 757553160 757797003 758009493 757975519 757840455 757819891 757879794 757916331 757897556 757793009
3414.3 757793009 757638693 757545531 757579088 757678926 757728398 757752657 757780850 757788718 757824600 757830620 757679641
3436.7 757679641 757415295 757190585 757056475 756979525 757027745 757176757 757260203 757262111 757189989 757052243 756921887
3459.2 756921887 756795585 756683946 756660283 756631613 756423712 756078184 755752087 755543232 755405188 755190730
3479.6 755190730 754910707 754695773 754519105 754300296 754086435 753836632 753471851 753085732 752740800 752345026
$$ packed form
3324.6G58519888L81410J89483Q8632Q0705J45376K24232J26839k8789k4557l517J2636
3347G59712338M9949l8028j89781j75893O497P6234k8908j14262q3626l0458j58727
3369.4G59025335l29017k31803p2002n8472j13607k35200k71439j22726J79j9730o1810
3391.9G57509708l5405P8857K43843K12490l3974j35064k0564N9903L6537j8775j04547
3414.3G57793009j54316r3162L3557R9838M9472K4259K8193P868L5882O020j50979
3436.7G57679641k64346k24710j34110p6950M8220J49012Q3446J908p2122j37746j30356
3459.2G56921887j26302j11639k3663k8670k07901l45528l26097k08855j38044k14458
3479.6G55190730k80023k14934j76668k18809k13861k49803l64781l86119l44932l95774
$$ plain form
3500 752345026 751870990 751407802 750971079 750588238 750382125 750264883 749966502 749445438 748849630 748241007
3520.4 748241007 747624874 747001648 746406734 746038139 745947003 745899498 745786726 745655775 745545030 745419443
3540.8 745419443 745173156 744902968 744916022 745138347 745381892 745813370 746384680 746801972 747007966 746988535
3561.1 746988535 746577621 746098399 746615529 748047054 749097526 749562383 749843836 750129640 750436306
3579.5 750436306 750591099 750295818 749666095 749634624 750348210 750665843 750474513 750339270 750264287 750100493
3599.9 750100493 749886751 749396145 748490989 747617662 746989369 746285379 745493770 744580269 743790448 743698657
3620.3 743698657 743752182 742976665 741451859 740570366 741122663 741633058 741577387 741166294 740403831 739335716
3640.7 739335716 737862051 735703409 733231783 732335985 733924448 735522389 736519694 737901747 739416599
$$ packed form
3500G52345026m74036m63188m36723l82841k06113j17242k98381n21064n95808o08623
3520.4G48241007o16133o23226n94914l68595r1136m7505j12772j30951j10745j25587
3540.8G45419443k46287k70188J3054K22325K43545M31478N71310M17292K05994j9431
3561.1G46988535m10914m79222N17130J431525J050472M64857K81453K85804L06666
3579.5G50436306J54793k95281o29723l1471P13586L17633j91330j35243p4983j63794
3599.9G50100493k13742m90606r05156q73327o28293p03990p91609r13501p89821r1791
3620.3G43698657N3525p75517j524806q81493N52297N10395n5671m11093p62463j068115
3640.7G39335716j473665k158642k471626q95798J588463J597941R97305J382053J514852
$$ plain form
3659 739416599 740506351 741179824 741266191 740808308 740691781 741241574 741732836 743083477 745665133 748045683
3679.4 748045683 749878645 750904381 750950158 750724673 751474738 753092110 754398942 755003154 755019724
3697.8 755019724 754794717 754871607 755166233 754926085 753957212 753145993 753768563 755070090 755586445 755236149
3718.2 755236149 754601955 754184484 754219055 754675388 754842460 754029453 752585053 752059519 753238559
3736.5 753238559 754360020 754089057 753066123 752569377 752370894 751832187 752069533 753459871 754373074
3754.9 754373074 754490077 754717350 755212069 755302370 754999340 754683197 754699230 755204320 755692720 755631983
3775.3 755631983 755153835 754933417 755115211 755237162 755357206 755577028 755642831 755328357 754572332 753600001
3795.7 753600001 752555192 751678884 751637876 752104580 752543509 753173590 753570795 753189385 752228737 751319647
$$ packed form
3659G39416599J089752O73473Q6367m57883j16527N49793M91262J350641K581656K380550
3679.4G48045683J832962J025736M5777k25485P50065J617372J306832O04212J6570
3697.8G55019724k25007P6890K94626k40148r68873q11219O22570J301527N16355l50296
3718.2G55236149o34194m17471L4571M56333J67072q13007j444400n25534J179040
3736.5G53238559J121461k70963j022934m96746j98483n38707K37346J390338R13203
3754.9G54373074J17003K27273M94719R0301l03030l16143J6033N05090M88400o0737
3775.3G55631983m78148k20418J81794J21951J20044K19822O5803l14474p56025r72331
3795.7G53600001j044809q76308m1008M66704M38929O30081L97205l81410r60648r09090
$$ plain form
3816.1 751319647 750528932 750167906 750919521 751803756 752063453 751952052 751752079 751461625 750827909 750080884
3836.5 750080884 749990761 750738084 751804769 752703130 752865732 751819670 749825656 748760819 750268877
3854.8 750268877 751913309 752371013 751971960 751391113 751130223 750877500 750715137 751012146 751556098
3873.2 751556098 751943886 751762092 751322925 751185656 751306176 751624346 751780272 751516283 751444221 751713276
3893.6 751713276 751505077 750647306 749748886 749338925 749679506 750689864 751660943 752019823 751763284
3912 751763284 751152813 750581503 750465333 750626743 750636697 750569403 750531435 750292957 749956787 750118554 750687063
3934.4 750687063 750984311 750865400 750475645 750103593 749960601 749862373 749893606 750223696 750533164 750568986
3954.8 750568986 750370264 750124276 750039577 750092983 750104487 750022173 749892414 749671698 749399364 749214470
$$ packed form
3816.1G51319647p90715l61026P51615Q84235K59697j11401j99973k90454o33716p47025
3836.5G50080884r0123P47323J066685Q98361J62602j046062j994014j064837J508058
3854.8G50268877J644432M57704l99053n80847k60890k52723j62363K97009N43952
3873.2G51556098L87788j81794m39167j37269J20520L18170J55926k63989p2062K69055
3893.6G51713276k08199q57771q98420m09961L40581J010358R71079L58880k56539
3912G51763284o10471n71310j16170J61410R954o7294l7968k38478l36170J61767N68509
3934.4G50687063K97248j18911l89755l72052j42992r8228L1233L30090L09468L5822
3954.8G50568986j98722k45988q4699N3406J1504q2314j29759k20716k72334j84894
$$ plain form
3975.2 749214470 749124110 749089301 749144912 749263585 749304593 749175727 748937130 748741865 748477161 747963548
3995.6 747963548 747468114
3997.6 747468114
$$ packed form
3975.2G49214470r0360l4809N5611J18673M1008j28866k38597j95265k64704n13613
3995.6G47963548m95434
3997.6G47468114
##END=$$ End of the data block
