##TITLE=1-5M-14 $$ Begin of the data block
##JCAMP-DX=5.00 $$ ACD/SpecManager v 10.08
##SPECTROMETER/DATA SYSTEM=Alpha
##DATE=02 Jun 2015 08:56:44
##DATA TYPE=INFRARED SPECTRUM
##DATA CLASS=XYDATA
##ORIGIN=
##OWNER=
##NPOINTS=1765
##FIRSTX=399.76428223
##LASTX=3997.64306641
##MAXX=3997.64306641
##MINX=399.76428223
##MAXY=0.78889978
##MINY=0.37804475
##XFACTOR=1.0000000000
##YFACTOR=1.000000000000000e-9
##FIRSTY=0.78675628
##DELTAX=2.03961372
##XUNITS=1/CM
##YUNITS=ARBITRARY UNITS
##XYDATA=(X++(Y..Y))
399.8G86756277N38528J5795o28769m99845k46465j67727l25203j090169j578689o54518
420.2G82119215J26302O3300o2406l32832l10541j54972m69625o21259o96063j110613
440.6G78550506q88288l25263m09007k36332J50859J13845J60157L43740L76940L70741
461G78207898L59178J7404k62379j42992k10285j63078K10404J18732k05934j63912
481.3G77765036o7354m4584N9784k4021k00629j29462k8371j97053m90070n57065l37362
503.8G75748849k08914k67148l07978l48568m29689n23866n13374k84851p9095k01881
524.2G72583485l46184k57492k87950l84271l45886k61903k93076m06563l07083k40088
544.6G69452989l60846k63155j26779k51174k38240j68025m58002n61655l14236l44157
$$ y = [786756277, 787294805, 787310600, 786681831, 786181986, 785935521, 785767794, 785442591, 784352422, 782773733, 782119215, 782245517, 782308817, 782246411, 781913579, 781603038, 781448066, 780978441, 780357182, 779661119, 778550506, 777662218, 777336955, 776927948, 776691616, 776842475, 776956320, 777116477, 777460217, 777837157, 778207898, 778567076, 778584480, 778322101, 778179109, 777968824, 777805746, 778016150, 778134882, 777928948, 777765036, 777697682, 777653098, 777712882, 777688861, 777488232, 777358770, 777330399, 777133346, 776643276, 776086211, 775748849, 775539935, 775272787, 774964809, 774616241, 774186552, 773662686, 773149312, 772864461, 772785366, 772583485, 772237301, 771979809, 771691859, 771307588, 770961702, 770699799, 770406723, 770000160, 769693077, 769452989, 769092143, 768828988, 768702209, 768451035, 768212795, 768044770, 767586768, 767025113, 766710877, 766366720]
565G66366720m53472k79427k34723l83854k84492j58906k52307j21653P2241l5405
585.4G64234722L2723J49488j44899k04027Q4341k4795k70725j25825P7545J09017
605.8G63917565J92643J17421j88411j85251j02937j38700K13802N41329M58539N01454
626.2G65327454O39498M34637K02298K75791L16381K26379K91228L55840L04758L09170
646.6G68683434K96473K72691M22955O48916O82592N67794M55201M07695K13862l20077
667G72331536J1861J032353Q27193M11451L90231L74258L17395L64303L24547K26439
687.3G76611567L41236M08888K39253J59681J87039J45674J41680J60218N0485N9485
707.7G78505206K25723K43544K07425K22206R8228j5259J71006L09229J76430J51992
$$ y = [766366720, 765913248, 765633821, 765399098, 765015244, 764730752, 764571846, 764319539, 764197886, 764270127, 764234722, 764267445, 764416933, 764272034, 764068007, 764152348, 764127553, 763856828, 763731003, 763808548, 763917565, 764110208, 764227629, 764039218, 763853967, 763751030, 763612330, 763826132, 764367461, 764826000, 765327454, 765966952, 766401589, 766603887, 766879678, 767196059, 767422438, 767713666, 768069506, 768374264, 768683434, 768979907, 769252598, 769675553, 770324469, 771007061, 771574855, 772030056, 772437751, 772651613, 772331536, 772343397, 773375750, 774202943, 774614394, 775004625, 775378883, 775696278, 776060581, 776385128, 776611567, 776952803, 777361691, 777600944, 777760625, 777947664, 778093338, 778235018, 778395236, 778445721, 778505206, 778730929, 778974473, 779181898, 779404104, 779502332, 779487073, 779658079, 779967308, 780143738, 780295730]
728.1G80295730K04086P3135J3470J21296R9599m708Q2314J83403P2837L2902J36673
750.6G81310737J23322P7844J38342J73867J71065K11835K11775J19091P4684J08957
771G82721519P7546N0306J39356K08974K20418K48313K18391J55866J65225J88946
791.4G84394860J92166J89423K01822K01225J60098K03371K84672K46882K57731L57926
811.8G86690176K88724J79291K26498K37226J98424K52426K54154J25945Q0824J04904
832.2G88638592K8848j7762N7221R4652M7207K8610K0683j1742Q225N245n2571l0637
856.6G88816571Q524n8472j39595j38640j03235p0334p7665j52230j72674p8261K0265
879.1G87854254L9041n7518j79351k03013k10047k51651k21729j56998j82629k06232
$$ y = [780295730, 780499816, 780572951, 780586421, 780707717, 780807316, 780802608, 780884922, 781068325, 781141162, 781174064, 781310737, 781434059, 781511903, 781650245, 781824112, 781995177, 782207012, 782418787, 782537878, 782612562, 782721519, 782799065, 782849371, 782988727, 783197701, 783418119, 783666432, 783884823, 784040689, 784205914, 784394860, 784587026, 784776449, 784978271, 785179496, 785339594, 785542965, 785827637, 786074519, 786332250, 786690176, 786978900, 787158191, 787384689, 787621915, 787820339, 788072765, 788326919, 788452864, 788533688, 788638592, 788667440, 788649678, 788706899, 788801551, 788848758, 788877368, 788898051, 788886309, 788894534, 788899779, 788847208, 788816571, 788825095, 788766623, 788627028, 788488388, 788385153, 788314819, 788237154, 788084924, 787912250, 787833989, 787854254, 787893295, 787835777, 787656426, 787453413, 787243366, 786991715, 786769986, 786612988, 786430359, 786224127]
899.5G86224127j54615j65045k31564k65837l08692l46959l25799l21209l81529l62039
919.9G83360839k57075k40982k52723j58072r3817j61767j65284r5785j29461j66714
940.3G81639159j53184k13206k93672k89857l08276l91423m18961m51744n53131n69165
960.7G77996540m91917m99368n82754o29783o84559p51019p35402o87778o97136o90222
981.1G71546602o20603n97895o17444o02126o13153o71685o95765o99997p63953q12768
1001.4G64851213p77960p77066q30174q11755p54357p35640o44684m32730k19166n8413
1021.8G58809268K1518l2425r9600r5307j80602l38555l58045k69949k60830l05713
1042.2G56889760l22163l88980m36365l78668l68178m16160l94046l45111l33250k92003
$$ y = [786224127, 786069512, 785904467, 785672903, 785407066, 785098374, 784751415, 784425616, 784104407, 783722878, 783360839, 783103764, 782862782, 782610059, 782451987, 782358170, 782196403, 782031119, 781935334, 781805873, 781639159, 781485975, 781272769, 780979097, 780689240, 780380964, 779989541, 779570580, 779118836, 778565705, 777996540, 777504623, 777005255, 776422501, 775792718, 775108159, 774357140, 773621738, 772933960, 772236824, 771546602, 770925999, 770328104, 769710660, 769108534, 768495381, 767823696, 767127931, 766427934, 765663981, 764851213, 764073253, 763296187, 762466013, 761654258, 760899901, 760164261, 759519577, 759086847, 758867681, 758809268, 758830786, 758798361, 758698761, 758603454, 758422852, 758084297, 757726252, 757456303, 757195473, 756889760, 756567597, 756178617, 755742252, 755363584, 754995406, 754579246, 754185200, 753840089, 753506839, 753214836]
1062.6G53214836k14934j87695k29478k83659l28958l83794l87788l27825l20018l49760
1083G50200927l24487l10719l54171l61681l47913l90768m09126l75390m08530m88579
1103.4G46429563m93706m58002m50611l99887k61069j33097n0783L3975L5345p2539
1123.8G44179189k39193k47240L08573R68575R40562N36978L07858K36571J68621R4235
1144.2G47254729Q3804Q3983M7505N0366N4956r776o2286o0559o4552m9173K1577R6261
1168.7G47446835J78099K66015K69413K10345J89304J83404J28507O8307M9830J7524
1189.1G49007583l1233n8890j07944j81853j99259j79767k02060k21193j99675j87874
1209.5G47437835j94729j78456j53601j63794j80304j87456k39194l00526k99991l02612
$$ y = [753214836, 752999902, 752812207, 752582729, 752299070, 751970112, 751586318, 751198530, 750870705, 750550687, 750200927, 749876440, 749565721, 749211550, 748849869, 748501956, 748111188, 747702062, 747326672, 746918142, 746429563, 745935857, 745477855, 745027244, 744627357, 744366288, 744233191, 744182408, 744216383, 744251728, 744179189, 743939996, 743692756, 744001329, 744969904, 745910466, 746447444, 746755302, 746991873, 747160494, 747254729, 747338533, 747422516, 747470021, 747520387, 747575343, 747565567, 747503281, 747442722, 747378170, 747328997, 747350574, 747446835, 747624934, 747890949, 748160362, 748370707, 748560011, 748743415, 748871922, 748940229, 748990059, 749007583, 748976350, 748917460, 748809516, 748627663, 748428404, 748248637, 748046577, 747825384, 747625709, 747437835, 747243106, 747064650, 746911049, 746747255, 746566951, 746379495, 746140301, 745839775, 745539784, 745237172]
1229.9G45237172l27528l01719k42054k16186k15411k07365k10523j99080j67191j75476
1250.3G42974639k22087k52426k85565l42429l12448j88350j52588k08140k22742k10345
1270.7G40577519j65999q5354m5299n6863j16825k53678m39405n36621m66704l13580
1291.1G38097191j13428J64211M20213N13792M19259K30968M6968j11758k55466l83854
1311.5G39028096m35233m20272l76940k21849m0948J2934m708m0293q6844j40488k58267
1333.9G37015188m63605n95272m18305j03951o0379k52605m12583m16875l61323l69191
1354.3G33561099l77179m42803o72817p00831l49105k66611n23567o93322q75055q79050
1374.7G27780759n93245o83725j257181j448095n74231O80089J128972N93126k66016
$$ y = [745237172, 744909644, 744607925, 744365871, 744149685, 743934274, 743726909, 743516386, 743317306, 743150115, 742974639, 742752552, 742500126, 742214561, 741872132, 741559684, 741371334, 741218746, 741010606, 740787864, 740577519, 740411520, 740326166, 740280867, 740224004, 740107179, 739853501, 739414096, 738877475, 738410771, 738097191, 737983763, 738147974, 738568187, 739081979, 739501238, 739732206, 739779174, 739667416, 739411950, 739028096, 738592863, 738172591, 737795651, 737573802, 737532854, 737545788, 737541080, 737500787, 737413943, 737273455, 737015188, 736551583, 735956311, 735538006, 735434055, 735373676, 735121071, 734708488, 734291613, 733930290, 733561099, 733183920, 732741117, 732068300, 731367469, 731018364, 730751753, 730228186, 729534864, 728659809, 727780759, 727187514, 726503789, 725246608, 723798513, 723224282, 723904371, 725033343, 725626469, 725360453]
1393.1G25360453o52432l83377r4414K265j81675l17335j95027k56180m10617n14746
1413.5G22356915q15093j241326j009167j86264R1731J06931K7418j35839r7394l68058
1433.9G18729854q39949l54052L30389J72853j30832l12626k49803K2173j54853r44138
1454.3G16269016j785159r65953M66526K94030j07766M09603P66993K25663j06036
1472.6G15466917N26130R66668O61731J55270j01745l75629q88765r76443k29776K17676
1493G15422034k79009n83708M9770M65095r9361j396358j332343O30379R00864P2778
1513.4G13850141n66066p09355p24971o72281o0081J71542Q2791L6836n28694p83384
1533.8G10096478l70144r92477j953006p21216N74648N34892L2663m74751p10070r66131
$$ y = [725360453, 724708021, 724324644, 724230230, 724232495, 724050820, 723733485, 723538458, 723282278, 722871661, 722356915, 721541822, 720300496, 719291329, 719105065, 719196796, 719303727, 719331145, 719195306, 719097912, 718729854, 717889905, 717535853, 717866242, 718039095, 717908263, 717595637, 717345834, 717368007, 717213154, 716269016, 714483857, 713517904, 713984430, 714278460, 714170694, 714580297, 715347290, 715572953, 715466917, 715993047, 716959715, 717621446, 717776716, 717674971, 717299342, 716410577, 715434134, 715204358, 715422034, 715143025, 714559317, 714609087, 715074182, 714974821, 713578463, 712246120, 712876499, 713777363, 713850141, 713284075, 712574720, 711849749, 711177468, 711117387, 711288929, 711371720, 711408556, 710879862, 710096478, 709726334, 708733857, 706780851, 706059635, 706634283, 707169175, 707201838, 706727087, 706017017, 705050886]
1554.2G05050886j485944k036810m86732R91464K26319o94633j154363r79721o03915
1572.6F98826551j176536j573860p80642o35982j165211j499534j706600j891553k068580
1590.9F86328053k245664k386868k464175k595008k784848k923250l025353l155112
1607.2F64747775l247619l240168l337026l803193l628374k269387j939356k240360
1623.5F41042292j879811j514971j230658q69810p71821j17421J321256J818359J615346
1641.9F39412761J300752J431167K341449K292872J801193L254532M121304L304183
1658.2F59260213K695501K745748L099322K756238K290726K629280K784610K552807
1674.5F80814445K707243K520919J731872J001895J534462K528965K165795J536369
$$ y = [705050886, 703564942, 701528132, 701041400, 702032864, 702259183, 701564550, 700410187, 699430466, 698826551, 697650015, 696076155, 695295513, 694659531, 693494320, 691994786, 690288186, 688396633, 686328053, 684082389, 681695521, 679231346, 676636338, 673851490, 670928240, 667902887, 664747775, 661500156, 658259988, 654922962, 651119769, 647491395, 645222008, 643282652, 641042292, 639162481, 637647510, 636416852, 635547042, 634775221, 634657800, 635979056, 637797415, 639412761, 640713513, 642144680, 644486129, 646779001, 648580194, 651834726, 655956030, 659260213, 661955714, 664701462, 667800784, 670557022, 672847748, 675477028, 678261638, 680814445, 683521688, 686042607, 687774479, 688776374, 690310836, 692839801, 695005596, 696541965]
1690.9F96541965Q79884R8109q6367J40190P72655J358032R36210O80626O95407L15845
1711.3G02332556k56300p15613m48585P02739J082599N53251J61647n7637k93076o03617
1731.7G02457964p01606K76685O68943J22070L1591J66058l6061l09944k89082K14874
1752G02601492M28975P3314j29283k08199j94311P6652j16408n33641o53147m47512
1772.4G00897932K00212M19080L4392k18510j60575j15514j18673l15607p01010n14269
1792.8F99407458J11401J21355k67744l23534j1801Q5413j68502l76761k81573q5592
1813.2F98210120j17659k20895j97768k62916m70043m84228l75569l47256k4200J45495
1833.6F95855081j24514k29180k29478n45561p55906k35677J84774O2168j02818k05517
$$ y = [696541965, 697421849, 697519958, 697433591, 697573781, 698346436, 699704468, 700640678, 701321304, 702016711, 702332556, 702076256, 701360643, 700912058, 701614797, 702697396, 703250647, 703412294, 703354657, 703061581, 702457964, 701756358, 702033043, 702701986, 702824056, 702855647, 703021705, 702985644, 702675700, 702386618, 702601492, 703030467, 703103781, 702974498, 702766299, 702571988, 702648640, 702532232, 701998591, 701345444, 700897932, 701098144, 701517224, 701551616, 701333106, 701172531, 701057017, 700938344, 700622737, 699921727, 699407458, 699518859, 699640214, 699372470, 699048936, 699037135, 699122548, 698954046, 698577285, 698295712, 698210120, 698092461, 697871566, 697673798, 697410882, 696940839, 696456611, 696081042, 695733786, 695709586, 695855081, 695730567, 695501387, 695271909, 694726348, 693970442, 693734765, 693919539, 693981707, 693878889, 693673372]
1854F93673372k59459k69234k66492k76804l66330n81384o14107j61946J61589k0445
1874.4F91018760k32219k54989k52843k94507l23891l71099m48465l04997j33276k16007
1894.8F88186467k63930k14934k31504k94447l35396l48747l44097k75612k04682l22581
1915.2F85350537m92572l74377k32041k53499j88172j60336k53260l14832l02851k78413
1935.6F82500184k99216l79085m57347l52978j89722j80781k40266k85626k94625k87414
1956F79533124l06606l21925k97487l19302l66270k90692k14339k71499l07858k90870
1976.4F76546276k96593k80142k57909l00586l57450l58343l58045k93374j79052k07424
1996.8F73657358k87295k93493k86579k99811k93017k63393k72035l03448l32951l47078
$$ y = [693673372, 693413913, 693144679, 692878187, 692601383, 692235053, 691653669, 691039562, 690877616, 691039205, 691018760, 690786541, 690531552, 690278709, 689984202, 689660311, 689289212, 688840747, 688535750, 688402474, 688186467, 687922537, 687707603, 687476099, 687181652, 686846256, 686497509, 686153412, 685877800, 685673118, 685350537, 684857965, 684483588, 684251547, 683998048, 683809876, 683649540, 683396280, 683081448, 682778597, 682500184, 682200968, 681821883, 681364536, 681011558, 680821836, 680641055, 680400789, 680115163, 679820538, 679533124, 679226518, 678904593, 678607106, 678287804, 677921534, 677630842, 677416503, 677145004, 676837146, 676546276, 676249683, 675969541, 675711632, 675411046, 675053596, 674695253, 674337208, 674043834, 673864782, 673657358, 673370063, 673076570, 672789991, 672490180, 672197163, 671933770, 671661735, 671358287, 671025336, 670678258]
2017.2F70678258l59058m43161o41227o50346j54018K55942J04427j51098k13265k16067
2037.6F68210387k55048k57969k25723k32994k37823k26140k38657k55644k46346k35439
2058F65798604k36094k42233k46823k42293k29179k17736k34664k61545k47776k06471
2078.4F63433790j96814k29836k42531k27630k53320l49998m26353k96771r1791r2983
2098.8F61025763j92225k27452k26736k18451k23934k30909k16484k27392k73049l06427
2119.2F58682704l15011l01420k71082k40565k11417j71244j24514j00136j18673j57416
2139.6F56671226j92344k20239k31207k50399l11375l74734m17054m76598n51463o25431
2160F53020382p16508p94112q03411o68168k22564M19378Q19862Q59201P53343O07312
$$ y = [670678258, 670319200, 669876039, 669234812, 668584466, 668430448, 668686390, 668790817, 668639719, 668426454, 668210387, 667955339, 667697370, 667471647, 667238653, 667000830, 666774690, 666536033, 666280389, 666034043, 665798604, 665562510, 665320277, 665073454, 664831161, 664601982, 664384246, 664149582, 663888037, 663640261, 663433790, 663236976, 663007140, 662764609, 662536979, 662283659, 661933661, 661507308, 661210537, 661118746, 661025763, 660833538, 660606086, 660379350, 660160899, 659936965, 659706056, 659489572, 659262180, 658989131, 658682704, 658367693, 658066273, 657795191, 657554626, 657343209, 657171965, 657047451, 656947315, 656828642, 656671226, 656478882, 656258643, 656027436, 655777037, 655465662, 655090928, 654673874, 654197276, 653645813, 653020382, 652303874, 651509762, 650706351, 650038183, 649815619, 650234997, 651054859, 651914060, 652667403, 653274715]
2180.4F53274715M34279K87712J79052Q4639J6272k5153p0334j17838j44422j64807
2200.8F53754115j86324j77324j58906j72257j83702j83642k06053k14398j90139j89185
2221.2F51892185j96695j78635j78516k03371k06769j99318k05874k04980j97649j90974
2241.6F49929404k00689k27451k35498k12371j81675j81079k03967k21491k32041k23637
2262F47809505k04384k14040k25842k01941j99496k25544k15352j84894j75297j78993
2282.3F45783722k11298k57909k68698k66790k83838k85923k66314k70903l04699l33667
2302.7F43033683l55184l67999l76701m04775m16577l89993m21822n19097n40138m64379
2323.1F38777018m06325m05669m50194m78626m02569l39330m02212m45127l44396j63257
$$ y = [653274715, 653708994, 653996706, 654175758, 654260397, 654276669, 654251516, 654181182, 654063344, 653918922, 653754115, 653567791, 653390467, 653231561, 653059304, 652875602, 652691960, 652485907, 652271509, 652081370, 651892185, 651695490, 651516855, 651338339, 651134968, 650928199, 650728881, 650523007, 650318027, 650120378, 649929404, 649728715, 649501264, 649265766, 649053395, 648871720, 648690641, 648486674, 648265183, 648033142, 647809505, 647605121, 647391081, 647165239, 646963298, 646763802, 646538258, 646322906, 646138012, 645962715, 645783722, 645572424, 645314515, 645045817, 644779027, 644495189, 644209266, 643942952, 643672049, 643367350, 643033683, 642678499, 642310500, 641933799, 641529024, 641112447, 640722454, 640300632, 639781535, 639241397, 638777018, 638370693, 637965024, 637514830, 637036204, 636633635, 636294305, 635892093, 635446966, 635102570, 634939313]
2343.5F34939313J73271M98533K83301m06802r69589r82582p71165n48124k65658N245
2363.9F31955743J81556K62200L07978L40759L48330L35872L44634L63708K88129J19030
2384.3F34847939k2113r0838j55091k20001k32577k13385j84238j67250j84834k10524
2404.7F33167088k16901k12729k31684k43306k30193k33531k31266k03848k12788k48313
2425.1F30902529k25306j76191j66953j83522k09332k22862k21252k34485k50935k38121
2445.5F28773570k06530j95146k07364k10047k07424k24888k49565k47538k26081k21908
2465.9F26577079k24948k13086k04861k24591k39968k17497k05696k19345k06709k01225
2486.3F24419153k44081k49148k06232k15173k41518k19762k12014k40206k41876k12967
$$ y = [634939313, 635112584, 635611117, 635894418, 635487616, 634518027, 633535445, 632764280, 632216156, 631950498, 631955743, 632137299, 632399499, 632707477, 633048236, 633396566, 633732438, 634077072, 634440780, 634728909, 634847939, 634825826, 634734988, 634579897, 634359896, 634127319, 633913934, 633729696, 633562446, 633377612, 633167088, 632950187, 632737458, 632505774, 632262468, 632032275, 631798744, 631567478, 631363630, 631150842, 630902529, 630677223, 630501032, 630334079, 630150557, 629941225, 629718363, 629497111, 629262626, 629011691, 628773570, 628567040, 628371894, 628164530, 627954483, 627747059, 627522171, 627272606, 627025068, 626798987, 626577079, 626352131, 626139045, 625934184, 625709593, 625469625, 625252128, 625046432, 624827087, 624620378, 624419153, 624175072, 623925924, 623719692, 623504519, 623263001, 623043239, 622831225, 622591019, 622349143, 622136176]
2506.7F22136176j94967j94550k16543k32160k01643j79887k13682k46406k37227k26974
2527.1F19992137k31624k11954k01404k36571k45154k28524k33352k29538k20358k28226
2547.5F17725432k34902k15590k21610k58148k33233k01642k31087k36273k11358k20538
2567.9F15461051k14636j97172k28226k43902k11180k13742k50697k35319k05219k10285
2588.3F13250673j99020k03431k55346k66969k21849k23815k54452k31505k10285k15769
2608.7F10968232k08974k28107k52008k27571k25067k49326k36332k07723k07901k44081
2629.1F08681142k50041k20001k17080k20656k28346k68459k86102k62917k49743k32339
2649.5F06245458k00093k04742k31504k39670k24114j95086j92404k32875k79903k59936
$$ y = [622136176, 621941209, 621746659, 621530116, 621297956, 621096313, 620916426, 620702744, 620456338, 620219111, 619992137, 619760513, 619548559, 619347155, 619110584, 618865430, 618636906, 618403554, 618174016, 617953658, 617725432, 617490530, 617274940, 617053330, 616795182, 616561949, 616360307, 616129220, 615892947, 615681589, 615461051, 615246415, 615049243, 614821017, 614577115, 614365935, 614152193, 613901496, 613666177, 613460958, 613250673, 613051653, 612848222, 612592876, 612325907, 612104058, 611880243, 611625791, 611394286, 611184001, 610968232, 610759258, 610531151, 610279143, 610051572, 609826505, 609577179, 609340847, 609133124, 608925223, 608681142, 608431101, 608211100, 607994020, 607773364, 607545018, 607276559, 606990457, 606727540, 606477797, 606245458, 606045365, 605840623, 605609119, 605369449, 605145335, 604950249, 604757845, 604524970, 604245067, 603985131]
2669.9F03985131k01643k04026k25008k10822k12133k48968k63512k46287k25424k17557
2690.3F01729751k47360k66730k34247k09272k22981k36332k48551k64228k51174k31325
2710.7E99317551k22385k05815k05398k27630k30610k16067k15411k44975k80321k70009
2731.1E96998930k49982k52247k45750k40385k37048k31445k05815j77860k20954k84791
2751.4E94652653k85328k49505k39312k50936k55108k57134k48313k32756k23935k03907
2771.8E92206419j94669k59340l35693l24846k64704k24233k02417j81437k31325l22998
2792.2E89664757l11911k35379k44557l27468l57747l23534k65003k42591l19063l88444
2812.6E86649060l52025k84433k56419k69950l09646l30984l08037k94030l18587l22103
$$ y = [603985131, 603783488, 603579462, 603354454, 603143632, 602931499, 602682531, 602419019, 602172732, 601947308, 601729751, 601482391, 601215661, 600981414, 600772142, 600549161, 600312829, 600064278, 599800050, 599548876, 599317551, 599095166, 598889351, 598683953, 598456323, 598225713, 598009646, 597794235, 597549260, 597268939, 596998930, 596748948, 596496701, 596250951, 596010566, 595773518, 595542073, 595336258, 595158398, 594937444, 594652653, 594367325, 594117820, 593878508, 593627572, 593372464, 593115330, 592867017, 592634261, 592410326, 592206419, 592011750, 591752410, 591416717, 591091871, 590827167, 590602934, 590400517, 590219080, 589987755, 589664757, 589352846, 589117467, 588872910, 588545442, 588187695, 587864161, 587599158, 587356567, 587037504, 586649060, 586297035, 586012602, 585756183, 585486233, 585176587, 584845603, 584537566, 584243536, 583924949, 583602846]
2833E83602846l00229k96950m11094o26146o96123o17921o15120p01428o96003n18084
2853.4E78123748k83658j02103l2067r5248j92225k29359k32756j81914r5129j75833
2873.8E76503456l71874l82721k79844k80678l17514l12984l11613l33011l24965k91347
2894.2E73296905l31760m17411m30525m04775m16100m53949m56929l90232l94761o02067
2914.6E68998396q17060q23259p06494n57363l60966j18315O1273M7446j3590M7981
2935E65758049J22190J02758J00553J39475L9935k00331l24070k64108k55704l05057
2955.4E64913690k60711j66773r1374n9605m5180R000N8711O0439L6418j4424l9816
2977.8E64400375o5148j80602k73287k67446k22683j24991r4056j98961k35140k53558
$$ y = [583602846, 583302617, 583005667, 582594573, 581968427, 581272304, 580654383, 580039263, 579337835, 578641832, 578123748, 577840090, 577737987, 577705920, 577610672, 577418447, 577189088, 576956332, 576774418, 576679289, 576503456, 576131582, 575748861, 575469017, 575188339, 574870825, 574557841, 574246228, 573913217, 573588252, 573296905, 572965145, 572547734, 572117209, 571712434, 571296334, 570842385, 570385456, 569995224, 569600463, 568998396, 568181336, 567358077, 566651583, 566094220, 565733254, 565614939, 565676212, 565723658, 565710068, 565758049, 565880239, 565982997, 566083550, 566223025, 566262960, 566062629, 565738559, 565474451, 565218747, 564913690, 564652979, 564486206, 564394832, 564335227, 564290047, 564299047, 564357758, 564418197, 564454615, 564440191, 564400375, 564335227, 564154625, 563881338, 563613892, 563391209, 563266218, 563172162, 562973201, 562738061, 562484503]
2998.2E62484503l29733l10004k72393k64526j61767n1260j12235k90513m26114m81248
3018.6E59784710m70578l93033l48330l85642l57568k56539k21133l38435m65035l43144
3039E56205273j71483k73228n04911n60581m17114l36408m07577m57406m67717m70639
3059.4E52138209m11272l25978k84910l62456n03182n28097m11630k34246j85728l65257
3079.8E48525453m94421m68135m94718n32151n16355n57899n90384m97937l89457m31836
3100.2E43552160n35965n08904l99590l93927n08189n03898l35395k82168m07815o18995
3120.6E39057314q06689p81894o06000n11766n46276n83470n28037m35710m73202o66499
3141E33117771p61747o78063n87463m98712m53711o10709q10444q15273p25328o81699
$$ y = [562484503, 562154770, 561844766, 561572373, 561307847, 561146080, 561094820, 560982585, 560692072, 560265958, 559784710, 559314132, 558921099, 558572769, 558187127, 557829559, 557573020, 557351887, 557013452, 556548417, 556205273, 556033790, 555760562, 555255651, 554695070, 554277956, 553941548, 553533971, 553076565, 552608848, 552138209, 551726937, 551400959, 551116049, 550753593, 550250411, 549722314, 549310684, 549076438, 548890710, 548525453, 548031032, 547562897, 547068179, 546536028, 546019673, 545461774, 544871390, 544373453, 543983996, 543552160, 543016195, 542507291, 542107701, 541713774, 541205585, 540701687, 540366292, 540084124, 539676309, 539057314, 538250625, 537468731, 536862731, 536350965, 535804689, 535221219, 534693182, 534257472, 533784270, 533117771, 532356024, 531677961, 531090498, 530591786, 530138075, 529527366, 528716922, 527901649, 527176321, 526494622]
3161.4E26494622o90460p11203p39157p82847p66158p11918p32660p80285p83324q02219
3181.8E18994391q20994p90775p82192q36313q97288r08732q71778q44657q48473q52882
3202.2E10540307q76308r09328r02117q75175q70704q89421q94248q66175q49783q89421
3222.6E01717627r35197r05514q20636p19101p02053r01788j073957r87083q55535
3240.9D93816763p94411p15524p24673q57830q69244p32780o82383p56026p97540p43627
3261.3D86142725o83874o62893n80192m80830o02305q23081q89599q85874q58367q09908
3281.7D78865802q14497q35687q06332p37250p58648r38385j112372j154810j089215
3300.1D70618606r55224q50380r75668j295925j511037j521706j440525j393676j408369
$$ y = [526494622, 525804162, 525092959, 524353802, 523570955, 522804797, 522092879, 521360219, 520579934, 519796610, 518994391, 518173397, 517382622, 516600430, 515764117, 514866829, 513958097, 513086319, 512241662, 511393189, 510540307, 509663999, 508754671, 507852554, 506977379, 506106675, 505217254, 504323006, 503456831, 502607048, 501717627, 500782430, 499876916, 499056280, 498337179, 497635126, 496733338, 495659381, 494672298, 493816763, 493022352, 492306828, 491582155, 490724325, 489855081, 489122301, 488439918, 487683892, 486886352, 486142725, 485458851, 484795958, 484215766, 483734936, 483132631, 482309550, 481419951, 480534077, 479675710, 478865802, 478051305, 477215618, 476409286, 475672036, 474913388, 473975003, 472862631, 471707821, 470618606, 469663382, 468813002, 467837334, 466541409, 465030372, 463508666, 462068141, 460674465, 459266096]
3318.4D59266096j429587j423389j440495j572728j725018j755178j695931j591295
3334.8D46632475j502186j605928j841396j966894j983881j883060j733899j849145
3351.1D32266086k129852k192140k046853j936585j987517k022266j843810j684845
3367.4D16422218j827240k117604k167970j954198j767426j684100j665205j636862
3383.7D01601613j512945j296491j060277j097172j393080j399338j021982q31455
3400C91988873j146227j475334j324236j034171r68158r94742j015216r83894q49753
3418.4C82197142p21515o51210n65052m34160l04550k57731j91599q0436j73778l74645
3438.8C78442466l26931p0781J36912K00629K34366L13431L55720M22568N59687O37651
$$ y = [459266096, 457836509, 456413120, 454972625, 453399897, 451674879, 449919701, 448223770, 446632475, 445130289, 443524361, 441682965, 439716071, 437732190, 435849130, 434115231, 432266086, 430136234, 427944094, 425897241, 423960656, 421973139, 419950873, 418107063, 416422218, 414594978, 412477374, 410309404, 408355206, 406587780, 404903680, 403238475, 401601613, 400088668, 398792177, 397731900, 396634728, 395241648, 393842310, 392820328, 391988873, 390842646, 389367312, 388043076, 387008905, 386040747, 385046005, 384030789, 383046895, 382197142, 381475627, 380824417, 380259365, 379825205, 379520655, 379262924, 379071325, 378990889, 378817111, 378442466, 378115535, 378044754, 378181666, 378382295, 378616661, 378930092, 379285812, 379708380, 380268067, 380905718]
3459.2C80905718N90920O14941Q48413R71853P30962M47810M91500P06970Q81046Q94606
3479.6C88084739P20680P04229Q76248Q89689Q30084Q94785R82821J005351R73970
3497.9C95962596R84371R88662Q67605Q22127R61542J106620J183391J143753J014888
3516.3D05035555R67056J059323J192272J160443J047045J101434J232952J300484
3532.6D14096564J332641J268863J168758J235575J370012J358033J200795J182705
3548.9D24213946J308471J359433J405477J467526J470745J382917J230329J212091
3565.2D35050935J558721J969069J947254J711368J638562J722634J825541J839071
3581.5D49263155J732588J570314J589746J927227K043873J897692J937151K061218
$$ y = [380905718, 381496638, 382111579, 382959992, 383931845, 384662807, 385110617, 385602117, 386309087, 387190133, 388084739, 388805419, 389509648, 390385896, 391275585, 392105669, 393000454, 393983275, 394988626, 395962596, 396946967, 397935629, 398803234, 399625361, 400586903, 401693523, 402876914, 404020667, 405035555, 406002611, 407061934, 408254206, 409414649, 410461694, 411563128, 412796080, 414096564, 415429205, 416698068, 417866826, 419102401, 420472413, 421830446, 423031241, 424213946, 425522417, 426881850, 428287327, 429754853, 431225598, 432608515, 433838844, 435050935, 436609656, 438578725, 440525979, 442237347, 443875909, 445598543, 447424084, 449263155, 450995743, 452566057, 454155803, 456083030, 458126903, 460024595, 461961746, 464022964]
3597.9D64022964K025962J953483J865506J664907J604169J800716J913846J883179
3614.2D78734732J776635J692117J951128K076864J656383J106978R75251J640946
3630.5D91611034K039879J776248J489640J304984J149952J001805P36058L96609M40717
3648.8E01946926J077950J438618J092791Q48711J009941Q25465M28974K43545J490
3667.2E08914411l50237j35958J22786j30117L40521Q97407O72281L67403J60158j80662
3687.6E10677993l16024K29061O57559M52697N8949j77503j91748O4254J40846k44379
3708E11351705o06180l37302L52025M57406N2988k71499l63171k86341j25229l636
3728.4E10220766k49982o39021n62430n1021L93808K68697n83708j035631q3744J44541
$$ y = [464022964, 466048926, 468002409, 469867915, 471532822, 473136991, 474937707, 476851553, 478734732, 480511367, 482203484, 484154612, 486231476, 487887859, 488994837, 489970088, 491611034, 493650913, 495427161, 496916801, 498221785, 499371737, 500373542, 501109600, 501506209, 501946926, 503024876, 504463494, 505556285, 506404996, 507414937, 508240402, 508669376, 508912921, 508914411, 508564174, 508428216, 508551002, 508420885, 508761406, 509658813, 510331094, 510698497, 510858655, 510677993, 510361969, 510591030, 511248589, 511701286, 511760235, 511582732, 511390984, 511455238, 511596084, 511351705, 510745525, 510408223, 510760248, 511217654, 511270642, 510999143, 510635972, 510349631, 510224402, 510220766, 509970784, 509331763, 508769333, 508718312, 509112120, 509380817, 508797109, 507761478, 507677734, 507822275]
3748.8E07822275l98993O8724N97656K68459j60098n1797P4506j55151k48730k38359
3769.2E07578492j26064J08362O9260j70827l26633k04027p5638j16050j10448j03593
3789.6E06522834j43289k94447n06580l96431l97682n32567l4571M5776j48534J77621
3810E04292130J86861l63588p77901m53352l48449k19107L61800K64228j01686k92837
3830.4E02548099l51549k32160m21703o00159j28627K10643J82867J14441j23441o83665
3850.8E00514746j369357o14584P72983O67959o2912n16981m15921j28121k88158k48552
3871.2D98311102J06514J19388K4199k83777l30329p3344k33054j36971j3382k70277
3891.6D97220069j06275R8109k83867o53982n54055k22891K33560M46558J66685j24812
$$ y = [507822275, 507423282, 507492006, 508089662, 508358121, 508198023, 508146226, 508220732, 508065581, 507816851, 507578492, 507452428, 507560790, 507630050, 507459223, 507132590, 506928563, 506852925, 506736875, 506626427, 506522834, 506379545, 506085098, 505578518, 505182087, 504784405, 504251838, 504217267, 504263043, 504114509, 504292130, 504478991, 504115403, 503337502, 502884150, 502535701, 502316594, 502678394, 502942622, 502840936, 502548099, 502196550, 501964390, 501542687, 500942528, 500813901, 501024544, 501207411, 501321852, 501198411, 500514746, 499145389, 498530805, 499303788, 499971747, 499908835, 499391854, 498975933, 498847812, 498559654, 498311102, 498417616, 498537004, 498561203, 498277426, 497947097, 497873753, 497640699, 497503728, 497490346, 497220069, 497113794, 497211903, 496928036, 496274054, 495719999, 495497108, 495730668, 496177226, 496343911, 496219099]
3912D96219099k40237l90083l86506j36077k7389j31934j28776r7037k18421k32398
3932.3D94230241m4585m321j33783k17169k42561j58668j11312j73211j34796o8843
3952.7D92940992r4533j29193j37895j49250j25349r1165j32263k14070k19703j35153
3973.1D91512418q3000j03742j51544j57059j15722j43856k07782k04175j49876r5159
3993.5D90100503j08331j72824
3997.6D89819348
$$ y = [496219099, 495978862, 495588779, 495202273, 495066196, 495038807, 494906873, 494778097, 494681060, 494462639, 494230241, 494185656, 494181335, 494047552, 493830383, 493587822, 493429154, 493317842, 493144631, 493009835, 492940992, 492846459, 492717266, 492579371, 492430121, 492304772, 492213607, 492081344, 491867274, 491647571, 491512418, 491429418, 491325676, 491174132, 491017073, 490901351, 490757495, 490549713, 490345538, 490195662, 490100503, 489992172, 489819348]
##END=$$ End of the data block
