##TITLE=1,2-naftoquinona $$ Begin of the data block
##JCAMP-DX=5.00 $$ ACD/SpecManager v 10.08
##SPECTROMETER/DATA SYSTEM=Alpha
##DATE=25 Jun 2015 13:07:00
##DATA TYPE=INFRARED SPECTRUM
##DATA CLASS=XYDATA
##ORIGIN=
##OWNER=
##NPOINTS=1765
##FIRSTX=399.76428223
##LASTX=3997.64306641
##MAXX=3997.64306641
##MINX=399.76428223
##MAXY=0.89285159
##MINY=0.64499813
##XFACTOR=1.0000000000
##YFACTOR=1.000000000000000e-9
##FIRSTY=0.86549604
##DELTAX=2.03961372
##XUNITS=1/CM
##YUNITS=ARBITRARY UNITS
##XYDATA=(X++(Y..Y))
$$ plain form
399.8 865496039 862850726 862708271 862937748 861300766 859072566 858746111 860029459 860881150 860753179
418.1 860753179 860850692 861627877 861400366 859599352 858455539 859172463 859912097 859025776 857813954
436.5 857813954 858293176 859575808 859539390 858484983 858571589 860043466 860636353 859400332 858496606
454.8 858496606 859104931 859036148 857122898 855626702 856498361 858454168 859115660 858685195 858868420
473.2 858868420 859798253 860067725 859133005 858345747 858830571 859378457 858517289 857218385 857006133 857226789
493.6 857226789 856190801 854059517 852826715 853121519 853065073 851372778 849102855 847805679 847221076
511.9 847221076 845822692 843215823 840110242 836607993 831913710 825836480 819958627 816869974
528.3 816869974 817682326 821096003 825401843 830195785 835197866 839283347 841820776 843524694 845298409
$$ packed form
399.8H65496039k645313j42455K29477j636982k228200l26455J283348Q51691j27971
418.1H60753179R7513P77185k27511j801014j143813P16924P39634q86321j211822
436.5H57813954M79222J282632l6418j054407Q6606J471877N92887j236021r03726
454.8H58496606O08325o8783j913250j496196Q71659J955807O61492m30465J83225
473.2H58868420R29833K69472r34720p87258M84824N47886q61168j298904k12252K20656
493.6H57226789j035988k131284j232802K94804n6446j692295k269923j297176n84603
511.9H47221076j398384k606869l105581l502249m694283o077230n877853l088653
528.3H16869974Q12352L413677M305840M793942N002081M085481K537429J703918J773715
$$ plain form
546.6 845298409 846967161 848019123 848745346 849685967 850798070 851552069 851741493 851784647 852058649
565 852058649 852421165 852518439 852383554 852418780 852755487 853004754 852944016 852800190 852846682 853017509 852878749
587.4 852878749 852391362 852048397 851955235 851625025 850703895 849550605 848940909 849037945 849314630 849652708
607.8 849652708 850655794 852407575 853956461 854665101 855172634 856495142 858574688 860439420 861693561
626.2 861693561 863033056 864789069 866231143 866888642 867419302 868526340 869700670 870002091 869576216
644.5 869576216 869326830 869582236 869886041 869923472 870173693 871147633 872216463 872308731 871816397 871905863
664.9 871905863 872598529 872893631 872416139 871706367 870542347 867560863 861761928 856330395 856522143
683.3 856522143 862169921 868797541 873697162 876656294 878579140 879796445 880042255 880034924 880839825
$$ packed form
546.6H45298409J668752J051962P26223R40621J112103P53999J89424M3154K74002
565H52058649L62516R7274j34885L5226L36707K49267o0738j43826M6492J70827j38760
587.4H52878749m87387l42965r3162l30210r21130j153290o09696R7036K76685L38078
607.8H49652708J003086J751781J548886P08640N07533J322508K079546J864732J254141
626.2H61693561J339495J756013J442074O57499N30660J107038J174330L01421m25875
644.5H69576216k49386K55406L03805L7431K50221R73940J068830R2268m92334Q9466
664.9H71905863O92666K95102m77492p09772j164020k981484n798935n431533J91748
683.3H56522143N647778O627620M899621K959132J922846J217305K45810p331Q04901
$$ plain form
701.6 880839825 882205546 882910788 882526875 881947875 882020235 882355511 882092178 881135046 880037963 878942370
722 878942370 877214730 874418497 870993674 868266284 867920995 870157778 872902215 874420941 874996841
740.4 874996841 875466943 876093686 876546979 875957668 873645842 869824231 865263879 860381484 854010403
758.7 854010403 844718218 835554600 833495021 840444326 850935519 859987319 866623938 871785164
775.1 871785164 876296699 879813790 881826460 882886648 883598804 883144140 879794955 872575641 861908257
793.4 861908257 851261258 848450661 857056797 869995952 879724681 885251880 887847304 888836682
809.7 888836682 889708400 890958130 891729176 891350150 890645504 890873730 891806245 892196000 891862750 891733050
830.1 891733050 892060637 891866028 890375853 887986600 884931922 879597306 869031012 852778018
$$ packed form
701.6H80839825J365721P05242l83913n79000P2360L35276k63333r57132j097083j095593
722H78942370j727640k796233l424823k727390l45289K236783K744437J518726N75900
740.4H74996841M70102O26743M53293n89311k311826l821611m560352m882395o371081
758.7H54010403r292185r163618k059579O949305J0491193R051800O636619N161226
775.1H71785164M511535L517091K012670J060188P12156m54664l349185p219314j0667384
793.4H61908257j0646999k810597Q606136J2939155R728729N527199K595424R89378
809.7H88836682Q71718J249730P71046l79026p04646K28226R32515L89755l33250j29700
830.1H91733050L27587j94609j490175k389253l054678n334616j0566294j6252994
$$ plain form
846.4 852778018 839062631 839817345 853351533 866804421 875175416 881212771 885639489 887635171
862.8 887635171 887816310 887542188 887148559 885783136 883531570 882712543 885020435 888720214 890911281
881.1 890911281 891154051 891009688 891196012 890961766 889980853 889109552 888883412 889225364 889949858 890586734
901.5 890586734 891194701 892098486 892680287 892403901 891960740 892220318 892839193 892851591 892249227 891948223
921.9 891948223 892267406 892416120 891833127 891138792 891118169 891380608 890967846 889909089 889144361 889000893
942.3 889000893 888682842 887490630 885702610 883507490 879738510 872887313 865103722 862777770 867623448
960.7 867623448 873669505 876650870 877516866 878501594 880378127 881907463 881917357 880736113 879181862
979 879181862 877935290 877626300 878435194 879961729 881394148 881988227 881853402 881751895 881941259 881733000
$$ packed form
846.4H52778018j3715387P54714J3534188J3452888Q370995O037355M426718J995682
862.8H87635171J81139k74122l93629j365423k251566q19027K307892L699779K191067
881.1H90911281K42770j44363J86324k34246r80913q71301k26140L41952P24494O36876
901.5H90586734O07967R03785N81801k76386m43161K59578O18875J2398o02364l01004
921.9H91948223L19183J48714n82993o94335k0623K62439m12762j058757p64728j43468
942.3H89000893l18051j192212j788020k195120l768980o851197p783591k325952M845678
960.7H67623448O046057K981365Q65996R84728J876533J529336R894j181244j554251
979H79181862j246572l08990Q08894J526535J432419N94079j34825j01507J89364k08259
$$ plain form
999.4 881733000 880864143 880493879 881402791 882593572 882825613 882111788 881422281 881311774 881199598 880399287
1019.8 880399287 879226506 878424525 877944946 877213717 876262665 875624418 875050843 873408496 870285511
1038.2 870285511 867159247 866162062 867762148 870604455 873126447 874893129 876296997 877265871 877407193
1056.5 877407193 877077222 877070487 877400100 877388895 876850128 876379967 876387298 876469374 876061022 875365853 875093579
1079 875093579 875314534 875340402 874822855 874237835 874037385 873867452 873092830 871795654 870669782 870034218
1099.4 870034218 869559646 869434297 870291293 871621907 872357666 872220635 871631563 871197641 871071756
1117.7 871071756 870664179 869365573 867146730 863905907 859369993 855636656 857248485 864221931
1134 864221931 870748103 873464644 873537958 872707963 871823668 871023178 870276272 869790256 869722843 869737387
$$ packed form
999.4H81733000q68857l70264R08912J190781K32041p13825o89507j10507j12176q00311
1019.8H80399287j172781q01981m79579p31229r51052o38247n73575j642347l122985
1038.2H70285511l126264r97185J600086K842307K521992J766682J403868R68874J41322
1056.5H77407193l29971o735L29613j1205n38767m70161P331Q2076m08352o95169k72274
1079H75093579K20955K5868n17547n85020k00450j69933p74622j297176j125872o35564
1099.4H70034218m74572j25349Q56996J330614P35759j37031n89072m33922j25885
1117.7H71071756m07577j298606k218843l240823m535914l733337J611829O973446
1134H64221931O526172K716541P3314q29995q84295q00490p46906m86016o7413J4544
$$ plain form
1154.4 869737387 869230270 868047535 866788566 866119087 865950048 865710199 865308106 865299702 865896881 866394639
1174.8 866394639 866075456 865128815 864094555 862886608 860859334 857716322 853745639 849242151 844270766
1193.2 844270766 839494765 836872995 838064730 842243433 846822441 850061357 851859510 852620006
1209.5 852620006 852462173 851479352 850109756 848891139 847941518 846776605 844849110 843333364 845067620
1227.9 845067620 849269927 850903153 848273396 844155669 839808643 833525181 823989451 812945604
1244.2 812945604 805977464 810026765 825160205 841959536 852384925 856518388 857300580 856309116
1260.5 856309116 854360998 851966023 848982275 844856679 839183390 831673265 821637332 808405995
1276.8 808405995 793160558 779407322 769992232 765160799 764998794 770515442 780546784 791379631
$$ packed form
1154.4H69737387n07117j182735j258969o69479j69039k39849m02093q404N97179M97758
1174.8H66394639l19183r46641j034260j207947k027274l143012l970683m503488m971385
1193.2H44270766m776001k621770J191735M178703M579008L238916J798153P60496
1209.5H52620006j57833r82821j369596j218617r49621j164913j927495j515746J734256
1227.9H45067620M202307J633226k629757m117727m347026o283462r535730j1043847
1244.2H12945604o968140M049301J5133440J6799331J0425389M133463P82192r91464
1260.5H56309116j948118k394975k983748m125596n673289p510125j0035933j3231337
1276.8H08405995j5245437j3753236r415090m831433j62005N516648J0031342J0832847
$$ plain form
1293.1 791379631 800722837 809423983 819181740 830197692 841005921 849846840 855919123 859242618
1309.4 859242618 860038221 858509004 855127990 850971460 847219586 844433129 843182862 845031500
1325.8 845031500 850360155 856386304 860177636 861448586 861216366 860047698 858034730 855801404
1342.1 855801404 854861319 856461346 860209465 864279866 867315948 869284213 870606065 871478200 871754766
1360.4 871754766 870973349 869095325 866791666 864204407 861174345 857812822 854172587 850619018
1376.7 850619018 847571075 845197082 844275296 845905066 849571645 852725267 853822172 852948368 849613547
1395.1 849613547 844256401 840610921 844570100 856618702 869222164 875753284 877482772 877706349
1411.4 877706349 877691686 877868474 878220856 878044724 877346694 876811862 876399517 876164019 876077175 875883043
$$ packed form
1293.1G91379631R343206Q701146R757757J1015952J0808229Q840919O072283L323495
1309.4H59242618P95603j529217l381014m156530l751874k786457j250267J848638
1325.8H45031500N328655O026149L791332J270950k32220j168668k012968k233326
1342.1H55801404r40085J600027L748119M070401L036082J968265J321852Q72135K76566
1360.4H71754766p81417j878024k303659k587259l030062l361523l640235l553569
1376.7H50619018l047943k373993r21786J629770L666579L153622J096905q73804l334821
1395.1H49613547n357146l645480L959179J2048602J2603462O531120J729488K23577
1411.4H77706349j4663J76788L52382j76132o98030n34832m12345k35498q6844j94132
$$ plain form
1431.8 875883043 875913441 876056969 875374675 874240518 873215318 871759176 869212091 865334511 861119986
1450.2 861119986 858085752 856807768 855647922 853126526 854314983 861624122 869943857 873643875
1466.5 873643875 874319077 874980092 875116765 873637617 871413529 869487703 868426621 868511319 869773090
1484.9 869773090 871795774 873408139 873503864 872948766 873049557 873230219 872396767 871208847 871080279
1503.2 871080279 872172475 872051239 869748235 867815435 867224216 867595792 867999017 867936730 867260695
1521.6 867260695 865915298 864522099 863114417 862010002 861664355 861231625 860495746 860604227 860962033
1539.9 860962033 859738469 857644141 855571389 853891671 852456570 850826144 848985732 847265482
1556.2 847265482 843444824 834263086 825265348 820636928 822189391 828540802 833897650 835791588
$$ packed form
1431.8H75883043L0398J43528o82294j134157j025200j456142k547085l877580m214525
1450.2H61119986l034234j277984j159846k521396J188457P309139Q319735L700018
1466.5H73643875O75202O61015J36673j479148k224088j925826j061082Q4698J261771
1484.9H69773090K022684J612365R5725n55098J00791J80662q33452j187920j28568
1503.2H71080279J092196j21236k303004j932800n91219L71576M03225o2287o76035
1521.6H67260695j345397j393199j407682j104415l45647m32730p35879J08481L57806
1539.9H60962033j223564k094328k072752j679718j435101j630426j840412j720250
1556.2H47265482l820658r181738q997738m628420J552463O351411N356848J893938
$$ plain form
1572.6 835791588 835677207 831960082 824216723 814172447 801921427 790265858 785326004 790656626
1588.9 790656626 801565707 809826732 812190652 810344815 806690931 802690446 799139917 796086669
1605.2 796086669 792157650 787402153 786533475 791431069 796492040 795906186 791656017 787466347 782640457
1623.5 782640457 776385128 769148469 761431515 754591465 748659492 741467059 733995676 729042232
1639.9 729042232 725984097 722687542 717167497 710690439 707157016 706291616 704734504 702224016
1656.2 702224016 700700641 700069308 698814988 695768833 692521334 692050934 697841406 711921036
1672.5 711921036 735716403 764883399 790041089 810120285 826768339 838476717 842161059
1686.8 842161059 840422034 835933805 830826998 827188194 826762378 831283927 839456499 847240210
$$ packed form
1572.6H35791588j14381l717125p743359j0044276j2251020j1655569m939854N330622
1588.9G90656626J0909081Q261025K363920j845837l653884m000485l550529l053248
1605.2G96086669l929019m755497q68678M897594N060971n85854m250169m189670m825890
1623.5G82640457o255329p236659p716954o840050n931973p192433p471383m953444
1639.9G29042232l058135l296555n520045o477058l533423q65400j557112k510488
1656.2G02224016j523375o31333j254320l046155l247499m70400N790472J4079630
1672.5G11921036K3795367K9166996K5157690K0079196J6648054J1708378L684342
1686.8H42161059j739025m488229n106807l638804m25816M521549Q172572P783711
$$ plain form
1703.1 847240210 854750872 862155437 868089139 873131514 877852201 882228136 885391414 886288702
1719.4 886288702 886138678 886221230 886594713 887166679 887972891 889030635 889869332 889622509 889273167 889344335
1739.8 889344335 889250159 889153421 889432847 889960587 890141547 889638662 889136851 889052153 889007688 888934910
1760.2 888934910 888769567 888491571 888570666 889054537 889666021 889853716 889258683 888555229 888211429 888049245
1780.6 888049245 887937248 887822151 887627184 887716234 888275623 888562620 888188004 887839556 887799919 887770712
1801 887770712 887542069 887247860 887093306 887144208 887179434 886943102 886555552 886256516 886198580 886396050
1821.4 886396050 886693537 886869490 887040436 887163460 886729777 885970473 885440230 885139704 884967327 885011077
1841.8 885011077 885028660 884658694 884215474 883883536 883495808 883110046 882861912 882704258 882556438 882542312
$$ packed form
1703.1H47240210P510662P404565N933702N042375M720687M375935L163278Q97288
1719.4H86288702j50024Q2552L73483N71966Q06212J057744Q38697k46823l49342P1168
1739.8H89344335r4176r6738K79426N27740J80960n02885n01811q4698m4465p2778
1760.2H88934910j65343k77996P9095M83871O11484J87695n95033p03454l43800j62184
1780.6H88049245j11997j15097j94967Q9050N59389K86997l74616l48448l9637k9207
1801H87770712k28643k94209j54554N0902L5226k36332l87550k99036n7936J97470
1821.4H86396050K97487J75953J70946J23024m33683p59304n30243l00526j72377M3750
1841.8H85011077J7583l69966m43220l31938l87728l85762k48134j57654j47820j4126
$$ plain form
1862.2 882542312 882899284 883633435 884191573 883975923 883431196 883212805 883201540 883037746 882738173 882530928
1882.6 882530928 882453561 882391632 882200658 881842077 881602943 881566286 881431520 881193638 881106555 881190836
1903 881190836 881242514 881124735 880875170 880616009 880457699 880425692 880364418 880147815 879961431 879748940
1923.4 879748940 879265487 878729224 878424644 878257811 878023803 877756298 877683580 877910733 878159523 878017485
1943.8 878017485 877592146 877257347 877041161 876743853 876312613 875899553 875572860 875199020 874699771 874275327
1964.2 874275327 874081135 873948932 873749316 873601913 873621941 873719275 873649776 873317778 872975409 872921169
1984.6 872921169 873098314 873194396 873065293 872809649 872580767 872416854 872212827 871972620 871863484 871971369
2005 871971369 872198224 872427940 872670531 872950256 873136222 873027563 872647464 872224987 871764839 871299684
$$ packed form
1862.2H82542312L56972P34151N58138k15650n44727k18391j1265j63794k99573k07245
1882.6H82530928p7367o1929j90974l58581k39134l6657j34766k37882q7083Q4281
1903H81190836N1678j17779k49565k59161j58310l2007o1274k16603j86384k12491
1923.4H79748940m83453n36263l04580j66833k34008k67505p2718K27153K48790j42038
1943.8H78017485m25339l34799k16186k97308m31240m13060l26693l73840m99249m24444
1964.2H74275327j94192j32203j99616j47403K0028R7334o9499l31998l42369n4240
1984.6H72921169J77145R6082j29103k55644k28882j63913k04027k40207j09136J07885
2005H71971369K26855K29716K42591K79725J85966j08659l80099m22477m60148m65155
$$ plain form
2025.4 871299684 871261477 871671915 872062385 872228920 872200429 872099817 872088194 872134387 872068226 871890068
2045.8 871890068 871750414 871713817 871685445 871552169 871383607 871314764 871311307 871269107 871187031 871127903 871146977
2068.2 871146977 871176779 871098757 870957494 870893121 870902002 870867252 870775461 870713890 870736241 870785892 870776713 870710015
2092.7 870710015 870646238 870618761 870600760 870560467 870513856 870506644 870546579 870560706 870487809 870395541 870368779 870381773
2117.1 870381773 870341122 870224237 870140910 870153844 870159626 870079041 869976223 869929075 869903743 869789541 869598389
2139.6 869598389 869475245 869494081 869597912 869666755 869672239 869695723 869740009 869718969 869636774 869593561 869624972
2162 869624972 869646072 869542658 869352639 869278371 869355798 869408488 869373500 869337201 869349420 869355977 869298577 869213402
2186.5 869213402 869178176 869203627 869197726 869091690 868966877 868933380 868958950 868931890 868823051 868716836 868695080
$$ packed form
2025.4H71299684l8207M10438L90470J66535k8491j00612j1623M6193o6161j78158
2045.8H71890068j39654l6597k8372j33276j68562o8843l457m2200q2076n9128J9074
2068.2H71146977K9802p8022j41263o4373Q881l4750r1791o1571K2351M9651r179o6698
2092.7H70710015o3777k7477j8001m0293m6611p212L9935J4127p2897r2268k6762J2994
2117.1H70381773m0651j16885q3327J2934N782q0585j02818m7148k5332j14202j91152
2139.6H69598389j23144J8836J03831O8843N484K3484M4286k1040q2195m3213L1411
2162H69624972K1100j03414j90019p4268P7427N2690l4988l6299J2219O557n7400q5175
2186.5H69213402l5226K5451n901j06036j24813l3497K5570k7060j08839j06215k1756
$$ plain form
2208.9 868695080 868695498 868605673 868475437 868425369 868434668 868381917 868221164 868055642 867995143 867976546 867878199
2231.4 867878199 867756426 867744029 867782056 867725313 867586792 867481768 867443860 867383122 867239952 867102623
2251.8 867102623 867071450 867087007 867043138 866940141 866831362 866745770 866652131 866516531 866409183 866409838 866464555
2274.2 866464555 866469860 866405666 866327405 866266608 866169631 866017044 865894794 865847051 865805686 865683317 865489662
2296.6 865489662 865328908 865249515 865192235 865089297 864959836 864898145 864901721 864833057 864650846 864422798 864192069
2319.1 864192069 863967478 863718152 863480806 863338172 863273919 863152802 862891555 862586677 862319410 862140417
2339.5 862140417 862097979 862140059 862335563 862689674 862893462 862773836 862485290 862288237 862238705 862214684
2359.9 862214684 862108588 862036049 862146139 862322390 862399697 862430573 862529874 862684906 862763941 862692952 862615108
$$ packed form
2208.9H68695080M18q9825j30236n0068R299n2751j60753j65522o0499j8597r8347
2231.4H67878199j21773j2397L8027n6743j38521j05024l7908o0738j43170j37329
2251.8H67102623l1173J5557m3869j02997j08779q5592r3639j35600j07348O55N4717
2274.2H66464555N305o4194p8261o0797r6977j52587j22250m7743m1365j22369j93655
2296.6H65489662j60754p9393n7280j02938j29461o1691L576o8664j82211k28048k30729
2319.1H64192069k24591k49326k37346j42634o4253j21117k61247l04878k67267j78993
2339.5H62140417m2438M2080J95504L54111K03788j19626k88546j97053m9532k4021
2359.9H62214684j06096p2539J10090J76251P7307L0876R9301J55032P9035p0989p7844
$$ plain form
2382.3 862615108 862658560 862712681 862632334 862464368 862362862 862339914 862266481 862105668 861980677 861984909 861999452
2404.7 861999452 861848235 861577868 861381948 861297905 861192465 861011863 860868990 860857904 860880196 860790968
2425.1 860790968 860640109 860571086 860583007 860547841 860403419 860271394 860266864 860298216 860223234 860070169 859975934
2447.6 859975934 859958768 859899461 859760106 859673560 859712005 859745681 859672129 859543979 859437466 859359562 859260023
2470 859260023 859116495 859007001 859006703 859030426 858936012 858746469 858608603 858577371 858544409 858424127 858286440
2492.4 858286440 858193696 858104348 857988536 857885778 857843816 857838094 857784569 857650459 857502043 857411504 857350528
2514.9 857350528 857232094 857049465 856888056 856769621 856608152 856405318 856320202 856419325 856558144 856582761
2535.3 856582761 856490612 856371462 856274366 856174886 856072783 856035292 856087804 856143594 856116414 856052339 856024265
$$ packed form
2382.3H62615108M3452N4121q0347j67966j01506k2948p3433j60813j24991M232J4543
2404.7H61999452j51217k70367j95920q4043j05440j80602j42873j1086K2292q9228
2425.1H60790968j50859o9023J1921l5166j44422j32025m530L1352p4982j53065r4235
2447.6H59975934j7166n9307j39355q6546L8445L3676p3552j28150j06513p7904r9539
2470H59260023j43528j09494k98K3723r4414j89543j37866l1232l2962j20282j37687
2492.4H58286440r2744q9348j15812j02758m1962n722n3525j34110j48416r0539o0976
2514.9H57350528j18434j82629j61409j18435j61469k02834q5116R9123J38819K4617
2535.3H56582761r2149j19150r7096r9480j02103l7491N2512N5790k7180o4075k8074
$$ plain form
2557.7 856024265 855978847 855877936 855786860 855736852 855713487 855702162 855676770 855624855 855557919 855459750 855286241
2580.1 855286241 855072021 854917467 854823351 854691684 854490697 854274392 854087770 853925109 853777647 853667855
2600.5 853667855 853592813 853506327 853401661 853320122 853246450 853146017 853043199 852947414 852824569 852664232
2620.9 852664232 852522850 852470994 852491975 852486312 852384925 852209806 852030635 851869643 851702809 851552963
2641.3 851552963 851499557 851567984 851650000 851645410 851606548 851596236 851565003 851475358 851379812 851316929 851273477 851205528
2665.8 851205528 851092041 850974858 850864828 850741625 850618184 850485861 850337446 850208938 850143909 850169599
2686.2 850169599 850255311 850300848 850236475 850100815 849972248 849884391 849820137 849730492 849584758 849423885 849318683
2708.6 849318683 849282622 849294662 849335134 849357188 849324465 849253774 849176526 849101365 848979592 848800123 848638773
$$ packed form
2557.7H56024265m5418j00911r1076n0008k3365j1325k5392n1915o6936r8169j73509
2580.1H55286241k14220j54554r4116j31667k00987k16305j86622j62661j47462j09792
2600.5H53667855p5042q6486j04666q1539p3672j00433j02818r5785j22845j60337
2620.9H52664232j41382n1856K0981n663j01387j75119j79171j60992j66834j49846
2641.3H51552963n3406O8427Q2016m590l8862j0312l1233q9645r5546o2883m3452o7949
2665.8H51205528j13487j17183j10030j23203j23441j32323j48415j28508o5029K5690
2686.2H50169599Q5712M5537o4373j35660j28567q7857o4254q9645j45734j60873j05202
2708.6H49318683l6061J2040M0472K2054l2723p0691p7248p5161j21773j79469j61350
$$ plain form
2731.1 848638773 848515570 848416030 848332644 848218918 848071754 847969711 847976625 848019302 847958982 847787380 847609878
2753.5 847609878 847503960 847448945 847358167 847201288 847052932 846962571 846883595 846770465 846655786 846582234
2773.9 846582234 846477032 846255243 845995903 845829964 845772743 845758140 845721841 845620036 845485687 845414877
2794.3 845414877 845414281 845360219 845188081 844969392 844751060 844547689 844382882 844216108 844029307 843872011
2814.7 843872011 843752384 843641341 843517900 843381166 843207121 842988133 842786670 842597425 842357874 842147231
2835.1 842147231 842126727 842157185 841923535 841469884 841020405 840617001 840187252 839706779 839275599 839051843
2855.5 839051843 839106262 839290619 839400887 839424133 839429617 839398682 839341223 839328170 839254975 838991284 838638484
2877.9 838638484 838333786 838121116 837974250 837823272 837642491 837430537 837231994 837099671 836934626 836649954
$$ packed form
2731.1H48638773j23203r9540q3386j13726j47164j02043O914M2677o0320j71602j77502
2753.5H47609878j05918n5015r0778j56879j48356r0361p8976j13130j14679p3552
2773.9H46582234j05202k21789k59340j65939n7221j4603l6299j01805j34349p0810
2794.3H45414877n96n4062j72138k18689k18332k03371j64807j66774j86801j57296
2814.7H43872011j19627j11043j23441j36734j74045k18988k01463j89245k39551k10643
2835.1H42147231k0504L0458k33650m53651m49479m03404m29749m80473m31180k23756
2855.5H39051843N4419J84357J10268K3246N484l0935n7459j3053p3195k63691l52800
2877.9H38638484l04698k12670j46866j50978j80781k11954j98543j32323j65045k84672
$$ plain form
2898.3 836649954 836352646 836139441 835948169 835690260 835382998 835140765 834994316 834742248 834248960 833660960
2918.7 833660960 833149433 832781196 832540751 832441807 832515419 832600534 832591712 832603037 832697988 832857907 833106041
2941.1 833106041 833375394 833424568 833118975 832624137 832164943 831723213 831372142 831426203 831854463 832260013
2961.5 832260013 832374930 832247436 832069933 831913471 831780255 831666350 831494629 831280351 831005871 830496430
2981.9 830496430 829838037 829434276 829581618 830279648 831162393 831749558 831976533 831936240 831609964 831139803
3002.3 831139803 830679655 830299675 830080092 829951346 829634726 828961730 828084171 827221632 826436698 825743020
3022.7 825743020 825095475 824391544 823775589 823484361 823517561 823609769 823500872 823257744 822883904 822046876
3043.1 822046876 820523977 818539381 816691518 815720379 816285670 818407178 821044266 823038280 824148774
$$ packed form
2898.3H36649954k97308k13205j91272k57909l07262k42233j46449k52068m93288n88000
2918.7H33660960n11527l68237k40445r8944P3612Q5115q822J1325R4951J59919K48134
2941.1H33106041K69353M9174l05593m94838m59194m41730l51071N4061M28260M05550
2961.5H32260013J14917j27494j77503j56462j33216j13905j71721k14278k74480n09441
2981.9H30496430o58393m03761J47342O98030Q82745N87165K26975m0293l26276m70161
3002.3H31139803m60148l79980k19583j28746l16620o72996q77559q62539p84934o93678
3022.7H25743020o47545p03931o15955k91228L3200R2208j08897k43128l73840q37028
3043.1H22046876j522899j984596j847863r71139N65291K121508K637088J994014J110494
$$ plain form
3061.5 824148774 824719369 824985147 824838698 824249327 823643625 823550165 824186623 825240970 826087892 826530874
3081.9 826530874 826747894 826756239 826659977 826599956 826444447 826216877 826126397 826152027 826085031 825805485 825486302
3104.3 825486302 825363815 825331032 825122952 824852586 824808121 824864924 824732661 824318171 823710978 823148727
3124.7 823148727 822769582 822480798 822148323 821754277 821392477 821187258 821053624 820726097 820214212 819730461
3145.1 819730461 819329143 819027662 818812847 818463922 817862272 817199409 816614270 816080809 815578640 815083146
3165.5 815083146 814542770 813954651 813379884 812846303 812298894 811684072 811001301 810290456 809605837 808921695
3185.9 808921695 808188498 807425022 806646168 805848360 805050611 804283679 803536654 802788436 802015603 801182151
3206.3 801182151 800316453 799467146 798621416 797747016 796862245 795996308 795130372 794251740 793345869 792400181
$$ packed form
3061.5H24148774N70595K65778j46449n89371o05702r3460O36458J054347Q46922M42982
3081.9H26530874K17020Q345r6262o0021j55509k27570r0480K5630o6996k79546l19183
3104.3H25486302j22487l2783k08080k70366m4465N6803j32263m14490o07193n62251
3124.7H23148727l79145k88784l32475l94046l61800k05219j33634l27527n11885m83751
3145.1H19730461m01318l01481k14815l48925o01650o62863n85139n33461n02169m95494
3165.5H15083146n40376n88119n74767n33581n47409o14822o82771p10845o84619o84142
3185.9H08921695p33197p63476p78854p97808p97749p66932p47025p48218p72833q33452
3206.3H01182151q65698q49307q45730q74400q84771q65937q65936q78632r05871r45688
$$ plain form
3226.7 792400181 791455150 790584385 789756477 788779140 787642717 786548913 785551727 784615159 783765316
3245 783765316 782955110 782052040 781093955 780232489 779469430 778686702 777844489 777005672 776230872 775538146
3265.4 775538146 774918556 774357915 773711860 772869945 771947503 771009564 770050585 769099593 768138051 767139614
3285.8 767139614 766143382 765214682 764316201 763321757 762184620 760948062 759705245 758570313 757522702
3304.2 757522702 756333709 754797518 753010035 751175165 749299586 747312188 745244145 743129909
3320.5 743129909 740928352 738613844 736187637 733686566 731195509 728764176 726405382 724116266
3336.8 724116266 721796095 719359100 716867387 714366615 711910188 709613383 707356155 704930484
3353.1 704930484 702467740 700227141 698223829 696258843 694271445 692416131 690615118 688528895
$$ packed form
3226.7G92400181r45031q70765q27908r77337j136423j093804r97186r36568q49843
3245G83765316q10206r03070r58085q61466p63059p82728q42213q38817p74800o92726
3265.4G75538146o19590n60641o46055q41915r22442r37939r58979r50992r61542r98437
3285.8G67139614r96232r28700q98481r94444j137137j236558j242817j134932j047611
3304.2G57522702j188993j536191j787483j834870j875579j987398k068043k114236
3320.5G43129909k201557k314508k426207k501071k491057k431333k358794k289116
3336.8G24116266k320171k436995k491713k500772k456427k296805k257228k425671
3353.1G04930484k462744k240599k003312j964986j987398j855314j801013k086223
$$ plain form
3369.4 688528895 686073720 683626175 681503654 679586172 677656114 675661504 673707962 671885133
3385.7 671885133 670233667 668787301 667258561 665390730 663545012 662133753 660942197 659402907
3402.1 659402907 657500803 655790687 654426217 653160632 651878595 650593400 649380088 648350894
3418.4 648350894 647467613 646647871 645986319 645565569 645339489 645178676 645100296 645204246 645254135 645076513
3438.8 645076513 644998133 645286858 645814896 646365166 646884203 647517264 648331285 649231017 650217414 651335955
3459.2 651335955 652442694 653516054 654814959 656286657 657465398 658237815 659044683 660172880 661578536
3477.5 661578536 663015723 664173245 665185452 666394532 667695701 668913484 670194387 671630025
3493.8 671630025 673124075 674560308 675990283 677465856 678737283 679816782 681115746 682691872
$$ packed form
3369.4F88528895k455175k447545k122521j917482j930058j994610j953542j822829
3385.7F71885133j651466j446366j528740j867831j845718j411259j191556j539290
3402.1F59402907j902104j710116j364470j265585j282037j285195j213312j029194
3418.4F48350894q83281q19742o61552m20750k26080j60813p8380J03950M9889j77622
3438.8F45076513p8380K88725N28038N50270N19037O33061Q14021Q99732R86397J118541
3459.2F51335955J106739J073360J298905J471698J178741P72417Q06868J128197J405656
3477.5F61578536J437187J157522J012207J209080J301169J217783J280903J435638
3493.8F71630025J494050J436233J429975J475573J271427J079499J298964J576126
$$ plain form
3510.2 682691872 684316576 685829461 687224209 688693941 690384507 692237914 693970442 695442736
3526.5 695442736 696874559 698419869 700090349 701912045 703707814 705330431 707115889 709293664
3542.8 709293664 711479604 713173151 714547336 716115236 717890143 719654679 721435785 723367214
3559.1 723367214 725443065 727589786 729842246 732077658 733965456 735647202 737526894 739651918
3575.4 739651918 741884351 744262099 746855557 749642253 752498984 755057335 757178664 759290874
3591.7 759290874 761629105 764033735 766450882 768874943 771158457 773370564 775747895 778282166
3608.1 778282166 780710340 782920420 784977555 787008941 789156377 791063488 792460263 793932199
3624.4 793932199 795961142 798162699 799515307 800213158 801100194 802168489 803228378 804334641 805546582
$$ packed form
3510.2F82691872J624704J512885J394748J469732J690566J853407J732528J472294
3526.5F95442736J431823J545310J670480J821696J795769J622617J785458K177775
3542.8G09293664K185940J693547J374185J567900J774907J764536J781106J931429
3559.1G23367214K075851K146721K252460K235412J887798J681746J879692K125024
3575.4G39651918K232433K377748K593458K786696K856731K558351K121329K112210
3591.7G59290874K338231K404630K417147K424061K283514K212107K377331K534271
3608.1G78282166K428174K210080K057135K031386K147436J907111J396775J471936
3624.4G93932199K028943K201557J352608O97851Q87036J068295J059889J106263J211941
$$ plain form
3642.7 805546582 807009041 808852136 810565650 811122596 810890913 811010718 811564445 811973691 812167764
3661.1 812167764 812367320 812832773 813712716 814668119 815214574 815589726 815862060 815453589 814758062 814472616
3681.5 814472616 814708889 815502346 816759467 817572534 817347646 816902161 816788137 816946745 817318857
3699.8 817318857 817686737 817765832 817868173 818389416 819090664 819302797 818838954 818353415 818305016 818572044
3720.2 818572044 818827689 818873882 818732679 818722725 819204926 820039809 820608199 820521235 820050120 819762409
3740.6 819762409 819976807 820375979 820481002 820578694 820551336 819904447 819169581 818905652 818859160 818595707
3761 818595707 818334520 818377078 818521380 818514287 818193376 817755997 817668676 817941606 818105757 817879558 817604482
3783.5 817604482 817488253 817335248 817147613 817107797 817310035 817642927 817876279 818084717 818249226 818059087
$$ packed form
3642.7H05546582J462459J843095J713514N56946k31683J19805N53727M09246J94073
3661.1H12167764J99556M65453Q79943R55403N46455L75152K72334m08471o95527k85446
3681.5H14472616K36273P93457J257121Q13067k24888m45485j14024J58608L72112
3699.8H17318857L67880P9095J02341N21243P01248K12133m63843m85539m8399K67028
3720.2H18572044K55645M6193j41203r954M82201Q34883N68390q6964m71115k87711
3740.6H19762409K14398L99172J05023R7692k7358o46889p34866k63929m6492k63453
3761H18595707k61187M2558J44302p093l20911m37379q7321K72930J64151k26199k75076
3783.5H17604482j16229j53005j87635l9816K02238L32892K33352K08438J64509j90139
$$ plain form
3803.9 818059087 817714512 817323029 816916049 816865325 817237198 817701578 818005860 818166673 817915142 817289710
3824.3 817289710 816831231 816671312 816750348 817017555 817369282 817689240 817701638 817301333 816768229 816287637
3844.6 816287637 816014707 816210747 816914797 817589462 817295432 816401899 815837920 815774381 815936267 816020906
3865 816020906 816086113 816226006 816086948 815599144 815174520 815043032 815177083 815256715 815209508 815153241 814897358
3887.5 814897358 814653933 814600348 814431369 814281285 814489603 814884663 815088987 814891219 814286649 813593090
3907.9 813593090 813189447 813163877 813359797 813607812 813722849 813628376 813475728 813334584 813162386 813095927
3928.3 813095927 813221931 813294053 813136220 812918186 812846303 812910736 812957883 812899232 812835217 812834024 812750936
3950.7 812750936 812574506 812479734 812471986 812465012 812440276 812369764 812261164 812177300 812144518 812161744 812203646
$$ packed form
3803.9H18059087l44575l91483m06980n0724L71873M64380L04282J60813k51531o25432
3824.3H17289710m58479j59919P9036K67207L51727L19958J2398m00305n33104m80592
3844.6H16287637k72930J96040P04050O74665k94030q93533n63979o3539J61886Q4639
3865H16020906O5207J39893j39058m87804m24624j31488J34051P9632m7207n6267k55883
3887.5H14897358k43425n3585j68979j50084K08318L95060K04324j97768o04570o93559
3907.9H13593090m03643k5570J95920K48015J15037r4473j52648j41144j72198o6459
3928.3H13095927J26004P2122j57833k18034p1883O4433M7147n8651o4015j193q3088
3950.7H12750936j76430r4772p748o974k4736p0512j08600q3864l2782J7226M1902
$$ plain form
3973.1 812203646 812196672 812085509 811946094 811901093 811912239 811857820 811771393 811737239 811728954 811700284 811650395
3995.6 811650395 811611533
3997.6 811611533
$$ packed form
3973.1H12203646o974j11163j39415m5001J1146n4419q6427l4154q285k8670m9889
3995.6H11650395l8862
3997.6H11611533
##END=$$ End of the data block
