##TITLE=1 $$ Begin of the data block
##JCAMP-DX=5.00 $$ ACD/SpecManager v 10.08
##SPECTROMETER/DATA SYSTEM=Alpha
##DATE=16 Apr 2014 10:35:00
##DATA TYPE=INFRARED SPECTRUM
##DATA CLASS=XYDATA
##ORIGIN=
##OWNER=
##NPOINTS=1765
##FIRSTX=399.75695801
##LASTX=3997.56933594
##MAXX=3997.56933594
##MINX=399.75695801
##MAXY=0.87751651
##MINY=0.39601269
##XFACTOR=1.0000000000
##YFACTOR=1.000000000000000e-9
##FIRSTY=0.74170196
##DELTAX=2.03957629
##XUNITS=1/CM
##YUNITS=ARBITRARY UNITS
##XYDATA=(X++(Y..Y))
399.8 741701961 741641998 741592824 739893317 737879515 737727523 738780141 738633990 737212121 736274362
418.1 736274362 736520767 736246288 734226406 731850684 731253564 731822729 731230259 729200900 728082478
436.5 728082478 729277968 730733216 729825616 727469981 726840675 728054821 728302598 726517975 724982619
454.8 724982619 725686550 726876557 725829184 723678172 723354518 724719286 724702060 722376943 720295250
473.2 720295250 720498085 721362948 720309317 717868030 716911077 717960298 718377709 716758966 714959800
491.5 714959800 715158999 716420591 716266572 714526415 713456213 714123666 714558423 713105559 711230099
509.9 711230099 711353838 713170826 714066267 712885797 711684108 712496221 714024305 713608444 711547375
528.3 711547375 710654736 711667538 712322831 711055040 709543586 710016727 711790681 712334514 711098969
546.6 711098969 710355222 711514771 712833762 712257087 710741222 710772812 712543368 713698566 712975502
565 712975502 712088406 713019550 714943409 715551257 714648902 714418650 715964913 717541695 717343569 716317534
585.4 716317534 716692984 718510985 719510138 718723714 718089461 719233930 720836341 720722616 719274104
603.7 719274104 718841851 720044315 720835030 719741583 718156338 718255162 719765067 720448732 719772696
622.1 719772696 719706118 721534312 723857760 724667490 724491179 725579858 728188813 730133057 730219960
640.4 730219960 729974210 731223464 733345807 734309912 733823121 733834147 735565960 737635791 738161385
658.8 738161385 737600088 738048136 739756525 741021872 740944445 741294503 743063033 745621443 747178793
677.1 747178793 747232854 747667968 749738455 752131224 752980828 752688169 753297389 755307317 756910086
695.5 756910086 756743491 755968094 756490290 758012414 758403659 756932378 755412698 755434513 755945981
713.8 755945981 754934728 752620935 751074374 751026630 750794470 749020338 746968389 746958494 749110699
732.2 749110699 751376212 752804279 754740357 758217812 761872113 763518333 763277531 763447583 765015423
750.6 765015423 766363859 766077399 765367866 766251922 768385887 769506574 768844604 768412232 769947946
768.9 769947946 772328734 773395896 773245096 773965120 776293635 778478801 778934419 778485417 778772831
787.3 778772831 779401481 778444767 775583446 772943437 772333086 772949755 772909701 772220433 772540331 774206877
807.7 774206877 775325716 774278760 771946311 770335674 769587278 768152654 765600502 763484120 763166070
826 763166070 763836861 763731837 762851179 762954712 764720678 766697824 767665386 768527389 770974636 774995744
846.4 774995744 778864384 781653643 784524441 788704395 793381095 796873569 799085081 801484168
862.7 801484168 804803252 807889581 809472799 810221672 811848342 814688742 817446172 819319785 821237087
881.1 821237087 824318469 827930987 830402195 831399560 832333982 834149301 835962772 836582839 836415648
899.4 836415648 836851239 838130653 839005768 838686347 838025808 838193595 838914573 838941932 837940991 836972415
919.8 836972415 836966932 837361813 836911857 835562289 834522188 834336579 834031880 832651854 830746174
938.2 830746174 829531968 829002142 827968359 825899899 823702514 822293222 821138561 819023192 815858483
956.6 815858483 812724292 810193777 807515740 803788483 799416065 795579255 792504609 789259851
972.9 789259851 785293460 781294346 778057277 775179684 771657646 767407954 763337135 759951591
989.2 759951591 756652713 752651095 748202860 744272351 741052806 737711072 733654320 729344785
1005.5 729344785 725420117 721323252 715583742 707420766 697381318 686454475 675086319 663322270
1021.8 663322270 651551008 640568078 631043613 623170495 616970181 612784207 611020029 611546516
1038.1 611546516 613742888 617098451 621532321 626948535 632641375 637465119 640648186 642158985
1054.5 642158985 642169952 640703499 638038933 635180831 633517504 633859217 636041760 639502645 643924832
1072.8 643924832 649065256 654203117 658295155 660754025 661744058 661667764 660561800 658235192 654890358
1091.2 654890358 651218116 647760272 644494772 641314805 638577759 636918068 636593938 637283087 638642013
1109.5 638642013 640749753 643789291 647550166 651467025 655083001 658363461 661406994 664033234
1125.8 664033234 666002572 667471766 668667018 669213355 668307722 665567279 661644042 657928884 655652344
1144.2 655652344 655433595 657452285 661677182 667841733 675185502 682584584 689202487 694756746
1160.5 694756746 699156463 702084899 703111529 702238202 699959517 696675360 692415178 687206209
1176.8 687206209 681415915 675603926 670049191 664607406 659201086 654172122 649957359 646646023
1193.1 646646023 644024312 642019749 640903711 640920699 641906440 643463373 645468712 648098052 651313484
1211.5 651313484 654650450 657616258 660147488 662456810 664513528 665955544 666580856 666700840 666796207
1229.9 666796207 666994452 667177022 667459249 668205202 669572830 671299636 673009396 674649954 676457047
1248.2 676457047 678444624 680289984 681750834 682918012 683978558 684847832 685252428 685105979 684606791
1266.6 684606791 683884621 682720959 680794537 678134620 675094187 671959341 668819606 665793180
1282.9 665793180 663250625 661563516 660733223 660378695 660121620 659853935 659562290 659059227 658039927
1301.2 658039927 656454444 654594183 652706623 650743008 648606598 646380007 644375563 642786682
1317.6 642786682 641418576 640017331 638591468 637327492 636243999 635113955 633793592 632526219
1333.9 632526219 631592214 630943179 630360842 629977882 630259216 631447554 633404613 635817826 638572693
1352.2 638572693 641721189 645187378 648635566 651864111 654856086 657528281 660005391 662431777
1368.5 662431777 664746583 667218626 670118570 673206687 676420987 679822922 683641493 688486576
1384.9 688486576 694522619 700604737 705934465 711386442 717350483 722974837 728018343 732686102
1401.2 732686102 737282395 741922498 745878279 748951077 751357257 753010094 753754020 752981901 749497354
1419.5 749497354 743668854 735856652 725417078 712591231 697126448 680497944 665095627 649512529
1435.9 649512529 634284735 623515487 616867721 613426685 613223851 615858316 620732784 627368987
1452.2 627368987 635887206 648153484 663058937 675145149 686103940 698545277 710866868
1466.4 710866868 721303642 731775105 743795633 754682958 762732208 769106090 774585843 779275060
1482.8 779275060 782908618 785510361 786908150 786803186 785923898 784804225 783024549 780610919 778457463
1501.1 778457463 777014852 775438786 771342397 765538514 760177672 755339801 751323819 748529494
1517.4 748529494 747606635 748120725 748345971 747398615 745322347 742964089 741116762 739729702 739356637
1535.8 739356637 741146803 745567143 750316918 753959656 757524490 761725605 767036974 773164511
1552.1 773164511 779780209 786623061 794038534 799372375 800570726 800252020 799089968 796549261
1568.4 796549261 791980982 786402285 779605269 769291103 757308781 744856417 730032682 712727368
1584.7 712727368 693524182 672702610 650634766 628025949 605632544 584623218 565963149
1599 565963149 549859345 536486804 526260912 519061387 514400661 511952400 511586785 513538480
1615.3 513538480 518114209 524078131 531454682 541265011 552180111 563926756 576921523 590184033
1631.6 590184033 605406046 625645876 645424187 661284208 676037312 690365970 705614328
1645.9 705614328 719871104 729743540 739766538 751691401 759348452 765199780 771715045 778706193
1662.2 778706193 785199642 790823162 796631575 802227497 806621492 810945511 815235496 818576217
1678.6 818576217 821691811 825339496 829040170 831193447 832551599 834067166 835889161 838295102
1694.9 838295102 840631843 842230737 843155026 843778193 844629526 845382094 845815718 846553206 847920537
1713.2 847920537 849626899 850844562 851046860 851229131 851952136 852882385 853774846 854825497 856175900
1731.6 856175900 857590258 858226001 858460248 859007418 859757841 860630810 861651361 862814546 864012480
1749.9 864012480 865051389 865981162 866943955 867797494 868622005 869472623 870054841 870547473 871208966
1768.3 871208966 872073829 872750282 872774839 872571409 872674942 873067439 873464465 873680711 873738229 874051273
1788.7 874051273 874809325 875384808 875309169 875159025 875372887 875771821 875944853 875859439 875857413 876159787
1809.1 876159787 876532078 876606882 876463830 876391351 876573741 876936078 877204180 877215326 877271771 877516508
1829.5 877516508 877473235 877093136 876780093 876750171 876987338 877320707 877382874 877059102 876840830 876822650
1849.9 876822650 876678169 876367450 876202226 876327693 876448572 876288354 876102507 876300633 876662195 876510322
1870.3 876510322 875912368 875488877 875471711 875601828 875514030 875243723 875140846 875351667 875542283 875299394
1890.7 875299394 874885142 874779880 874879122 874819040 874519408 874225795 874212861 874357939 874276638 873919666
1911.1 873919666 873663783 873755455 873901606 873687446 873298705 873082876 873009145 872875750 872575283 872268319
1931.5 872268319 872160137 872151256 872014880 871795058 871686459 871626258 871441722 871114433 870766282 870572507
1951.9 870572507 870531976 870438397 870173454 869888723 869766653 869779587 869711518 869415820 869072855 868905008
1972.3 868905008 868843198 868690491 868411183 868172348 868099749 868062973 867885888 867636859 867509127 867465734
1992.6 867465734 867311060 867032111 866766393 866647542 866630316 866518378 866252601 865990460 865880907 865871787
2013 865871787 865791619 865572631 865361929 865284801 865234792 865049601 864773512 864611804 864612579 864579618 864392698
2035.5 864392698 864200950 864180624 864234984 864151001 863943875 863800108 863783658 863763511 863643169 863513947
2055.9 863513947 863519192 863628566 863660455 863541305 863404274 863398075 863467991 863464594 863374293 863318741 863363922
2078.3 863363922 863421381 863387465 863300502 863290846 863368332 863410175 863357544 863275290 863265574 863344193 863396466 863365650
2102.8 863365650 863327026 863344371 863388896 863391399 863369644 863382459 863433361 863475680 863475502 863471389 863498211 863542795
2127.3 863542795 863573611 863564074 863544345 863565683 863616109 863631368 863593280 863552690 863531232 863507926 863482893 863449991
2151.7 863449991 863408506 863397479 863413990 863401890 863337755 863253415 863191366 863136828 863076627 863032162 863016784
2174.2 863016784 863013506 862970769 862877667 862796545 862784922 862804055 862773240 862705946 862659395 862630725 862586319 862528741
2198.6 862528741 862473488 862422407 862398088 862402141 862393737 862354934 862302721 862255156 862222135 862188280 862133980 862085104
2223.1 862085104 862061560 862025797 861954331 861897171 861892164 861886203 861833394 861730158 861600876 861508489 861441791
2245.6 861441791 861347079 861241221 861133575 861017883 860922277 860828757 860695243 860549033 860437214 860338509
2265.9 860338509 860195637 860030472 859932423 859908760 859836638 859670341 859542608 859522998 859492779 859341681
2286.3 859341681 859127104 858948648 858829796 858719230 858518302 858258486 858067751 857927144 857712150 857401311
2306.7 857401311 857086778 856846631 856639981 856334031 855909467 855497062 855174899 854891300 854565144 854170382
2327.1 854170382 853779376 853473186 853173733 852790952 852417588 852113068 851823986 851636708 851689458 851811945
2347.5 851811945 851698279 851254821 850578070 849880040 849379838 849077821 848871946 848799586 848820090 848857164
2367.9 848857164 848941445 849059582 849154472 849206150 849226594 849227667 849180579 849080324 848941565 848745465 848468602
2390.4 848468602 848130941 847788215 847458303 847129583 846805573 846473396 846118629 845772684 845441937 845090806
2410.8 845090806 844723344 844365835 844041049 843740702 843420565 843068123 842715740 842401445 842124164 841834784
2431.2 841834784 841520607 841233552 840988934 840759933 840499461 840179086 839868784 839614511 839359522 839054286
2451.5 839054286 838720560 838409901 838117838 837791622 837433398 837093890 836782038 836472869 836131215 835755944
2471.9 835755944 835406721 835104704 834780753 834375143 833943248 833588600 833285689 832920194 832499206 832094371
2492.3 832094371 831711531 831339002 830962241 830578506 830211818 829858959 829461217 828992128 828520179 828109443
2512.7 828109443 827756763 827388763 826925397 826425433 825992167 825584233 825105011 824552476 824011028 823540390
2533.1 823540390 823098898 822590530 822032571 821533620 821079850 820575237 820013344 819462836 818968356 818508804
2553.5 818508804 818010032 817450047 816906571 816446722 816023350 815515339 814952075 814492404 814129770 813719869
2573.9 813719869 813223541 812739193 812372684 812099576 811781585 811369836 810971141 810668945 810394466 810046017
2594.3 810046017 809648693 809290409 808985710 808666766 808294296 807900727 807524025 807166636 806784570 806353450
2614.7 806353450 805938900 805584610 805201113 804721773 804261684 803916693 803587675 803160191 802663505 802205026
2635.1 802205026 801833868 801480770 801039457 800531864 800090969 799729407 799344957 798895299 798442364 798069119
2655.5 798069119 797740877 797336400 796839952 796388924 796038330 795671821 795226276 794785321 794433594 794126749
2675.9 794126749 793761253 793317616 792887688 792548418 792235613 791851878 791418433 791034520 790741563 790453613
2696.3 790453613 790092587 789727211 789450407 789202213 788866341 788477540 788171947 787989318 787820995 787554085
2716.7 787554085 787243605 787032485 786924303 786789834 786545932 786277711 786131918 786061347 785926223 785737395
2737.1 785737395 785579801 785486937 785402596 785265386 785124004 785056949 785033047 784938931 784752071 784566939
2757.5 784566939 784451663 784371495 784238100 784051061 783904314 783811390 783698976 783525586 783314288 783134043
2777.9 783134043 782985091 782761455 782429814 782139242 781984806 781795681 781419098 780939698 780496597 780112982
2798.3 780112982 779672265 779098451 778484285 777945936 777457476 776862860 776108921 775341690 774660408 773990989
2818.7 773990989 773241520 772449017 771697879 770964265 770157635 769255579 768319368 767393112 766407669 765163243
2839.1 765163243 763554037 761736572 759833038 757813811 755784512 754065216 752934456 752362728
2855.4 752362728 752087891 751848221 751491129 750999212 750352979 749456108 748360574 747296274 746336401
2873.7 746336401 745329738 744204581 743048429 741913378 740770817 739546537 738180757 736767828
2890.1 736767828 735429883 734105647 732678115 731188357 729793906 728538930 727300465 725966513
2906.4 725966513 724515259 722967327 721269548 719283521 717072546 714974105 713253379 711962879
2922.7 711962879 711041510 710491061 710372925 710565209 710890293 711300552 711776018 712313950 712925434 713471711
2943.1 713471711 713712156 713601172 713286638 712844372 712159932 711186171 710134506 709203720 708341777
2961.4 708341777 707347155 706199288 705066741 703994036 702986419 702172339 701701164 701681972 702004671
2979.8 702004671 702302873 702406645 702451527 702499211 702476561 702237308 701663911 700902820 700075209 699082553
3000.2 699082553 697943926 696794987 695700526 694680750 693699658 692608535 691304982 689837396
3016.5 689837396 688267708 686618209 684936225 683255017 681528091 679733336 677919567 676126957
3032.8 676126957 674291015 672360182 670470953 668677211 666829407 664856195 662845135 660934329
3049.1 660934329 659114778 657263637 655401409 653555095 651688457 649879694 648204982 646607280
3065.5 646607280 644927323 643085480 641218364 639486969 637958288 636531055 634934843 633113086
3081.8 633113086 631233752 629354775 627483547 625611603 623658478 621672273 619793713 617995977
3098.1 617995977 616107225 614051521 611977339 610055983 608188510 606160879 604138374 602375388
3114.4 602375388 600646973 598688185 596492648 594131112 591796637 589647472 587634563 585634828
3130.7 585634828 583600998 581593513 579701722 577855706 575854123 573718548 571617782 569613338
3147 569613338 567799270 566150784 564332128 562200069 560026407 557997763 556086361 554216802 552307069
3165.4 552307069 550371230 548490942 546655715 544797122 542926550 541072607 539238036 537433386
3181.7 537433386 535654187 533861578 532050490 530258179 528482497 526731491 525030255 523365378
3198 523365378 521718383 520093501 518490791 516919374 515385449 513888955 512429118 510978281 509542704
3216.4 509542704 508153379 506783724 505392909 504009068 502689660 501442015 500239253 499050647
3232.7 499050647 497823864 496580213 495402396 494275659 493180245 492137939 491102666 490031749
3249 490031749 488971025 487983704 487046361 486093938 485127240 484162450 483213693 482299745 481464595 480740577
3269.4 480740577 479963034 479013979 477988839 476951301 475941420 474974960 474010795 473056048 472157359
3287.8 472157359 471354693 470557153 469607443 468494564 467278510 466098189 465140015 464371145 463486463
3306.1 463486463 462233424 460682958 459099203 457663357 456343830 455056578 453772813 452503234
3322.4 452503234 451227099 449765861 448110014 446535736 445110351 443751037 442463219 441069931
3338.8 441069931 439426929 437682539 435927302 434270024 432826430 431283593 429379433 427402049
3355.1 427402049 425652474 424078286 422473609 420858353 419503599 418326765 416850299 414904565
3371.4 414904565 412921250 411315620 409963012 408626795 407270938 406013727 404972970 404220551
3387.7 404220551 403795034 403315932 402376473 401345968 400805682 400557429 399895459 398796767 397960305
3406.1 397960305 397612959 397430211 397155702 396703362 396237433 396022469 396012694 396042258 396186590 396575153
3426.5 396575153 397165358 397770822 398435742 399282098 400026321 400448382 400907755 401762545 402929723
3444.8 402929723 404205173 405460596 406765401 408201605 409742594 411447674 413320392 415135384
3461.1 415135384 416964889 419173360 421587020 423646599 425251871 426911771 428963423 431331456
3477.4 431331456 433742195 435911596 438050985 440502644 443040282 445450574 447952896 450673759
3493.8 450673759 453542948 456367940 459138393 462031960 464853257 467457503 470213652 473325104
3510.1 473325104 476644158 479926586 483041257 486192375 489625573 493408889 497184992 500639737
3526.4 500639737 504053414 507679522 511513710 515573621 519665420 523577631 527653635 532113254
3542.7 532113254 536594629 540693641 544581294 548690677 552969158 557153106 561346829 565741479
3559 565741479 570215702 574576735 579015732 583789527 588364124 592418373 596419334 600664675 605086327
3577.4 605086327 609626889 614233613 618811905 623440027 628095090 632469416 636611402 640964210
3593.7 640964210 645598590 650341511 655148029 659920573 664583862 669349492 674524665 679840624
3610 679840624 685032606 690166533 695246160 700712860 706488013 711657941 716407895 721631050 727975249
3628.4 727975249 734270751 739388585 744419098 749718308 755017281 760277152 765389025 770413399
3644.7 770413399 775811791 781784177 786911547 790443540 793860495 797932863 801710904 804826558
3661 804826558 807657897 810386658 813150942 816016436 818479359 820376217 822250247 823725164 824714720
3679.4 824714720 825759470 826977968 828443587 830290675 831886292 832477391 832715333 833201885 833848596
3697.7 833848596 834547997 835253775 835765898 836215138 836882830 837640882 838037848 838015974 838013172 838180542
3718.1 838180542 838433564 838676751 838838220 838918567 838994622 839263916 839861095 840479255 840637565 840362728
3738.5 840362728 840093374 840188563 840514362 840593457 840653718 840860486 840719104 840362072 840208828 840177715
3758.9 840177715 840017140 839830279 839814246 839850664 839813530 839638412 839382172 839306891 839488745 839589000
3779.3 839589000 839372575 839118004 838943839 838778138 838658571 838572085 838587642 838758349 838890195 838966072
3799.7 838966072 838990450 838766396 838492274 838223398 837870359 837702334 837867916 838142991 838259101 838224351
3820.1 838224351 837883413 837316751 836934566 836796284 836790740 836864412 837021589 837176263 837078094 836689413
3840.5 836689413 836257815 835927546 835659921 835504115 835653961 835978627 835817575 835258842 834851563 834752560
3860.9 834752560 834805012 834685683 834485948 834471345 834412754 834089398 833721220 833579063 833693922 833716214
3881.3 833716214 833537877 833348334 833083093 832898200 832816184 832547545 832287252 832329273 832533419 832594812
3901.7 832594812 832403660 832039177 831654072 831373274 831228793 831228256 831329942 831361651 831201255 830949128
3922.1 830949128 830797434 830766439 830731928 830652833 830595255 830543101 830376267 830177486 830114722 830130577 830086052
3944.5 830086052 830004573 829928756 829811513 829670370 829562664 829487443 829403758 829327822 829303086 829264462 829183996
3966.9 829183996 829145372 829125762 829045236 828944981 828845084 828722775 828656495 828684270 828686118 828630209 828602076
3989.4 828602076 828564882 828481853 828422189 828383207
3997.5 828383207
##END=$$ End of the data block
