##TITLE=$$ Begin of the data block
##JCAMP-DX=5.00 $$ ACD/SpecManager v 10.08
##SPECTROMETER/DATA SYSTEM=Alpha
##DATE=23 Dec 2014 09:14:34
##DATA TYPE=INFRARED SPECTRUM
##DATA CLASS=XYDATA
##ORIGIN=
##OWNER=
##NPOINTS=1765
##FIRSTX=399.76428223
##LASTX=3997.64306641
##MAXX=3997.64306641
##MINX=399.76428223
##MAXY=0.81498271
##MINY=0.23241661
##XFACTOR=1.0000000000
##YFACTOR=1.000000000000000e-9
##FIRSTY=0.52808040
##DELTAX=2.03961372
##XUNITS=1/CM
##YUNITS=ARBITRARY UNITS
##XYDATA=(X++(Y..Y))
$$ plain form
399.8 528080404 523703992 520531595 519048154 518471897 518465757 519878924 522517860 524645686 524442315
418.1 524442315 522203743 520750523 519967556 518177688 515099585 511880219 509456396 507767856 506242037
436.5 506242037 505225718 506398380 510904670 517029345 521643221 524081588 526119471 528769612
452.8 528769612 530347049 529357851 527103007 525813997 525252938 523592174 519859254 515421808 512151837
471.2 512151837 509998798 507547498 504410863 502032697 501489043 501781225 501464486 500703096 500674963
489.5 500674963 501408160 501165032 498804271 495699614 493737906 492751509 490996391 487576842 483654946
507.9 483654946 480650306 477970213 474142641 468930095 463691264 459838450 457171500 454715520
524.2 454715520 452308863 451119721 451860696 453754336 455908775 458792746 463696867 470450550 476621181
$$ packed form
399.8E28080404m376412l172397j483441n76257o140J413167K638936K127826k03371
418.1E24442315k238572j453220p82967j789868l078103l219366k423823j688540j525819
436.5E06242037j016319J172662M506290O124675M613876K438367K037883K650141
452.8E28769612J577437r89198k254844j289010n61059j660764l732920m437446l269971
471.2E12151837k153039k451300l136635k378166n43654K92182l16739p61390k8133
489.5E00674963P33197k43128k360761l104657j961708r86397j755118l419549l921896
507.9D83654946l004640k680093l827572n212546n238831l852814k666950k455980
524.2D54715520k406657j189142P40975J893640K154439K883971M904121O753683O170631
$$ plain form
542.5 476621181 480068803 481230199 481729031 481879473 480586141 477485299 473780930 470340252 466508657
560.9 466508657 461126536 454134107 446590424 439595640 433917522 429959834 428101927 429154336
577.2 429154336 433500975 440140277 447434038 454430729 461088091 467127413 471474558 473300844
593.5 473300844 473357618 473251760 473617941 473732442 473032415 472238988 472513169 473927826 475314081 476220250
613.9 476220250 477730542 480820894 485056728 489210129 492657065 495882928 499654651 503497124
630.2 503497124 506130397 507519186 508958757 511057973 513104141 514268637 514637589 515253961 516836286
648.6 516836286 518638968 519570410 519900799 520734787 522336602 523823142 524468720 524700224 525739729
667 525739729 528190017 529985249 530684531 531328499 532915950 535315454 537211120 537973344 538456619
$$ packed form
542.5D76621181L447622J161396M98832J50442j293332l100842l704369l440678l831595
560.9D66508657n382121o992429p543683o994784n678118l957688j857907J052409
577.2D29154336M346639O639302P293761O996691O657362O039322M347145J826286
593.5D73300844N6774j05858L66181J14501p00027p93427K74181J414657J386255R06169
613.9D76220250J510292L090352M235834M153401L446936L225863L771723L842473
630.2E03497124K633273J388789J439571K099216K046168J164496L68952O16372J582325
648.6E16836286J802682R31442L30389Q33988J601815J486540O45578K31504J039505
667E25739729K450288J795232O99282O43968J587451K399504J895666P62224M83275
$$ plain form
685.3 538456619 539576411 540928185 541175187 539718449 537534118 535687387 533760965 530636430 526527822
703.7 526527822 523278177 522264838 522927999 524079919 525766671 529087782 534493327 540885508 546676755
722 546676755 551798046 557532012 564204991 570351064 574530780 577275932 580304742 583835125 586179852
740.4 586179852 586135328 584484339 582716227 580888331 577512801 571971953 565850198 560956478 557195246
758.7 557195246 553329647 549347937 547067165 548102915 552074373 557389915 563435078 571208239
775.1 571208239 581290483 591902792 600397170 606481850 612170160 618470550 624065161 627616823
791.4 627616823 630118668 633921444 639642954 645320952 649146914 651854515 655376017 659772873
807.7 659772873 662947237 663788617 663977861 665595829 668008506 668740690 667096734 665002763 663909733
$$ packed form
685.3E38456619J119792J351774K47002j456738k184331j846731j926422l124535m108608
703.7E26527822l249645j013339O63161J151920J686752L321111N405545O392181N791247
722E46676755N121291N733966O672979O146073M179716K745152L028810L530383K344727
740.4E86179852m4524j650989j768112j827896l375530n540848o121755m893720l761232
758.7E57195246l865599l981710k280772J035750L971458N315542O045163P773161
775.1E71208239J0082244J0612309Q494378O084680N688310O300390N594611L551662
791.4F27616823K501845L802776N721510N677998L825962K707601L521502M396856
807.7F59772873L174364Q41380J89244J617968K412677P32184j643956k093971j093030
$$ plain form
826 663909733 662562191 658740163 652478755 646187007 641378582 636982739 631463528 625352025 620543897
844.4 620543897 617565811 614745796 610427737 605061352 600173175 596026897 591904104 588774562
860.7 588774562 589701176 596585214 607944310 620683849 632817745 644125938 654697180 663130760
877 663130760 667213142 666515946 663097262 659057260 654300094 647747755 639931977 632937729 627909005
895.4 627909005 623670757 618433237 612161160 606103301 600439787 593706071 584671736 574012876
911.7 574012876 563376606 553312004 543376148 533828437 526134253 521626770 519963086 519520402
928 519520402 519383073 520213068 523007929 527543366 532576203 537468672 542504787 547149301 549140930
946.4 549140930 546199381 538184404 526919425 514099836 499969006 484062135 466628671 448625952
$$ packed form
826F63909733j347542l822028o261408o291748m808425m395843n519211o111503m808128
844.4F20543897k978086k820015m318059n366385m888177m146278m122793l129542
860.7E88774562R26614O884038J1359096J2739539J2133896J1308193J0571242Q433580
877F63130760M082382o97196l418684m040002m757166o552339p815778o994248n028724
895.4F27909005m238248n237520o272077o057859n663514o733716r034335j0658860
911.7E74012876j0636270j0064602r935856r547711p694184m507483j663684m42684
928E19520402j37329Q29995K794861M535437N032837M892469N036115M644514J991629
946.4E49140930k941549q014977j1264979j2819589j4130830j5906871j7433464j8002719
$$ plain form
962.7 448625952 430504739 411801964 392050922 371567547 351122558 331213653 312004983
977 312004983 293844491 277488410 263733566 252967924 244983703 239207953 235256150 233060926
993.3 233060926 232416615 232725188 233388305 234156162 234994411 235702157 235866725 235307530 234350592 233660251
1013.7 233660251 233725935 234581366 236032337 238094628 240995571 244696766 248771474 252775282 256532609
1032 256532609 260000020 262956113 264964908 265911609 266385406 267157763 268474281 270238519 272685796
1050.4 272685796 276482910 282106310 289376438 297789276 307157189 317707121 328946233 338305444
1066.7 338305444 341689259 336732626 325642109 313636273 304714650 299766034 298110157 299151391
1083 299151391 302412421 307186872 312780201 318921477 325563639 332219630 337824076 341466069 343170822
$$ packed form
962.7D48625952j8121213j8702775j9751042k0483375k0444989j9908905j9208670
977C12004983j8160492j6356081j3754844j0765642p984221n775750l951803k195224
993.3B33060926o44311L08573O63117P67857Q38249P07746J64568n59195r56938o90341
1013.7B33660251O5684Q55431J450971K062291K900943L701195M074708M003808L757327
1032B56532609L467411K956093K008795R46701M73797P72357J316518J764238K447277
1050.4B72685796L797114N623400P270128Q412838R367913J0549932J1239112R359211
1066.7C38305444L383815m956633j1090517j2005836q921623m948616j655877J041234
1083B99151391L261030M774451N593329O141276O642162O655991N604446L641993J704753
$$ plain form
1101.4 343170822 343960911 345080972 347173870 350192994 353915334 358200908 362659603 366499126
1117.7 366499126 369130194 370799601 372399241 374763995 378167897 382416278 386979848 390887320
1134 390887320 392746240 391251534 386133343 378446251 369714350 360995412 352829337 345664352 340076119
1152.4 340076119 336487561 334809452 334643334 335854143 338864654 344213605 351953328 361676902
1168.7 361676902 373011589 385818422 399899095 414627850 429187536 443178654 456672907
1183 456672907 469667315 481592625 491567671 499227822 505002975 509457648 512743890 514852881
1199.3 514852881 516224623 517768919 520126820 523235321 526814938 530984163 536020100 541704535
1215.6 541704535 547123134 551284909 553958118 555522382 556171954 555731654 554189503 552071631 550101578
$$ packed form
1101.4C43170822P90089J120061K092898L019124L722340M285574M458695L839523
1117.7C66499126K631068J669407J599640K364754L403902M248381M563570L907472
1134C90887320J858920j494706n118191p687092q731901q718938q166075p164985n588233
1152.4C40076119l588558j678109j66118J210809L010511N348951P739723R723574
1168.7C61676902J1334687J2806833J4080673J4728755J4559686J3991118J3494253
1183D56672907J2994408J1925310R975046P660151N775153M454673L286242K108991
1199.3E14852881J371742J544296K357901L108501L579617M169225N035937N684435
1215.6E41704535N418599M161775K673209J564264O49572m40300j542151k117872j970053
$$ plain form
1234 550101578 548511028 546960473 545305550 544070184 543941796 545004010 546653032 548385918 550288022
1252.3 550288022 552498579 554670691 556245446 557124794 557874799 559181988 561151803 563298404 565237701
1270.7 565237701 566955149 568376660 569136620 568910897 567905784 566784501 565966606 565225124 564116716
1289 564116716 562595904 560973465 559394002 557603478 555375695 552973807 550892830 549217880 547561884
1307.4 547561884 545730889 544019222 542752028 541804671 540670276 538976431 536650181 533599913
1323.7 533599913 529584527 524463415 518566370 512733281 507796645 504041374 501291156 499495625
1340 499495625 498837531 499136239 499833435 500281453 500153959 499660313 499078780 498423249 497525394 496280402
1360.4 496280402 494943857 494133115 493817091 493562192 493458331 493805617 494794488 496146739 497296184
$$ packed form
1234E50101578j590550j550555j654923j235366j28388J062214J649022J732886J902104
1252.3E50288022K210557K172112J574755Q79348P50005J307189J969815K146601J939297
1270.7E65237701J717448J421511P59960k25723j005113j121283q17895p41482j108408
1289E64116716j520812j622439j579463j790524k227783k401888k080977j674950j655996
1307.4E47561884j830995j711667j267194r47357j134395j693845k326250l050268
1323.7E33599913m015386n121112n897045n833089m936636l755271k750218j795531
1340D99495625o58094K98708O97196M48018j27494m93646n81533o55531q97855j244992
1360.4D96280402j336545q10742l16024k54899j03861L47286R88871J352251J149445
$$ plain form
1378.8 497296184 498154610 499382824 501902461 506082773 510725141 514201641 516359031 517506123
1395.1 517506123 517764568 517087042 515826225 514325321 512603462 510860324 508941710 506736517 504775941
1413.5 504775941 503429711 502324998 501294911 500912309 501252413 502160788 503391564 504652917 506004155
1431.8 506004155 507581294 509586215 511957169 513979137 515630841 517057955 518139303 518484175
1448.1 518484175 517897666 516710818 515263736 513094246 510869384 510565460 511524916 513787925 517785609
1466.5 517785609 522790492 528991818 537965655 548428059 558021069 566526830 574193478 581418693
1482.8 581418693 588126600 594565749 601010501 607080519 611996651 616444349 621309042 625867069
1499.1 625867069 629470646 632346630 635128558 638744056 642159045 644661486 646885455 649224102
$$ packed form
1378.8D97296184Q58426J228214K519637M180312M642368L476500K157390J147092
1395.1E17506123K58445o77526j260817j500904j721859j743138j918614k205193j960576
1413.5E04775941j346230j104713j030087l82602L40104R08375J230776J261353J351238
1431.8E06004155J577139K004921K370954K021968J651704J427114J081348L44872
1448.1E18484175n86509j186848j447082k169490k224862l03924R59456K263009L997684
1466.5E17785609N004883O201326Q973837J0462404R593010Q505761P666648P225215
1482.8E81418693O707907O439149O444752O070018M916132M447698M864693M558027
1499.1F25867069L603577K875984K781928L615498L414989K502441K223969K338647
$$ plain form
1515.4 649224102 651763380 653848827 655444801 657247245 659288347 661290824 662832022 663815916
1531.8 663815916 664686501 665882647 666818857 666853964 666621864 667115569 667959154 668452859 668247640 667714119
1552.2 667714119 667302489 666900873 665552735 663791358 663337886 663022578 662512064 661560714 660096705
1570.5 660096705 659015298 658052146 656733632 655665040 654636621 653315425 652110636 651031792
1586.8 651031792 649659753 647818804 645840168 644074321 642438889 640482843 637972176 635268152
1603.2 635268152 632754803 630206168 627121270 623730600 620534599 617015541 612896681 609687984
1619.5 609687984 606700063 603013098 599763930 596902311 593962848 591533244 589357316 586887777
1635.8 586887777 585317135 584614098 584061444 583770752 583870709 584740579 586017489 587221384 589418113
$$ packed form
1515.4F49224102K539278K085447J595974J802444K041102K002477J541198R83894
1531.8F63815916Q70585J196146R36210L5107k32100M93705Q43585M93705k05219n33521
1552.2F67714119m11630m01616j348138j761377m53472l15308n10514r51350j464009
1570.5F60096705j081407r63152j318514j068592j028419j321196j204789j078844
1586.8F51031792j372039j840949j978636j765847j635432j956046k510667k704024
1603.2F35268152k513349k548635l084898l390670l196001l519058m118860l208697
1619.5F09687984k987921l686965l249168k861619k939463k429604k175928k469539
1635.8E86887777j570642p03037n52654k90692R9957Q69870J276910J203895K196729
$$ plain form
1654.1 589418113 592501879 595464110 598332226 601525664 605390429 609304368 613321722 617765009
1670.5 617765009 622031391 626713276 632112324 636957228 641017437 645181417 651027560 656842887
1686.8 656842887 661455870 665697515 669404566 673178792 677197814 680506706 683479428 686218202
1703.1 686218202 688871920 691640317 693911850 695637286 697281301 699274540 701880097 704490542
1719.4 704490542 706602156 708698213 711168826 713591516 715540349 717026472 718798697 721351206
1735.7 721351206 723629773 725371420 726981580 728942454 731323600 733722687 735926449 738262713
1752 738262713 740801334 743429720 745819271 747557342 749127209 751070559 753078103 754638970 755550504
1770.4 755550504 756389678 757940590 759736657 761026502 761744022 762472391 763652444 765074372 766111553
$$ packed form
1654.1E89418113L083766K962231K868116L193438L864765L913939M017354M443287
1670.5F17765009M266382M681885N399048M844904M060209M163980N846143N815327
1686.8F56842887M612983M241645L707051L774226M019022L308892K972722K738774
1703.1F86218202K653718K768397K271533J725436J644015J993239K605557K610445
1719.4G04490542K111614K096057K470613K422690J948833J486123J772225K552509
1735.7G21351206K278567J741647J610160J960874K381146K399087K203762K336264
1752G38262713K538621K628386K389551J738071J569867J943350K007544J560867R11534
1770.4G55550504Q39174J550912J796067J289845P17520P28369J180053J421928J037181
$$ plain form
1788.8 766111553 766514122 767004430 768222928 769591928 770441175 770857811 771559477 772746801 773934543
1807.1 773934543 774631917 774972856 775580704 776612282 777606666 778186798 778464496 778867185 779677212
1825.5 779677212 780488491 780800700 781005085 781615794 782457829 783126712 783335924 783221483 783289492 783938527
1845.9 783938527 784605384 784751832 784690440 784978986 785602212 786002994 785931408 785784602 786039114 786505580
1866.3 786505580 786681294 786670387 786908329 787459671 788099885 788452685 788417876 788469553 789017439 789734125
1886.7 789734125 790011108 789923310 790050328 790599942 791258752 791476548 791251004 791177809 791591406 792059302
1907.1 792059302 792050838 791776836 791831493 792292714 792672276 792610168 792330146 792410076 793021262 793524504
1927.5 793524504 793459892 793187499 793307602 793818295 794148803 793956578 793603003 793765545 794385135 794749200
$$ packed form
1788.8G66111553M02569M90308J218498J369000Q49247M16636P01666J187324J187742
1807.1G73934543O97374L40939O07848J031578R94384N80132K77698M02689Q10027
1825.5G79677212Q11279L12209K04385O10709Q42035O68883K09212j14441O8009O49035
1845.9G83938527O66857J46448o1392K88546O23226M00782p1586j46806K54512M66466
1866.3G86505580J75714j0907K37942N51342O40214L52800l4809N1677N47886P16686
1886.7G89734125K76983q7798J27018N49614O58810K17796k25544p3195M13597M67896
1907.1G92059302q464k74002N4657M61221L79562o2108k80022P9930O11186N03242
1927.5G93524504o4612k72393J20103N10693L30508j92225l53575J62542O19590L64065
$$ plain form
1947.9 794749200 794651389 794556856 794889629 795476735 795758724 795596242 795500219 795872331 796410441 796579421
1968.3 796579421 796382844 796339631 796757460 797276020 797354877 797050655 796944022 797309279 797737420 797698081
1988.7 797698081 797276974 797121167 797521591 797939479 797833443 797408283 797272265 797549307 797677934 797259629
2009 797259629 796634436 796360552 796404600 796184361 795409501 794506729 793940842 793707728 793593526 793298364
2029.4 793298364 792835593 792594314 792545617 792232156 791528821 790878892 790676236 790714443 790507495 790002286
2049.8 790002286 789639294 789701879 789954126 789941847 789595902 789385557 789629579 789994001 790010929 789732933
2070.2 789732933 789598107 789846063 790176809 790141404 789839029 789758921 790059328 790399730 790397584 790157318
2090.6 790157318 790155053 790543973 790912092 790893018 790694237 790814519 791320920 791710973 791640937 791392624
$$ packed form
1947.9G94749200r7811r4533L32773N87106K81989j62482r6023L72112N38110J68980
1968.3G96579421j96577m3213M17829N18560P8857l04222j06633L65257M28141l9339
1988.7G97698081m21107j55807M00424M17888j06036m25160j36018K77042J28627m18305
2009G97259629o25193k73884M4048k20239p74860r02772n65887k33114j14202k95162
2029.4G93298364m62771k41279m8697l13461p03335o49929k02656L8207k06948n05209
2049.8G90002286l62992O2585K52247j2279l45945k10345K44022L64422J6928k77996
2070.2G89732933j34826K47956L30746l5405l02375q0108L00407L40402k146k40266
2090.6G90157318k265L88920L68119j9074j98781J20282N06401L90053p0036k48313
$$ plain form
2111 791392624 791450441 791826785 792054236 791872084 791590095 791628480 791950464 792110682 791875720 791595399
2131.4 791595399 791705191 792082608 792206705 791929424 791689396 791861475 792226732 792285025 791966617 791744649
2151.8 791744649 792016506 792541623 792755723 792597532 792596579 793091714 793755233 794067681 794104457 794425309
2172.2 794425309 795199752 795982718 796354949 796461403 796799719 797545552 798267841 798539162 798587203 798940957
2192.6 798940957 799665749 800276816 800425768 800400138 800746381 801526785 802212954 802420020 802465975 802886605
2213 802886605 803641081 804185212 804272830 804322422 804786444 805494368 805904329 805869758 805857003 806263328 806858778
2235.4 806858778 807121813 806993008 807004750 807491004 808090210 808278441 808085382 808063567 808496535 808988512
2255.8 808988512 809106767 808977246 809054911 809521735 810021698 810123742 809959233 810076118 810624480 811109960
$$ packed form
2111G91392624N7817L76344K27451j82152k81989L8385L21984J60218k34962k80321
2131.4G91595399J09792L77417J24097k77281k40028J72079L65257N8293l18408k21968
2151.8G91744649K71857N25117K14100j58191r53M95135O63519L12448L6776L20852
2172.2G94425309P74443P82966L72231J06454L38316P45833P22289K71321M8041L53754
2192.6G98940957P24792O11067J48952k5630L46243P80404O86169K07066M5955M20630
2213H02886605P54476N44131Q7618M9592M64022P07924M09961l4571j2755M06325N95450
2235.4H06858778K63035j28805J1742M86254N99206J88231j93059k1815M32968M91977
2255.8H08988512J18255j29521P7665M66824M99963J02044j64509J16885N48362M85480
$$ plain form
2276.2 811109960 811133742 810953736 811102092 811658204 812106490 812030375 811768234 811942577 812514544 812907577
2296.6 812907577 812838852 812654078 812828064 813278973 813551009 813484728 813402176 813645661 814090192 814357758
2317 814357758 814332485 814288676 814529121 814896345 814982712 814751387 814529538 814601064 814859867 814857125 814401984
2339.5 814401984 813897967 813721001 813585460 813253403 813015640 813176990 813779831 814333141 814261854 813713491
2359.9 813713491 813274205 813139677 812967002 812437177 811656058 811032236 810741067 810434818 809827924 809150815
2380.2 809150815 808809161 808836222 808830798 808481097 807977974 807750702 807825327 807762444 807308674 806767821
2400.6 806767821 806543231 806545675 806356430 805794716 805171013 804868281 804779768 804469824 803784430 803063810
2421 803063810 802676857 802480936 802000225 801153004 800387621 799999416 799714148 799124181 798247457 797469139
$$ packed form
2276.2H11109960K3782j80006J48356N56112M48286p6115k62141J74343N71967L93033
2296.6H12907577o8725j84774J73986M50909K72036o6281q2552K43485M44531K67566
2317H14357758k5273m3809K40445L67224Q6367k31325k21849P1526K58803k742m55141
2339.5H14401984n04017j76966j35541l32057k37763J61350O02841N53310p1287n48363
2359.9H13713491m39286j34528j72675n29825p81119o23822k91169l06249o06894o77109
2380.2H09150815l41654K7061n424l49701n03123k27272P4625o2883m53770n40853
2400.6H06767821k24590K444j89245n61714o23703l02732q8513l09944o85394p20620
2421H03063810l86953j95921m80711q47221p65383l88205k85268n89967q76724p78318
$$ plain form
2441.4 797469139 797067940 796798170 796185613 795265377 794524431 794178009 793893874 793262362 792356849 791633785
2461.8 791633785 791314125 791051209 790414572 789562106 788976789 788735747 788427532 787741303 786919534 786410689
2482.2 786410689 786235929 785981894 785388112 784712732 784371078 784355283 784210443 783640563 782966733 782670021
2502.6 782670021 782678246 782491922 781933486 781369984 781143904 781109691 780827641 780165315 779501319 779177070
2523 779177070 779005885 778569579 777822793 777137697 776735008 776350975 775648296 774686694 773874044 773434103
2543.4 773434103 773065925 772363901 771415114 770691454 770317733 769889355 769105434 768150270 767434657 767074287
2563.8 767074287 766691089 765974104 765132129 764537454 764204502 763735712 762923002 762094557 761576951 761278391
2584.2 761278391 760859847 760165095 759467006 759089470 758933425 758619726 758014798 757409751 757055402 756791592
$$ packed form
2441.4G97469139m01199k69770o12557r20236p40946l46422k84135o31512r05513p23064
2461.8G91633785l19660k62916o36637q52466n85317k41042l08215o86229q21769n08845
2482.2G86410689j74760k54035n93782o75380l41654j5795j44840n69880o73830k96712
2502.6G82670021Q225j86324n58436n63502k26080l4213k82050o62326o63996l24249
2523G79177070j71185m36306p46786o85096m02689l84033p02679r61602q12650m39941
2543.4G73434103l68178p02024r48787p23660l73721m28378p83921r55164p15613l60370
2563.8G67074287l83198p16985q41975n94675l32952m68790q12710q28445n17606k98560
2584.2G61278391m18544o94752o98089l77536j56045l13699o04928o05047l54349k63810
$$ plain form
2604.6 756791592 756302893 755567312 754841387 754271746 753717303 752904952 751813293 750760853 749944448
2623 749944448 749179244 748179018 746937454 745733023 744698763 743643880 742383480 741009355 739769459
2641.3 739769459 738722146 737671077 736420512 735045910 733817697 732791305 731752455 730530739
2657.6 730530739 729210079 728038907 727101088 726191044 725102961 723926127 722905099 722069263 721201420
2676 721201420 720155358 719034612 718066633 717322648 716576099 715591908 714495182 713559508 712759137
2694.3 712759137 711845815 710740745 709579885 708481252 707451642 706385016 705175161 703906178
2710.7 703906178 702781200 701810479 700801253 699669898 698540390 697573185 696752310 695903540 694937885
2729 694937885 693984449 693215907 692577899 691819370 690867245 689975798 689312279 688727200 687986672 687075078
$$ packed form
2604.6G56791592m88699p35581p25925n69641n54443q12351j091659j052440q16405
2623G49944448p65204j000226j241564j204431j034260j054883j260400j374125j239896
2641.3G39769459j047313j051069j250565j374602j228213j026392j038850j221716
2657.6G30530739j320660j171172r37819r10044j088083j176834j021028q35836q67843
2676G21201420j046062j120746r67979p43985p46549r84191j096726r35674q00371
2694.3G12759137r13322j105070j160860j098633j029610j066626j209855j268983
2710.7G03906178j124978r70721j009226j131355j129508r67205q20875q48770r65655
2729F94937885r53436p68542o38008p58529r52125q91447o63519n85079p40528r11594
$$ plain form
2749.4 687075078 686241746 685645521 685156584 684571505 683846295 683152139 682644129 682192922 681586444 680831671
2769.8 680831671 680102289 679488599 678843379 677954555 676865697 675856888 675043702 674203575 673086286
2788.2 673086286 671728909 670378327 669157147 667893291 666355968 664625406 662998378 661510527
2804.5 661510527 659880996 657951534 655891836 653940141 652088702 650101840 647846222 645484686
2820.8 645484686 643238008 641060770 638720036 636122406 633414209 630773187 628165364 625348270
2837.1 625348270 622185171 618835032 615482867 612038553 608301044 604374349 600688279 597563803
2853.4 597563803 594863832 592194319 589317918 586200476 582816005 578989446 574517190 569507480
2869.7 569507480 564336300 559145987 553789794 548335135 543194175 538782001 535235107 532422602
$$ packed form
2749.4F87075078q33332n96225m88937n85079p25210o94156n08010m51207o06478p54773
2769.8F80831671p29382o13690o45220q88824j088858j008809q13186q40127j117289
2788.2F73086286j357377j350582j221180j263856j537323j730562j627028j487851
2804.5F61510527j629531j929462k059698j951695j851439j986862k255618k361536
2820.8F45484686k246678k177238k340734k597630k708197k641022k607823k817094
2837.1F25348270l163099l350139l352165l444314l737509l926695l686070l124476
2853.4E97563803k699971k669513k876401l117442l384471l826559m472256n009710
2869.7E69507480n171180n190313n356193n454659n140960m412174l546894k812505
$$ plain form
2886.1 532422602 530179381 528486431 527390957 526773751 526268959 525554419 524644673 523681104 522616446
2904.4 522616446 521230876 519357920 517018795 514284313 511114120 507464886 503499269 499557346
2920.7 499557346 495988935 492988229 490624070 489007622 488349885 488901198 490743250 493702054 497546583
2939.1 497546583 502164245 507436335 513084888 518808544 524500728 530231118 536028743 541807532
2955.4 541807532 547465205 552941978 558234155 563316345 568023622 572240829 576123595 579933763
2971.7 579933763 583761036 587482214 590981305 594252586 597329497 600200355 602785170 605050206
2988 605050206 607089162 608963370 610600650 611906111 612767637 613211572 613476813 613643408 613520920
3006.4 613520920 612993419 612231612 611387968 610322058 608838379 606969476 604971766 603063047 601163268
$$ packed form
2886.1E32422602k243221j692950j095474o17206n04792p14540r09746r63569j064658
2904.4E22616446j385570j872956k339125k734482l170193l649234l965617l941923
2920.7D99557346l568411l000706k364159j616448o57737N51313J842052K958804L844529
2939.1D97546583M617662N272090N648553N723656N692184N730390N797625N778789
2955.4E41807532N657673N476773N292177N082190M707277M217207L882766L810168
2971.7E79933763L827273L721178L499091L271281L076911K870858K584815K265036
2988F05050206K038956J874208J637280J305461Q61526M43935K65241J66595j22488
3006.4F13520920n27501p61807q43644j065910j483679j868903j997710j908719j899779
$$ plain form
3024.7 601163268 599046290 596717477 594372392 592127264 589831710 587253988 584537327 581948042
3041.1 581948042 579445064 576809824 573915303 570940137 568121910 565402210 562630594 559727907
3057.4 559727907 556704879 553757131 551053166 548463643 545683622 542636335 539599240 536795616
3073.7 536795616 534166873 531509817 528664410 525743365 522903442 520032525 517096817 514199734
3090 514199734 511290789 508385241 505591929 502864778 500074506 497233897 494514167 491947949 489339560
3108.4 489339560 486588955 483921826 481475621 479013741 476367295 473556489 470681190 467922896
3124.7 467922896 465344340 462852448 460332990 457785606 455343604 453017384 450645268 448139191
3141 448139191 445604205 443162233 440795928 438536495 436440855 434344530 432055652 429623187 427233577
$$ packed form
3024.7F01163268k116978k328813k345085k245128k295554k577722k716661k589285
3041.1E81948042k502978k635240k894521k975166k818227k719700k771616k902687
3057.4E59727907l023028k947748k703965k589523k780021l047287l037095k803624
3073.7E36795616k628743k657056k845407k921045k839923k870917k935708k897083
3090E14199734k908945k905548k793312k727151k790272k840609k719730k566218k608389
3108.4D89339560k750605k667129k446205k461880k646446k810806k875299k758294
3124.7D67922896k578556k491892k519458k547384k442002k326220k372116k506077
3141D48139191k534986k441972k366305k259433k095640k096325k288878k432465k389610
$$ plain form
3159.4 427233577 425016224 422914922 420810163 418677956 416560411 414541483 412615597 410659343
3175.7 410659343 408630311 406661063 404841989 403075248 401294202 399540931 397810012 396074295
3192 396074295 394348115 392613083 390853941 389138907 387538612 386041015 384561270 383022219 381522268
3210.3 381522268 380152702 378805131 377433240 376066685 374704093 373360515 372032791 370727539
3226.7 370727539 369473726 368363470 367400050 366307139 364974439 363616318 362416565 361434847 360593051
3245 360593051 359696984 358633429 357554376 356666982 355889112 354950249 353857249 352854311 352027595
3263.4 352027595 351318866 350666195 350035578 349361867 348621011 347811252 346930832 346094906 345325798 344549060
3283.8 344549060 343823642 343231946 342740297 342250615 341681451 340982169 340164542 339373410 338764042 338325173
$$ packed form
3159.4D27233577k217353k101302k104759k132207k117545k018928j925886j956254
3175.7D10659343k029032j969248j819074j766741j781046j753271j730919j735717
3192C96074295j726180j735032j759142j715034j600295j497597j479745j539051j499951
3210.3C81522268j369566j347571j371891j366555j362592j343578j327724j305252
3226.7C70727539j253813j110256r63420j092911j332700j358121j199753r81718q41796
3245C60593051q96067j063555j079053q87394p77870r38863j093000j002938q26716
3263.4C52027595p08729o52671o30617o73711p40856q09759q80420q35926p69108p76738
3283.8C44549060p25418n91696m91649m89682n69164o99282q17627p91132o09368m38869
$$ plain form
3304.2 338325173 337851107 337117583 336122096 335115165 334315598 333601445 332821518 332077086 331451148
3322.5 331451148 330867887 330134004 329216778 328352392 327644020 327038318 326487869 325841814 325034052 324204713
3342.9 324204713 323373795 322577953 321975887 321351022 320452541 319510251 318781525 318188161 317498475 316761523
3363.3 316761523 316242188 315847814 315209478 314236343 313284844 312648088 312142849 311551064 310888708 310303658
3383.7 310303658 309909910 309701413 309667230 309571922 309142023 308620721 308423579 308456928 308230907 307652384
3404.1 307652384 307156980 306944758 306862533 306776792 306583077 306306124 306115776 306000441 305904090 305956095
3424.5 305956095 306188256 306482643 306732029 307013988 307373285 307525486 307339698 307137609 307247609 307655931
3444.9 307655931 308101684 308445394 308814138 309280694 309770554 310304344 310947925 311517417 312065631 312930316
$$ packed form
3304.2C38325173m74066p33524r95487j006931p99567p14153p79927p44432o25938
3322.5C31451148n83261p33883r17226q64386p08372o05702n50449o46055q07762q29339
3342.9C24204713q30918p95842o02066o24865q98481r42290p28726n93364o89686p36952
3363.3C16761523n19335l94374o38336r73135r51499o36756n05239n91785o62356n85050
3383.7C10303658l93748k08497l4183r5308m29899n21302j97142L3349k26021n78523
3404.1C07652384m95404k12222q2225q5741j93715k76953j90348j15335r6351N2005
3424.5C05956095K32161K94387K49386K81959L59297J52201j85788k02089J10000M08322
3444.9C07655931M45753L43710L68744M66556M89860N33790O43581N69492N48214Q64685
$$ plain form
3465.3 312930316 313912183 314513892 314735949 315017939 315588564 316422224 317264944 317831129 318364561 319124788
3485.7 319124788 319878101 320559412 321397543 322369128 323342830 324251533 325102687 325910896 326634884 327331960
3506.1 327331960 328071743 328954130 330105156 331269592 332143188 332918912 333902508 335122466 336232156
3524.4 336232156 336977243 337684423 338760644 340153813 341606200 342883915 343987405 345260292 346754789
3542.8 346754789 348082334 349093080 350197077 351576328 353105456 354761571 356523454 358345211
3559.1 358345211 360221237 362042636 363578886 365262061 367700368 370389372 372885227 375332981
3575.4 375332981 377853781 380536109 383485854 386505216 389140099 391481400 394373655 397611737
3591.7 397611737 400695831 403872579 407300442 410758227 414293438 417876154 421127707 424196869
$$ packed form
3465.3C12930316R81867O01709K22057K81990N70625Q33660Q42720N66185N33432P60227
3485.7C19124788P53313O81311Q38131R71585R73702R08703Q51154Q08209P23988O97076
3506.1C27331960P39783Q82387J151026J164436Q73596P75724R83596J219958J109690
3524.4C36232156P45087P07180J076221J393169J452387J277715J103490J272887J494497
3542.8C46754789J327545J010746J103997J379251J529128J656115J761883J821757
3559.1C58345211J876026J821399J536250J683175K438307K689004K495855K447754
3575.4C75332981K520800K682328K949745L019362K634883K341301K892255L238082
3591.7C97611737L084094L176748L427863L457785L535211L582716L251553L069162
$$ plain form
3608.1 424196869 427532345 431096494 434848130 438554525 441992551 445766300 449934632 453891128
3624.4 453891128 457131207 459906727 463700205 468081355 472194135 476073951 479778647 483483374
3640.7 483483374 487291753 490903348 493945003 496877581 500864744 505255640 509051502 512778699
3657 512778699 516820610 520522535 523794413 527044535 529995441 532476306 535496771 538584232 540891588
3675.4 540891588 543731987 547203958 550530374 553721964 556676745 558985889 560717642 562950253
3691.7 562950253 565711498 568292201 570486724 572278261 573908746 575944364 578176439 579946876
3708 579946876 581026435 582140386 584230840 586582661 588428617 589785457 590957224 592124403 593499720
3726.4 593499720 595234931 596785486 597730100 598368883 599521518 601453483 603267550 603844762 603766263
$$ packed form
3608.1D24196869L335476L564149L751636L706395L438026L773749M168332L956496
3624.4D53891128L240079K775520L793478M381150M112780L879816L704696L704727
3640.7D83483374L808379L611595L041655K932578L987163M390896L795862L727197
3657E12778699M041911L701925L271878L250122K950906K480865L020465L087461K307356
3675.4E40891588K840399L471971L326416L191590K954781K309144J731753K232611
3691.7E62950253K761245K580703K194523J791537J630485K035618K232075J770437
3708E79946876J079559J113951K090454K351821J845956J356840J171767J167179J375317
3726.4E93499720J735211J550555R44614O38783J152635J931965J814067N77212p8499
$$ plain form
3744.7 603766263 604978561 606181562 606473088 607658327 609743178 611317217 612179518 613241017 614593685
3763.1 614593685 615708947 616617918 617330015 618200541 619540989 620869815 621786952 622386992 623145461
3781.4 623145461 623946905 624666512 625640154 626736045 627739489 628529072 629046381 629638553 629931092
3799.8 629931092 629966021 630879402 631769300 632409632 633707047 635082245 635649085 635698795 636156321 636351943
3820.2 636351943 636679292 637881875 638917446 639659882 640301049 640880704 641578376 641839504 641654551
3838.5 641654551 642079651 643006444 644061089 645249426 646274805 646365404 644926131 644470334 646161377
3856.9 646161377 647797704 648565590 648605227 648801148 649378538 649484992 649655461 650479198 651482224
3875.2 651482224 652336299 652527273 652595520 653071105 653395176 653932512 654472232 654592454 655138433 656025767
$$ packed form
3744.7F03766263J212298J203001K91526J185239K084851J574039Q62301J061499J352668
3763.1F14593685J115262R08971P12097Q70526J340448J328826R17137O00040P58469
3781.4F23145461Q01444P19607R73642J095891J003444P89583N17309N92172K92539
3799.8F29931092L4929R13381Q89898O40332J297415J375198N66840M9710M57526J95622
3820.2F36351943L27349J202583J035571P42436O41167N79655O97672K61128j84953
3838.5F41654551M25100R26793J054645J188337J025379R0599j439273m55797J691043
3856.9F46161377J636327P67886L9637J95921N77390J06454J70469Q23737J003026
3875.2F51482224Q54075J90974O8247M75585L24071N37336N39720J20222N45979Q87334
$$ plain form
3895.6 656025767 656313419 655993104 655704796 655713975 656234324 657117069 657852530 658380568 658761501 658839464
3916 658839464 658754885 658893645 659200191 659424663 659700811 660050631 660178721 660266995 660664201 661126792
3936.4 661126792 661384046 661436081 661462903 661746383 662089407 662219703 662406981 662801564 663194597 663451552
3956.8 663451552 663605452 663712740 663863242 664097369 664291799 664422750 664591372 664805770 665031910 665237844
3977.2 665237844 665368199 665525436 665776372 665930450 665962517 666064382 666247606 666437805 666678011 666946709
3997.6 666946709
$$ packed form
3895.6F56025767K87652l20315k88308R179N20349Q82745P35461N28038L80933P7963
3916F58839464q4579J38760L06546K24472K76148L49820J28090Q8274L97206M62591
3936.4F61126792K57254N2035K6822K83480L43024J30296J87278L94583L93033K56955
3956.8F63451552J53900J07288J50502K34127J94430J30951J68622K14398K26140K05934
3977.2F65237844J30355J57237K50936J54078L2067J01865J83224J90199K40206K68698
3997.6F66946709
##END=$$ End of the data block
