##TITLE=$$ Begin of the data block
##JCAMP-DX=5.00 $$ ACD/SpecManager v 10.08
##SPECTROMETER/DATA SYSTEM=Alpha
##DATE=23 Dec 2014 09:14:34
##DATA TYPE=INFRARED SPECTRUM
##DATA CLASS=XYDATA
##ORIGIN=
##OWNER=
##NPOINTS=1765
##FIRSTX=399.76428223
##LASTX=3997.64306641
##MAXX=3997.64306641
##MINX=399.76428223
##MAXY=0.81617361
##MINY=0.23225471
##XFACTOR=1.0000000000
##YFACTOR=1.000000000000000e-9
##FIRSTY=0.52568924
##DELTAX=2.03961372
##XUNITS=1/CM
##YUNITS=ARBITRARY UNITS
##XYDATA=(X++(Y..Y))
399.8E25689244m002094k422929r20892l31938j86741J108169K697945J973033r77039
418.1E22626758k467752r75609m58479j492023l058672l568173k585172j679182j521588
436.5E04820108q71419J547396M922032O262839M528224K332330J911819K494693J494884
454.8E29442906r66787k113521j170754o75321j948059l878295m115522k822816k309859
473.2E09441972k918005l154874k070844l57151L58999k50519p74979k23041M56989
491.5E00508547k49326j988680k781033j939863j069397j765817l340572l937185l143072
509.9D80293602k688319l714561n169720n304604l926903k693624k469927k377242
526.2D51948702j049190R15557J934111K066582K888233N053341O810516O010711L165424
$$ y = [525689244, 521687150, 519264221, 518343329, 518011391, 517824650, 518932819, 521630764, 523603797, 522626758, 520159006, 519183397, 518724918, 517232895, 514174223, 510606050, 508020878, 506341696, 504820108, 503948689, 505496085, 510418117, 516680956, 521209180, 523541510, 525453329, 527948022, 529442906, 528476119, 526362598, 525191844, 524516523, 522568464, 518690169, 514574647, 511751831, 509441972, 506523967, 503369093, 501298249, 500941098, 501300097, 501049578, 500274599, 500051558, 500508547, 500259221, 498270541, 495489508, 493549645, 492480248, 490714431, 487373859, 483436674, 480293602, 477605283, 473890722, 468721002, 463416398, 459489495, 456795871, 454325944, 451948702, 450899512, 451815069, 453749180, 455815762, 458703995, 463757336, 470567852, 476578563, 479743987]
544.6D79743987Q94010L77179J81675j131446k942711l730237l466666l748149n336195
562.9D60841447o990820p509619o920844n660832l996432j844913J037568M197001
579.3D33152556O469042P204264P021815O753623O100833M429102J937211J72734J3262
597.6D73254442L16143n3853p01874o74963K66612J344352J461983R90451J417875
616D77621168L023505M357189M244238L394097L258437L873527L813297K585292J383245
634.3E07553995J350581J994610K111495J335144M45306N67377J559615J867950R23753
652.7E19709826K19523P53880J661181J604915O30140J30594R67920K466679J867771
671E30012429P54237O77288J603126K416372J931846P73430L82662J034200J430512
$$ y = [479743987, 480637997, 481015176, 481196851, 480065405, 477122694, 473392457, 469925791, 466177642, 460841447, 453850627, 446341008, 439420164, 433759332, 429762900, 427917987, 428955555, 433152556, 439621598, 446825862, 453847677, 460601300, 466702133, 471131235, 473068446, 473241180, 473254442, 473570585, 473516732, 472814858, 472139895, 472406507, 473750859, 475212842, 476203293, 477621168, 480644673, 485001862, 489246100, 492640197, 495898634, 499772161, 503585458, 506170750, 507553995, 508904576, 510899186, 513010681, 514345825, 514791131, 515358508, 516918123, 518786073, 519709826, 519929349, 520683229, 522344410, 523949325, 524579465, 524710059, 525677979, 528144658, 530012429, 530766666, 531443954, 533047080, 535463452, 537395298, 538168728, 538551390, 539585590, 541016102]
689.4E41016102L37541j438439k169311j812875j878858l098249m130185l327072j109600
707.7E22389054O48260J237691J770019L338218N379379O346047N742311N110026N782604
726.1E57743609O699443O085574M133523K789319L107011L579438K304196j45257j688718
744.5E84608138j735688j783371l368258n629778o204247m846693l721654l933430
760.8E53385019m060149k310216J047373M007697N345702O044864P788063J0116875
777.1E81365228J0578990Q435487O084621N688906O310999N656600L590584K505482
793.4F30216897L772854N671442N687594L877878K762914L559649M392088L150820
809.7F63092136Q02398J77980J672267K473832P74145j669646k163231j122475j408457
$$ y = [541016102, 541353643, 539915204, 537745893, 535933018, 534054160, 530955911, 526825726, 523498654, 522389054, 523037314, 524275005, 526045024, 529383242, 534762621, 541108668, 546850979, 551961005, 557743609, 564443052, 570528626, 574662149, 577451468, 580558479, 584137917, 586442113, 586296856, 584608138, 582872450, 581089079, 577720821, 572091043, 565886796, 561040103, 557318449, 553385019, 549324870, 547014654, 548062027, 552069724, 557415426, 563460290, 571248353, 581365228, 591944218, 600379705, 606464326, 612153232, 618464231, 624120831, 627711415, 630216897, 633989751, 639661193, 645348787, 649226665, 651989579, 655549228, 659941316, 663092136, 663894534, 664072514, 665744781, 668218613, 668992758, 667323112, 665159881, 664037406, 662628949]
828.1F62628949l906429o269395o244839m761874m393220n577922o186187m826606
844.4F20462477k946675k852916m398287n353868m810333m100442m102766l127873
860.7E88769317Q88228O855846J1411607J2807369J2159884J1332393J0559141Q338452
877F63122237L920555q36432l453672m006684m702449o536364p858754p034420n059720
895.4F27554297m274547n238592o220162o016731n671859o751895r041250j0700166
911.7E73639095j0702610j0074437r905636r518147p635653m429936j601160m36484
928E19335032k10286P61688K768457M521370N069792M956365N056143M644036J977682
946.4E48880279k982497q033991j1254728j2817979j4159709j5972555j7475724j7970681
$$ y = [662628949, 658722520, 652453125, 646208286, 641446412, 637053192, 631475270, 625289083, 620462477, 617515802, 614662886, 610264599, 604910731, 600100398, 595999956, 591897190, 588769317, 589657545, 596513391, 607924998, 620732367, 632892251, 644224644, 654783785, 663122237, 667042792, 666206360, 662752688, 658746004, 654043555, 647507191, 639648437, 632614017, 627554297, 623279750, 618041158, 611820996, 605804265, 600132406, 593380511, 584339261, 573639095, 562936485, 552862048, 542956412, 533438265, 525802612, 521372676, 519771516, 519335032, 519124746, 519886434, 522654891, 527176261, 532246053, 537202418, 542258561, 546902597, 548880279, 545897782, 537863791, 526609063, 513791084, 499631375, 483658820, 466183096, 448212415]
962.7D48212415j8071592j8694639j9796342k0538091k0429641j9858390j9181878
977C11641842j8126637j6297638j3683587j0731519q032068n817428l894702k129957
993.3B32928306o73592K32816O37635Q29801R15662P21529J36315n75006r18388o21453
1013.7B33613625P8350Q00699J406983K053514K888709L710106M115463M032075L777296
1032B56476820L485798K942801J959711R16124M63903P41452J307964J814276K505451
1050.4B72614300L812224N617917P270723Q391887R322524J0498196J1197418R348661
1066.7C38073850L391862m949600j1077821j1983216q894801m907072j619756J045376
1083B99078822L259272M754394N559027O130874O619573O617486N604625L662944J705974
$$ y = [448212415, 430140823, 411446184, 391649842, 371111751, 350682110, 330823720, 311641842, 293515205, 277217567, 263533980, 252802461, 244770393, 238952965, 235058263, 232928306, 232254714, 232487530, 233125165, 233954966, 234870628, 235592157, 235728472, 235153466, 234235078, 233613625, 233691975, 234492674, 235899657, 237953171, 240841880, 244551986, 248667449, 252699524, 256476820, 259962618, 262905419, 264865130, 265781254, 266245157, 266986609, 268294573, 270108849, 272614300, 276426524, 282044441, 289315164, 297707051, 307029575, 317527771, 328725189, 338073850, 341465712, 336516112, 325438291, 313455075, 304560274, 299653202, 298033446, 299078822, 302338094, 307092488, 312651515, 318782389, 325401962, 332019448, 337624073, 341287017, 342992991]
1101.4C42992991P91192J115293K060294L012955L788352M347205M414231L752649
1117.7C66275162K643883J783013J699478K376914L352224M197091M556239L915518
1134C90799522J821936j558006n149573p661045q651078q646786q160084p177562n590111
1152.4C40027213l604740j689821j50532J247943L047615N352259P726907R742320
1168.7C61699164J1355251J2805283J4079601J4717877J4545798J3984233J3493150
1183D56680357J3032765J1982441R980201P623345N747616M453421L292680K095818
1199.3E14888644J376450J596988K399265L103853L557145M141987N031585N707264
1215.6E41803181N416989M121423K623141J537800O61850m16994j535416k090633j927912
$$ y = [342992991, 343784183, 344899476, 346959770, 349972725, 353761077, 358108282, 362522513, 366275162, 368919045, 370702058, 372401536, 374778450, 378130674, 382327765, 386884004, 390799522, 392621458, 391063452, 385913879, 378252834, 369601756, 360954970, 352794886, 345617324, 340027213, 336422473, 334732652, 334582120, 335830063, 338877678, 344229937, 351956844, 361699164, 373054415, 385859698, 399939299, 414657176, 429202974, 443187207, 456680357, 469713122, 481695563, 491675764, 499299109, 505046725, 509500146, 512792826, 514888644, 516265094, 517862082, 520261347, 523365200, 526922345, 531064332, 536095917, 541803181, 547220170, 551341593, 553964734, 555502534, 556164384, 555747390, 554211974, 552121341, 550193429]
1234E50193429j595497j567304j647055j223028j16170J059533J627802J721502J911580
1252.3E50364792K229154K199769J581848Q43942P24674J310110J976013K171159J968503
1270.7E65369964J717865J401484P37608k38419j007378j110077q02100p24852j085281
1289E64258814j508832j625836j596987j804650k210915k372742k067983j675427j651168
1307.4E47744274j820028j722157j309037r77576j136660j702965k336442l028095
1323.7E33711314l969371n096614n900443n829454m937291l759980k726376j761883
1340D99729902o53178K67297O56456M44352r8288m91976o12408o75082r05067j252949
1360.4D96409059j351506q29220l14593k23607p7635L43084R78023J343012J145065
$$ y = [550193429, 548597932, 547030628, 545383573, 544160545, 544044375, 545103908, 546731710, 548453212, 550364792, 552593946, 554793715, 556375563, 557219505, 557944179, 559254289, 561230302, 563401461, 565369964, 567087829, 568489313, 569226921, 568988502, 567981124, 566871047, 566068947, 565344095, 564258814, 562749982, 561124146, 559527159, 557722509, 555511594, 553138852, 551070869, 549395442, 547744274, 545924246, 544202089, 542893052, 541915476, 540778816, 539075851, 536739409, 533711314, 529741943, 524645329, 518744886, 512915432, 507978141, 504218161, 501491785, 499729902, 499076724, 499344021, 500000477, 500444829, 500346541, 499854565, 499242157, 498567075, 497662008, 496409059, 495057553, 494228333, 493913740, 493690133, 493612498, 493955582, 494933605, 496276617, 497421682]
1378.8D97421682Q61496J222163K503514M166425M632294L466606K160072J146555
1395.1E17580807K29657o86407j218200j448452j694262j746178j930595k206921j957715
1413.5E04921734j367390j164138j064241l61145L75331R53078J269579J292646J376629
1431.8E06232083J562655J949429K352894K067685J701355J449406J073360L29018
1448.1E18717885n82218j179874j464546k187848k198756k79247R50217K234399L977299
1466.5E17987311N000055O224990R021997J0458529R558261Q503735P701873P263542
1482.8E81720293O712377O436944O443858O029963M883707M472196M922390M593253
1499.1F26214981L613830K868890K770961L634274L440618K525628K233684K307951
$$ y = [497421682, 498283178, 499505341, 502008855, 506175280, 510807574, 514274180, 516434252, 517580807, 517810464, 517124057, 515905857, 514457405, 512763143, 511016965, 509086370, 506879449, 504921734, 503554344, 502390206, 501325965, 500964820, 501340151, 502293229, 503562808, 504855454, 506232083, 507794738, 509744167, 512097061, 514164746, 515866101, 517315507, 518388867, 518717885, 518135667, 516955793, 515491247, 513303399, 511104643, 510825396, 511775613, 514010012, 517987311, 522987366, 529212356, 538234353, 548692882, 558251143, 566754878, 574456751, 581720293, 588432670, 594869614, 601313472, 607343435, 612227142, 616699338, 621621728, 626214981, 629828811, 632697701, 635468662, 639102936, 642543554, 645069182, 647302866, 649610817]
1515.4F49610817K505780K096653J626908J812160K041996K008975J530289R65715
1531.8F64199293Q97944J246273R50575J9014k41280M78089Q16345M93884j62005m96149
1552.2F68201983m11093l93808j317382j743853m38690l10421n33700r96888j522481
1570.5F60533667j118064r63986j314640j080871j042068j326382j202941j074970
1586.8F51409745j358390j803338j921654j735568j662850j994074k526402k708793
1603.2F35698676k501547k516330l057122l388643l212273l549576m125833l158868
1619.5F10188484k926469l649234l239930k858102k947748k464831k226472k497315
1635.8E87378383j555026o79731n33879k80619J22309R03308J239121J096249K216637
$$ y = [649610817, 652116597, 654213250, 655840158, 657652318, 659694314, 661703289, 663233578, 664199293, 665097237, 666343510, 667294085, 667313099, 667071819, 667549908, 668366253, 668860137, 668698132, 668201983, 667790890, 667397082, 666079700, 664335847, 663897157, 663586736, 663053036, 662056148, 660533667, 659415603, 658451617, 657136977, 656056106, 655014038, 653687656, 652484715, 651409745, 650051355, 648248017, 646326363, 644590795, 642927945, 640933871, 638407469, 635698676, 633197129, 630680799, 627623677, 624235034, 621022761, 617473185, 613347352, 610188484, 607262015, 603612781, 600372851, 597514749, 594567001, 592102170, 589875698, 587378383, 585823357, 585143626, 584609747, 584329128, 584451437, 585354745, 586593866, 587690115, 589906752]
1654.1E89906752L190458K983332K861380L225327L896594L900289L996671M436373
1670.5F18397176M274071M720687N438090M847526M045606M158497N852401N841494
1686.8F57575548M647076M244745L687799L744244L983617L330231L020107K736271
1703.1F86969638K626061K737880K256095J736045J661897J987100K587259K594828
1719.4G05156803K100051K118349K504170K420604J930475J480222J773357K556265
1735.7G22040296K276897J740754J635790K001822K418041K418279K184213K298355
1752G39014447K520919K639353K410531J737893J554012J925886J968741J520336R45746
1770.4G56237864R41158J600981J788199J276910O90341P07447J189113J426756J031459
$$ y = [589906752, 593097210, 596080542, 598941922, 602167249, 606063843, 609964132, 613960803, 618397176, 622671247, 627391934, 632830024, 637677550, 641723156, 645881653, 651734054, 657575548, 662222624, 666467369, 670155168, 673899412, 677883029, 681213260, 684233367, 686969638, 689595699, 692333579, 694589674, 696325719, 697987616, 699974716, 702561975, 705156803, 707256854, 709375203, 711879373, 714299977, 716230452, 717710674, 719484031, 722040296, 724317193, 726057947, 727693737, 729695559, 732113600, 734531879, 736716092, 739014447, 741535366, 744174719, 746585250, 748323143, 749877155, 751803041, 753771782, 755292118, 756237864, 757179022, 758780003, 760568202, 761845112, 762535453, 763242900, 764432013, 765858769, 766890228]
1788.8G66890228L99351M96924J237333J374483Q38220M12404O90341J165927J192748
1807.1G74697959P12157L33130N98013J040578J013399N80966K51293L86894Q15988
1825.5G80430377Q11696L13282K18153O30557Q54135O57797J86324j15991R3043O64234
1845.9G84743607O60956J62661j7583L03805O11782L90470q4639j38164K88427M85778
1866.3G87407100J44720o8843K36571O16193O89864L36528n8055P0989N71310P14362
1886.7G90660739K44737j38998J10626N63085O66618K44975j72496m5835L92556M37379
1907.1G92963386j9551k72989O4015M71592L66330p8976k57134J10984O18696N04494
1927.5G94470847o6579k67684J29759M94838L12090j83523l53038J43111O17980L67284
$$ y = [766890228, 767289579, 767786503, 769023836, 770398319, 771236539, 771648943, 772339284, 773505211, 774697959, 775410116, 775743246, 776341259, 777381837, 778395236, 778976202, 779227495, 779614389, 780430377, 781242073, 781555355, 781773508, 782404065, 783258200, 783915997, 784102321, 783986330, 784079373, 784743607, 785404563, 785567224, 785549641, 785853446, 786465228, 786855698, 786771059, 786632895, 786921322, 787407100, 787551820, 787482977, 787719548, 788335741, 789025605, 789362133, 789304078, 789375067, 789946377, 790660739, 790905476, 790766478, 790877104, 791440189, 792106807, 792351782, 792179286, 792133451, 792526007, 792963386, 792943835, 792670846, 792734861, 793206453, 793572783, 793493807, 793236673, 793347657, 793966353, 794470847, 794404268, 794136584, 794266343, 794761181, 795073271, 794889748, 794536710, 794679821, 795297801, 795665085]
1947.9G95665085j18851j08958L60430O21676K83241j71065q8990L86954N51164J78277
1968.3G97558963k02000o1750M11987N25236Q1957k94030q5771L78668M18305o7353
1988.7G98664212m26411j30117L98695L75569j40071m13954r6560K92123J15752m29928
2009G98209310o10590k29896N4002k60412q06928r14633n60940k05815r2864k94387
2029.4G94286847m54962k15590k9326l28660p23064o18040j43528O1095k33114n52535
2049.8G91049123l99053O9380K84314j848l49104k13266K33591L52740P987k78652
2070.2G90755212j16586K69293L42310l8564l15368p1288L19362L22700n3943k66611
2090.6G91146517K0742M19438L67046m3750j86682J56879M98116L62993q1718k52009
$$ y = [795665085, 795546234, 795437276, 795797706, 796419382, 796702623, 796531558, 796442568, 796829522, 797380686, 797558963, 797356963, 797295213, 797707200, 798232436, 798314393, 798020363, 797934592, 798313260, 798731565, 798664212, 798237801, 798107684, 798506379, 798881948, 798741877, 798327923, 798231363, 798523486, 798639238, 798209310, 797598720, 797368824, 797422826, 797162414, 796355486, 795440853, 794879913, 794674098, 794581234, 794286847, 793831885, 793616295, 793586969, 793258309, 792535245, 791917205, 791773677, 791834772, 791601658, 791049123, 790650070, 790719450, 791003764, 791001916, 790652812, 790439546, 790673137, 791025877, 791033864, 790755212, 790638626, 790907919, 791250229, 791211665, 790896297, 790825009, 791144371, 791467071, 791413128, 791146517, 791167259, 791586697, 791953743, 791909993, 791723311, 791880190, 792378306, 792741299, 792659581, 792407572]
2111G92407572P7904M18245K60175j84238l05593M0173L47436J78575k41339l12686
2131.4G92686224R7036L95060J28269k88248k49684J58727L59357Q0466k83122k05934
2151.8G92878151K72155N25355K12669j53958J8298N08786O44743K94328L6657L03745
2172.2G95540929P61509P94351L81112J19805L54588P24078O93798K85089P7963L76462
2192.6H00109684P29859O04391J50025j9490L63350Q08775O86645J77205L4928M29452
2213H04074824P58469N45442Q3923M1247M68910P19845M05609n1558k4497M22180O17563
2235.4H08061957K57552j22011N9605N24759N86272J48892k17974j6332M60327N23031
2255.8H10266078J20937j66475O5207M98772N07354P3731j78098J48236N97597M81844
$$ y = [792407572, 792485476, 792903721, 793163896, 792979658, 792674065, 792714238, 793061674, 793240249, 792998910, 792686224, 792783260, 793178320, 793306589, 793018341, 792768657, 792927384, 793286741, 793367207, 793084085, 792878151, 793150306, 793675661, 793888330, 793734372, 793752670, 794261456, 794906199, 795200527, 795237184, 795540929, 796302438, 797096789, 797477901, 797597706, 797952294, 798676372, 799370170, 799655259, 799733222, 800109684, 800839543, 801443934, 801593959, 801574469, 801937819, 802746594, 803433239, 803610444, 803645372, 804074824, 804833293, 805378735, 805462658, 805503905, 805972815, 806692660, 807098269, 807046711, 807022214, 807444394, 808061957, 808319509, 808197498, 808257103, 808781862, 809368134, 809517026, 809299052, 809282720, 809743047, 810266078, 810387015, 810220540, 810285747, 810784519, 811291873, 811365604, 811187506, 811335742, 811933339, 812415183]
2276.2H12415183k3306j92046J74642N78522M46737q7440k53141J78755N44786L66032
2296.6H14148724n5611j42336J87993M44949K65717j18375j54435K36928M76659K55227
2317H15545440m7267l6657K33829L68894J09374k33710k11894J27792K73049o6757
2337.4H16062093n00739m52697q3566j19626l70562k50936J60277N92589N55277j10447
2357.8H15481663o75798n53012r7334L0279l60608q00252o92904k76089k67982o10650
2378.2H11177313o92367l23594M7922l0815l94762n24521k36511N4002o9440m13477
2398.6H08593750m88400k05040l159j93298n52714o24240l24547r5546k97070o75857
2419H05133879o94632l59059k12609n03362q32557p46251l79920k74419n92530r00626
$$ y = [812415183, 812391877, 812199831, 812374473, 812952995, 813399732, 813312292, 813059151, 813237906, 813782692, 814148724, 814093113, 813950777, 814138770, 814583719, 814849436, 814731061, 814576626, 814813554, 815290213, 815545440, 815498173, 815461516, 815695345, 816064239, 816173613, 815939903, 815728009, 815855801, 816128850, 816062093, 815561354, 815108657, 815025091, 814905465, 814534903, 814283967, 814444244, 815036833, 815592110, 815481663, 814805865, 814252853, 814155519, 814185798, 813825190, 813024938, 812332034, 812055945, 811787963, 811177313, 810484946, 810161352, 810209274, 810178459, 809783697, 809259176, 809022665, 809076667, 809007227, 808593750, 808105350, 807900310, 807897151, 807703853, 807151139, 806526899, 806202352, 806106806, 805809736, 805133879, 804439247, 804080188, 803867579, 803364217, 802531660, 801785409, 801405489, 801131070, 800538540, 799637914]
2439.4G99637914q05915m24444k85924o13808r08435p38382l60549k91288o27338q92759
2459.8G93689072o99401l22699k95222o47605q42750n52058j79350k89679p35402q53181
2480.2G88271725m71234j37270k81512o42777o89208l35813l1948j73211n60045o31690
2500.6G84317017k85209m708j79172n54979n57780j81794N424l05057p21454o69659
2521G80862629k69949j41084m47452p64430o93560m00602l85225p13408r66013q06272
2541.4G75274634m40061l80575p02978r37283p26401l73841m18186p75576r30786o85334
2561.8G68903613l69787m22597p34448q32737n93126l68535m95732p85828p95066n04077
2582.2G63001680l00407m27902o99281o89507l54886j59085l46482o21795o14405l69370
$$ y = [799637914, 798831999, 798407555, 798121631, 797507823, 796599388, 795861006, 795500457, 795209169, 794581831, 793689072, 792989671, 792666972, 792371750, 791724145, 790881395, 790329337, 790149987, 789860308, 789124906, 788271725, 787800491, 787663221, 787381709, 786738932, 786049724, 785713911, 785681963, 785508752, 784948707, 784317017, 784031808, 784027100, 783847928, 783292949, 782735169, 782553375, 782558799, 782253742, 781532288, 780862629, 780592680, 780451596, 780004144, 779239714, 778546154, 778145552, 777760327, 777046919, 776080906, 775274634, 774834573, 774453998, 773751020, 772813737, 772087336, 771713495, 771295309, 770519733, 769588947, 768903613, 768533826, 768111229, 767376781, 766544044, 765950918, 765582383, 765086651, 764300823, 763505757, 763001680, 762701273, 762273371, 761574090, 760884583, 760529697, 760370612, 760024130, 759402335, 758787930, 758418560]
2602.6G58418560k78711n01693p35640p29382n75364n39005p80940j069069j049816
2620.9G52158940q12948p69198j029074j278043j229167j034379j027882j214683j356244
2639.3G42407322j268268j055121j028121j246452j390099j251042j043857j038253
2655.6G33086109j231372j335681j142800q91089r12786j141965j232147j047075q25286
2673.9G23325908q17358j002014j117349r70244p55966p86781j003683j076162r13441
2692.3G14882910p92920r19640j141608j204491j089990r71258j023233j212120j280069
2710.7G05247581j119435r60111j019717j165926j151025r61364q01921q41975r73165
2729F96252942r50992p70509o60301p80284r52601q62241o22630n73695p56562r15765
$$ y = [758418560, 758139849, 757638156, 756902516, 756173134, 755597770, 755058765, 754277825, 753208756, 752158940, 751345992, 750576794, 749547720, 748269677, 747040510, 746006131, 744978249, 743763566, 742407322, 741139054, 740083933, 739055812, 737809360, 736419261, 735168219, 734124362, 733086109, 731854737, 730519056, 729376256, 728485167, 727572381, 726430416, 725198269, 724151194, 723325908, 722508550, 721506536, 720389187, 719418943, 718662977, 717876196, 716872513, 715796351, 714882910, 714089990, 713170350, 712028742, 710824251, 709734261, 708763003, 707739770, 706527650, 705247581, 704128146, 703168035, 702148318, 700982392, 699831367, 698870003, 698068082, 697226107, 696252942, 695301950, 694531441, 693871140, 693090856, 692138255, 691276014, 690653384, 690079689, 689323127, 688407362]
2749.4F88407362q27492n89728m83513o09636p69019o97315m57585m04000o17683q10087
2769.8F82141304p77125o10531o01589q53539j083493j037896q48114q53300j132548
2788.2F74343169j371205j324773j179159j249909j545548j752079j649261j496195
2804.5F62775040j629055j927137k075792j977145j835645j938223k229393k374947
2820.8F46787703k278805k188444k345264k661705k787292k632916k554357k812624
2837.1F26526296l196597l376126l351391l425955l740967l941178l668249l125608
2853.4E98700225k764225k737581k921582l135085l355026l793895m463136n010307
2869.7E70519388n206347n251169n400836n487442n165995m419207l543318k826750
$$ y = [688407362, 687579870, 686990142, 686506629, 685896993, 685127974, 684430659, 683973074, 683569074, 682951391, 682141304, 681364179, 680753648, 680152059, 679298520, 678215027, 677177131, 676329017, 675475717, 674343169, 672971964, 671647191, 670468032, 669218123, 667672575, 665920496, 664271235, 662775040, 661145985, 659218848, 657143056, 655165911, 653330266, 651392043, 649162650, 646787703, 644508898, 642320454, 639975190, 637313485, 634526193, 631893277, 629338920, 626526296, 623329699, 619953573, 616602182, 613176227, 609435260, 605494082, 601825833, 598700225, 595936000, 593198419, 590276837, 587141752, 583786726, 579992831, 575529695, 570519388, 565313041, 560061872, 554661036, 549173594, 544007599, 539588392, 536045074, 533218324]
2886.1E33218324k275705j690388j052141o04749n58436p64310q83579r12726j079142
2904.4E23397148j456619j918971k324105k692818l140748l642618l969372l949821
2920.7E00302076l592252l028185k383798j632512o62624N54978J856596K975166L850817
2939.1D98240262M630834N294323N663872N719721N695284N774200N856394N816579
2955.4E42691469N661965N475342N321443N106032M724383M276216L946722L826797
2971.7E81030369L816664L707469L468573L255665L130317K973437K663732K252280
2988F06298506J967669J861334J697123J341223Q73149M86791L05474J64509j54853
3006.4F14840925n46098p59244q56459j079202j466155j838803j973868j876056j871645
$$ y = [533218324, 530942619, 529252231, 528200090, 527595341, 527036905, 526272595, 525389016, 524476290, 523397148, 521940529, 520021558, 517697453, 515004635, 511863887, 508221269, 504251897, 500302076, 496709824, 493681639, 491297841, 489665329, 489002705, 489557683, 491414279, 494389445, 498240262, 502871096, 508165419, 513829291, 519549012, 525244296, 531018496, 536874890, 542691469, 548353434, 553828776, 559150219, 564256251, 568980634, 573256850, 577203572, 581030369, 584847033, 588554502, 592023075, 595278740, 598409057, 601382494, 604046226, 606298506, 608266175, 610127509, 611824632, 613165855, 614039004, 614525795, 614831269, 614995778, 614840925, 614294827, 613535583, 612679124, 611599922, 610133767, 608294964, 606321096, 604445040, 602573395]
3024.7F02573395k133131k387285k378703k243518k302766k550841k651095k563298
3041.1E83362758k529979k661943k871513k956629k873004k768457k770483k914786
3057.4E61015964l032983k927363k704143k640069k832770l073156l050268k784550
3073.7E37970662k587318k643466k877951k974808k870798k864301k936125k921164
3090E15294731k886713k846360k783001k747416k789021k842962k749890k616853k681166
3108.4D90351349k804398k651960k406031k476156k698481k812922k821743k731264
3124.7D68948394k637297k579629k534539k504766k424240k341419k378822k509534
3141D49038148k550542k462864k379001k254217k108306k168536k391577k484649k372832
$$ y = [602573395, 600440264, 598052979, 595674276, 593430758, 591127992, 588577151, 585926056, 583362758, 580832779, 578170836, 575299323, 572342694, 569469690, 566701233, 563930750, 561015964, 557982981, 555055618, 552351475, 549711406, 546878636, 543805480, 540755212, 537970662, 535383344, 532739878, 529861927, 526887119, 524016321, 521152020, 518215895, 515294731, 512408018, 509561658, 506778657, 504031241, 501242220, 498399258, 495649368, 493032515, 490351349, 487546951, 484894991, 482488960, 480012804, 477314323, 474501401, 471679658, 468948394, 466311097, 463731468, 461196929, 458692163, 456267923, 453926504, 451547682, 449038148, 446487606, 444024742, 441645741, 439391524, 437283218, 435114682, 432723105, 430238456, 427865624]
3159.4D27865624k179801k079010k095252k098143k074898k019137j941323j943857
3175.7D11434203k025336k011418j866281j770079j767278j787752j821935j811504
3192C96572620j729578j706004j732111j679927j570583j500338j506925j549273j503617
3210.3C82094264j374632j344055j412839j465171j458496j357377j254707j246423
3226.7C71180564j231521j098514r75102j089007j280337j288772j180738j064718
3243C61971855r58413r33915j033127j038433r04679q76605r86010j026750r26405
3261.3C53287518q39919q16196p34299n51641n26965p47621r39608r75281q59588p34896
3281.7C45561504o97702o70403o24865n15491m26173n26280p33792q72135q55029o21230
$$ y = [427865624, 425685823, 423606813, 421511561, 419413418, 417338520, 415319383, 413378060, 411434203, 409408867, 407397449, 405531168, 403761089, 401993811, 400206059, 398384124, 396572620, 394843042, 393137038, 391404927, 389725000, 388154417, 386654079, 385147154, 383597881, 382094264, 380719632, 379375577, 377962738, 376497567, 375039071, 373681694, 372426987, 371180564, 369949043, 368850529, 367875427, 366786420, 365506083, 364217311, 363036573, 361971855, 361013442, 360079527, 359046400, 358007967, 357103288, 356226683, 355240673, 354213923, 353287518, 352447599, 351631403, 350897104, 350345463, 349818498, 349070877, 348131269, 347155988, 346296400, 345561504, 344863802, 344193399, 343568534, 343053043, 342626870, 342100590, 341366798, 340494663, 339639634, 339018404]
3302.1C39018404l42279m09067q04812j082837j010567q14617p64072p64876p15882
3320.5C32309395o54459n80072o77586q94546q60572o87152o03736n68122o54935q19087
3340.9C25309128q68708q32647p22468n87464o73443r06169r54658p81506o35833o54340
3361.3C17691892o47038m62919l75003o40362r78709r55879o96063n76050n61356n83649
3381.7C11214864o09845m99129k32190K3365o7741m43398n29260j83701N2154k25783
3402.1C08499336n89221m47184j42187q4818r9420j95235l28481k53916j48863j22964
3422.5C06087047O0439K87861L23712K32816K65122L62008J57983j67668j25766J83940
3442.9C07667494L85880L73870K90305L22193M10199M90248O07789O84470N69105N53310
$$ y = [339018404, 338676125, 338267058, 337462246, 336379409, 335368842, 334554225, 333790153, 333025277, 332309395, 331654936, 331074864, 330397278, 329502732, 328642160, 327955008, 327351272, 326783150, 326128215, 325309128, 324440420, 323607773, 322885305, 322297841, 321624398, 320718229, 319763571, 318982065, 318346232, 317691892, 317044854, 316581935, 316206932, 315566570, 314587861, 313631982, 312935919, 312359869, 311798513, 311214864, 310605019, 310105890, 309873700, 309897065, 309829324, 309385926, 308856666, 308672965, 308725119, 308499336, 307910115, 307462931, 307320744, 307235926, 307136506, 306941271, 306612790, 306358874, 306210011, 306087047, 306147486, 306435347, 306759059, 306991875, 307256997, 307619005, 307776988, 307609320, 307483554, 307667494, 308053374, 308427244, 308717549, 309039742, 309449941, 309940189, 310547978, 311232448, 311801553, 312354863]
3463.2C12354863Q55863R60469N98073K36958K75523N23358Q00401Q68649O18308O04600
3483.6C18697065Q45760P70629O06000P65622R61423R78857Q93980Q32618P85648O86288
3504C26823890O77854P53820Q98242J178354J184404Q89957Q29011J037419J235306
3522.4C35508257J063734P01726P43151J114696J371324J404583J242102J106083J315564
3540.8C45571220J537174J379162J070917J116365J342863J499742J662046J734644
3557.1C56914133J800358J912624J819640J526296J759976K539397K720386K462774
3573.4C73455584K399594K485960K696306L022045L062457K588361K302289K967358
3589.7C94979954L386676L203213L183127L374338L410578L485113L547490L253489
$$ y = [312354863, 313210726, 314171195, 314769268, 315006226, 315281749, 315805107, 316605508, 317474157, 318092465, 318697065, 319542825, 320313454, 320919454, 321685076, 322646499, 323625356, 324519336, 325351954, 326137602, 326823890, 327501744, 328255564, 329153806, 330332160, 331516564, 332406521, 333235532, 334272951, 335508257, 336571991, 337273717, 338016868, 339131564, 340502888, 341907471, 343149573, 344255656, 345571220, 347108394, 348487556, 349558473, 350674838, 352017701, 353517443, 355179489, 356914133, 358714491, 360627115, 362446755, 363973051, 365733027, 368272424, 370992810, 373455584, 375855178, 378341138, 381037444, 384059489, 387121946, 389710307, 392012596, 394979954, 398366630, 401569843, 404752970, 408127308, 411537886, 415022999, 418570489, 421823978]
3606D21823978L100038L379434L641010L865599L755451L409147L778547M170149L878177
3624.4D54801530L129989K757489L912479M481792M123658L852547L694713L711402
3640.7D84465599L841668L659815L074795K981603M053801M404724L781319L735900
3657E13999224M041731L722251L365159L307998K889156K405465L045678L135264K334654
3675.4E42246580K876520L498256L334225L168642K897024K316118J857400K271473
3691.7E64466238K706409K568841K227127J851499J650453J932680K092481J688957
3708E81184685J062751J158774K166629K399564J850843J376450J256824J231253J367748
3726.4E95055521J739919J571178R03964N42283J134873K000391J827359N26250j05262
$$ y = [421823978, 424924016, 428303450, 431944460, 435810059, 439565510, 442974657, 446753204, 450923353, 454801530, 457931519, 460689008, 464601487, 469083279, 473206937, 477059484, 480754197, 484465599, 488307267, 491967082, 495041877, 498023480, 502077281, 506482005, 510263324, 513999224, 518040955, 521763206, 525128365, 528436363, 531325519, 533730984, 536776662, 539911926, 542246580, 545123100, 548621356, 551955581, 555124223, 558021247, 560337365, 562194765, 564466238, 567172647, 569741488, 571968615, 573820114, 575470567, 577403247, 579495728, 581184685, 582247436, 583406210, 585572839, 587972403, 589823246, 591199696, 592456520, 593687773, 595055521, 596795440, 598366618, 599270582, 599812865, 600947738, 602948129, 604775488, 605301738, 605196476]
3744.7F05196476J172543J192629M02391J264036K077400J573444Q59558J033426J323103
3763.1F16095006J068712Q87871P75873R47833J378715J366735R55045N91517P35938
3781.4F24803245Q39591P64966R27746J031399R75669P51376M99785N82039K73347
3799.8F31449163P8499R56536Q69214O38664J345873J422941N90742M6313M70698K31921
3820.2F38100564L43323J244068J107097P50244N97417N96404P94888L57687k37524
3838.5F43654168K20835Q15987J107336J251757J022875K2590j473188k82347J816690
3856.9F48156703J552224O46531M7386K13563N14925P6473J69038P81537R70959Q65102
3877.3F53994441K18689J15932N29289L52382N31674N27322R5189M73141Q29697L00884
$$ y = [605196476, 606369019, 607561648, 607964039, 609228075, 611305475, 612878919, 613738477, 614771903, 616095006, 617163718, 618051589, 618827462, 619775295, 621154010, 622520745, 623475790, 624067307, 624803245, 625642836, 626407802, 627335548, 628366947, 629342616, 630093992, 630593777, 631175816, 631449163, 631527662, 632484198, 633353412, 633992076, 635337949, 636760890, 637351632, 637397945, 637868643, 638100564, 638443887, 639687955, 640795052, 641545296, 642142713, 642739117, 643534005, 643891692, 643654168, 643875003, 644690990, 645798326, 647050083, 648072958, 648095548, 646622360, 646340013, 648156703, 649708927, 650355458, 650402844, 650616407, 651131332, 651207805, 651376843, 652158380, 653129339, 653994441, 654213130, 654329062, 654858351, 655210733, 655742407, 656269729, 656364918, 656838059, 657667756, 657968640]
3897.7F57968640k68936k53200K6941N45978R26972P87556N41985L38674J0311j23083
3918.1F60501838J53362K93077J64687K70546M38988K65002J77264L89397M21763K51472
3938.5F63327396P3492M0651K82943K94924O7472J82987M14609L94106K78652K21729
3958.9F65578961J26899O2823J30117J99079K13921J76847J57655K02298K33710J84834
3979.3F67267144J77324K43425J81317K5571K3245J46986J83641K00272K57492
3997.6F68706417
$$ y = [657968640, 657699704, 657446504, 657473445, 658019423, 658946395, 659733951, 660275936, 660614610, 660624921, 660501838, 660655200, 660948277, 661112964, 661383510, 661822498, 662087500, 662264764, 662654161, 663075924, 663327396, 663400888, 663441539, 663724482, 664019406, 664086878, 664269865, 664684474, 665078580, 665357232, 665578961, 665705860, 665768683, 665898800, 666097879, 666311800, 666488647, 666646302, 666848600, 667082310, 667267144, 667444468, 667687893, 667869210, 667894781, 667918026, 668065012, 668248653, 668448925, 668706417]
##END=$$ End of the data block
