##TITLE=$$ Begin of the data block
##JCAMP-DX=5.00 $$ ACD/SpecManager v 10.08
##SPECTROMETER/DATA SYSTEM=Alpha
##DATE=23 Dec 2014 09:14:34
##DATA TYPE=INFRARED SPECTRUM
##DATA CLASS=XYDATA
##ORIGIN=
##OWNER=
##NPOINTS=1765
##FIRSTX=399.76428223
##LASTX=3997.64306641
##MAXX=3997.64306641
##MINX=399.76428223
##MAXY=0.81849730
##MINY=0.23272870
##XFACTOR=1.0000000000
##YFACTOR=1.000000000000000e-9
##FIRSTY=0.53065449
##DELTAX=2.03961372
##XUNITS=1/CM
##YUNITS=ARBITRARY UNITS
##XYDATA=(X++(Y..Y))
$$ plain form
399.8 530654490 525376141 522284865 521337509 521249592 521357894 522574604 525284469 527994633 528323650
418.1 528323650 525715232 523543715 522497475 520912409 517706692 513746858 510851324 509244204
434.4 509244204 507752359 506675780 508145630 513051569 519268751 523806870 526112854 527911782
450.8 527911782 530296743 531971157 531371355 529204130 527697444 526877224 524918497 521000803 516681969
469.1 516681969 513621688 511433482 508811533 505630136 503376901 502972722 503374636 503245890 502467096
487.5 502467096 502030373 502420187 502374291 500456989 497450858 495317578 494157851 492208987 488709658
505.8 488709658 484893680 481871754 478989780 475164860 470136046 464871228 460885376 458190799
522.1 458190799 455758274 453513622 452673733 453685343 455556184 457429171 459987938 464806169 471620619
$$ packed form
399.8E30654490n278349l091276r47356q7917J08302J216710K709865K710164L29017
418.1E28323650k608418k171517j046240j585066l205717l959834k895534j607120
434.4E09244204j491845j076579J469850M905939O217182M538119K305984J798928
450.8E27911782K384961J674414n99802k167225j506686q20220j958727l917694m318834
469.1E16681969l060281k188206k621949l181397k253235m04179M01914j28746p78794
487.5E02467096m36723L89814m5896j917302l006131k133280j159727j948864l499329
505.8D88709658l815978l021926k881974l824920n028814n264818l985852k694577
522.1D58190799k432525k244652q39889J011610J870841J872987K558767M818231O814450
$$ plain form
540.5 471620619 477830261 481329411 482427001 482790530 482853591 481593996 478658468 474992216 471478701
558.9 471478701 467632443 462175727 455028921 447452396 440585345 435003847 431051463 429236382
575.2 429236382 430344343 434666246 441247612 448464185 455385566 462040722 468117774 472470194
591.5 472470194 474367768 474555552 474420190 474581778 474522561 473847836 473214597 473599344 475028425 476423770
611.9 476423770 477375954 478905499 481976569 486182272 490247697 493619621 496946841 500807881 504591048
630.2 504591048 507259786 508790255 510265410 512365341 514518797 515734673 516041338 516617119 518154502
648.6 518154502 519945383 520975053 521357477 522148728 523764968 525270224 525861084 526099086 527268946
667 527268946 529746592 531349003 531874478 532484531 534154058 536671102 538626969 539327800 539740622
$$ packed form
540.5D71620619O209642L499150J097590L63529O3061j259595k935528l666252l513515
558.9D71478701l846258n456716p146806p576525o867051n581498l952384j815081
575.2D29236382J107961M321903O581366P216573O921381O655156O077052M352420
591.5D72470194J897574J87784j35362J61588n9217o74725o33239L84747J429081J395345
611.9D76423770R52184J529545L071070M205703M065425L371924L327220L861040L783167
630.2E04591048K668738J530469J475155K099931K153456J215876L06665N75781J537383
648.6E18154502J790881J029670L82424P91251J616240J505256N90860K38002J169860
667E27268946K477646J602411N25475O10053J669527K517044J955867P00831M12822
$$ plain form
685.3 539740622 540900707 542345524 542643547 541185379 538969278 537107885 535166323 531973898 527802587
703.7 527802587 524555564 523607254 524335146 525507987 527249277 530653179 536026955 542327821 548095405
722 548095405 553209722 558975637 565741897 571906984 576021671 578749657 581775188 585305870 587676167
740.4 587676167 587546647 585790038 584042728 582252562 578847349 573209822 567026556 562198341 558479249
758.7 558479249 554535925 550442040 548100650 549190164 553242624 558563709 564618826 572473705
775.1 572473705 582611322 593143344 601528764 607621908 613408625 619842291 625510752 629016459
791.4 629016459 631466746 635269642 641013801 646717608 650534093 653197289 656660557 661006510
807.7 661006510 664154232 665000260 665242910 666917205 669309318 669991791 668303251 666159451 665063024
$$ packed form
685.3E39740622J160085J444817K98023j458168k216101j861393j941562l192425m171311
703.7E27802587l247023r48310P27892J172841J741290L403902N373776O300866N767584
722E48095405N114317N765915O766260O165087M114687K727986L025531L530682K370297
740.4E87676167j29520j756609j747310j790166l405213n637527o183266m828215l719092
758.7E58479249l943324m093885k341390J089514M052460N321085O055117P854879
775.1E72473705J0137617J0532022Q385420O093144N786717O433666N668461L505707
791.4F29016459K450287L802896N744159N703807L816485K663196L463268M345953
807.7F61006510L147722Q46028K42650J674295K392113O82473j688540k143800j096427
$$ plain form
826 665063024 663661361 659669697 653313279 647073388 642321944 637874365 632184029 625939965 621185362
844.4 621185362 618302226 615427792 610987186 605615020 600854814 596838415 592768550 589647770
860.7 589647770 590556741 597425163 608843386 621638060 633727610 644977212 655496836 663809836
877 663809836 667705834 666861713 663401186 659333825 654493511 647843301 639977932 632990539 627955914
895.4 627955914 623669565 618396401 612119555 606067240 600429296 593715966 584682167 573991656
911.7 573991656 563267469 553147733 543223083 533698738 526094973 521746993 520188212 519756138
928 519756138 519571900 520348191 523128211 527691960 532767177 537666500 542674065 547274232 549184203
946.4 549184203 546139717 538085937 526865005 514059246 499846488 483828872 466340870 448352516
$$ packed form
826F65063024j401663l991664o356418o239891m751444m447579n690336o244064m754603
844.4F21185362k883136k874434m440606n372166m760206m016399m069865l120780
860.7E89647770R08971O868422J1418223J2794674J2089550J1249602J0519624Q313000
877F63809836L895998q44121l460527m067361m840314o650210p865369o987393n034625
895.4F27955914m286349n273164o276846o052315n637944o713330r033799j0690511
911.7E73991656j0724187j0119736r924650r524345p603765m347980j558781m32074
928E19756138j84238P76291K780020M563749N075217M899323N007565M600167J909971
946.4E49184203l044486q053780j1220932j2805759j4212758j6017616j7488002j7988354
$$ plain form
962.7 448352516 430269718 411578596 391788751 371277034 350885749 331065923 311929822
977 311929822 293828756 277518779 263821900 253115416 245137662 239365965 235486954 233366534
993.3 233366534 232728705 233012423 233680576 234480023 235331580 236047164 236229733 235667810 234711021 234053060
1013.7 234053060 234147489 234995842 236422524 238459632 241322339 245028600 249148965 253150195 256875664
1032 256875664 260309041 263219267 265177399 266100556 266606420 267435551 268799871 270604730 273101926
1050.4 273101926 276941538 282570630 289812416 298193067 307539821 318061054 329251200 338531494
1066.7 338531494 341854095 336928308 325947762 314060271 305196166 300247520 298592448 299636751
1083 299636751 302872270 307586074 313129127 319275260 325923413 332556218 338150829 341796130 343513638
$$ packed form
962.7D48352516j8082798j8691122j9789845k0511717k0391285j9819826j9136101
977C11929822j8101066j6309977j3696879j0706484p977754n771697l879011k120420
993.3B33366534o37829K83718O68153P99447Q51557P15584J82569n61923r56789o57961
1013.7B34053060R4429Q48353J426682K037108K862707L706261M120365M001230L725469
1032B56875664L433377K910226J958132R23157N05864Q29131J364320J804859K497196
1050.4B73101926L839612N629092P241786Q380651R346754J0521233J1190146R280294
1066.7C38531494L322601m925787j0980546j1887491q864105m948646j655072J044303
1083B99636751L235519M713804N543053O146133O648153O632805N594611L645301J717508
$$ plain form
1101.4 343513638 344319016 345434010 347529501 350577086 354343563 358650863 363057435 366829187
1117.7 366829187 369457573 371185780 372857988 375240356 378609270 382823765 387372941 391270995
1134 391270995 393077672 391509265 386383295 378737986 370049894 361377984 353235304 346078396 340525329
1152.4 340525329 336986661 335346639 335203767 336426377 339442790 344790399 352524847 362253964
1168.7 362253964 373602211 386411458 400465131 415148407 429688483 443706602 457244486
1183 457244486 470275313 482230812 492213607 499858022 505623281 510075212 513338566 515425801
1199.3 515425801 516825438 518438816 520861983 523988843 527543008 531687915 536729813 542434037
1215.6 542434037 547853351 551968694 554545105 556034744 556690216 556274712 554714918 552599013 550689638
$$ packed form
1101.4C43513638Q05378J114994K095491L047585L766477M307300M406572L771752
1117.7C66829187K628386J728207J672208K382368L368914M214495M549176L898054
1134C91270995J806677j568407n125970p645309q688092q671910q142680p156908n553067
1152.4C40525329l538668j640022j42872J222610L016413N347609P734448R729117
1168.7C62253964J1348247J2809247J4053673J4683276J4540076J4018119J3537884
1183D57244486J3030827J1955499R982795P644415N765259M451931L263354K087235
1199.3E15425801J399637J613378K423167L126860L554165M144907N041898N704224
1215.6E42434037N419314M115343K576411J489639O55472m15504j559794k115905j909375
$$ plain form
1234 550689638 549150288 547607720 545943797 544725120 544631779 545691252 547315478 549038231 550953031
1252.3 550953031 553208530 555415332 556978822 557847261 558612704 559926629 561894953 564063728 566031873
1270.7 566031873 567747295 569136202 569858372 569617927 568627954 567533314 566736639 566005886 564894855
1289 564894855 563364148 561747313 560188413 558414519 556208491 553840518 551775515 550078869 548390865
1307.4 548390865 546556532 544853747 543557584 542585254 541463256 539748847 537375212 534330606
1323.7 534330606 530378163 525308073 519415796 513565481 508609414 504863441 502163649 500407398
1340 500407398 499733716 499985427 500646055 501094460 500989079 500498295 499901384 499234885 498337060 497096449
1360.4 497096449 495739073 494872808 494505882 494245380 494175225 494543642 495520175 496850163 498004496
$$ packed form
1234E50689638j539350j542568j663923j218677r3341J059473J624226J722753J914800
1252.3E50953031K255499K206802J563490Q68439P65443J313925J968324K168775J968145
1270.7E66031873J715422J388907P22170k40445r89973j094640p96675p30753j111031
1289E64894855j530707j616835j558900j773894k206028k367973k065003j696646j688004
1307.4E48390865j834333j702785j296163r72330j121998j714409k373635l044606
1323.7E34330606l952443n070090n892277n850315m956067l745973k699792j756251
1340E00407398o73682K51711O60628M48405j05381m90784n96911o66499q97825j240611
1360.4D97096449j357376q66265l66926k60502p0155L68417R76533J329988J154333
$$ plain form
1378.8 498004496 498906404 500181615 502725899 506898463 511488140 514908552 517053664 518199801
1395.1 518199801 518417656 517700195 516442060 514970005 513270497 511516511 509579241 507384360 505448878
1413.5 505448878 504119575 503016293 501955092 501540244 501915812 502904832 504167795 505409479 506767929
1431.8 506767929 508366585 510334074 512669086 514721572 516406775 517862558 518967390 519297838
1448.1 519297838 518693626 517534733 516137004 514011025 511799395 511452377 512365580 514618158 518618584
1466.5 518618584 523632228 529872835 538889706 549342036 558913112 567441344 575163543 582432032
1482.8 582432032 589176476 595669925 602120280 608131588 613048434 617570043 622496903 627068579
1499.1 627068579 630698383 633638442 636543334 640246153 643585742 646033704 648268282 650616765
$$ packed form
1378.8D98004496R01908J275211K544284M172564M589677L420412K145112J146137
1395.1E18199801K17855p17461j258135j472055j699508j753986j937270k194881j935482
1413.5E05448878j329303j103282j061201m14848L75568R89020J262963J241684J358450
1431.8E06767929J598656J967489K335012K052486J685203J455783J104832L30448
1448.1E19297838o04212j158893j397729k125979k211630l47018R13203K252578M000426
1466.5E18618584N013644O240607R016871J0452330R571076Q528232P722199P268489
1482.8E82432032O744444O493449O450355O011308M916846M521609M926860M571676
1499.1F27068579L629804K940059K904892L702819L339589K447962K234578K348483
$$ plain form
1515.4 650616765 653147638 655258298 656882107 658647895 660662770 662669778 664211154 665229976
1531.8 665229976 666176081 667394698 668303788 668346465 668194175 668735862 669546545 669976473 669728994 669197738
1552.2 669197738 668835104 668516219 667242050 665441811 664949059 664656937 664168954 663180172 661622763
1570.5 661622763 660488725 659548402 658250391 657139957 656069696 654745996 653541327 652444839
1586.8 652444839 651084661 649290740 647357345 645612657 643960416 641980410 639478981 636805892
1603.2 636805892 634323359 631813109 628768444 625401020 622238696 618784249 614718020 611521125
1619.5 611521125 608539879 604865730 601619959 598751485 595791757 593338251 591162503 588717103
1635.8 588717103 587141812 586426616 585905552 585680068 585847974 586754918 588027179 589202046 591411293
$$ packed form
1515.4F50616765K530873K110660J623809J765788K014875K007008J541376J018822
1531.8F65229976R46105J218617R09090M2677j52290N41687Q10683M29928k47479n31256
1552.2F69197738l62634l18885j274169j800239m92752k92122m87983r88782j557409
1570.5F61622763j134038r40323j298011j110434j070261j323700j204669j096488
1586.8F52444839j360178j793921j933395j744688j652241j980006k501429k673089
1603.2F36805892k482533k510250l044665l367424l162324l454447m066229l196895
1619.5F11521125k981246l674149l245771k868474k959728k453506k175748k445400
1635.8E88717103j575291p15196n21064k25484J67906R06944J272261J174867K209247
$$ plain form
1654.1 591411293 594532013 597494602 600369096 603599429 607499897 611442566 615494788 619943321
1670.5 619943321 624214470 628955543 634383500 639200926 643260419 647472203 653348148 659144282
1686.8 659144282 663706422 667862833 671530545 675330460 679359078 682637334 685567677 688296676
1703.1 688296676 690963209 693722069 695966005 697699010 699410081 701493621 704148471 706708610
1719.4 706708610 708735645 710797906 713280678 715716779 717670381 719163537 720938087 723460197
1735.7 723460197 725708544 727451265 729106009 731139064 733578086 735989392 738144636 740406275
1752 740406275 742907465 745548844 747962534 749701381 751284599 753257453 755255163 756788135 757738769
1770.4 757738769 758667767 760246694 762020707 763305426 764041066 764786959 765970349 767367601 768375218
$$ packed form
1654.1E91411293L120720K962589K874494L230333L900468L942669M052222M448533
1670.5F19943321M271149M741073N427957M817426M059493M211784N875945N796134
1686.8F59144282M562140M156411L667712L799915M028618L278256K930343K728999
1703.1F88296676K666533K758860K243936J733005J711071K083540K654850K560139
1719.4G06708610K027035K062261K482772K436101J953602J493156J774550K522110
1735.7G23460197K248347J742721J654744K033055K439022K411306K155244K261639
1752G40406275K501190K641379K413690J738847J583218J972854J997710J532972R50634
1770.4G57738769R28998J578927J774013J284719P35640P45893J183390J397252J007617
$$ plain form
1788.8 768375218 768783748 769305408 770536065 771885335 772710383 773127675 773830771 775006533 776188731
1807.1 776188731 776883066 777223289 777857006 778942287 779960752 780501187 780750573 781197190 782046795
1825.5 782046795 782828391 783099413 783292651 783922553 784795940 785472631 785673559 785582900 785694778 786346316
1845.9 786346316 786986172 787121952 787080944 787398934 788040757 788435102 788345635 788217604 788515866 789006770
1866.3 789006770 789151728 789067268 789284170 789889336 790581107 790929854 790878057 790947616 791531265 792280734
1886.7 792280734 792562544 792439759 792570055 793156266 793802142 793992341 793782055 793747008 794186771 794655561
1907.1 794655561 794630349 794335902 794386387 794862986 795242429 795161724 794906020 795038104 795661569 796147227
1927.5 796147227 796070814 795810282 795961201 796478331 796782076 796581388 796248376 796431601 797065139 797409236
$$ packed form
1788.8G68375218M08530N21660J230657J349270Q25048M17292P03096J175762J182198
1807.1G76188731O94335L40223O33717J085281J018465N40435K49386M46617Q49605
1825.5G82046795P81596K71022J93238O29902Q73387O76691K00928r0659J11878O51538
1845.9G86346316O39856J35780m1008L17990O41823L94345q9467j28031K98262M90904
1866.3G89006770J44958q4460K16902O05166O91771L48747n1797O9559N83649P49469
1886.7G92280734K81810j22785J30296N86211O45876J90199k10286l5047M39763M68790
1907.1G94655561k5212k94447N0485M76599L79443q0705k55704J32084O23465M85658
1927.5G96147227p6413k60532J50919N17130L03745k00688l33012J83225O33538L44097
$$ plain form
1947.9 797409236 797263324 797164500 797551036 798175514 798428655 798229873 798141718 798527896 799078465 799263775
1968.3 799263775 799061298 799024224 799478233 800007939 800065160 799758792 799686611 800072372 800467014 800384820
1988.7 800384820 799968064 799850285 800278604 800682664 800544500 800137103 800048649 800316513 800396919 799973667
2009 799973667 799399734 799184203 799237311 798978984 798178136 797272146 796697080 796448231 796317160 796018541
2029.4 796018541 795598388 795429945 795416534 795093954 794394076 793763816 793578923 793628275 793393254 792832077
2049.8 792832077 792449832 792544127 792815626 792786360 792432606 792214096 792436182 792808950 792854488 792588532
2070.2 792588532 792469501 792748034 793095291 793039858 792723060 792679965 793002725 793289483 793216944 792962313
2090.6 792962313 793012738 793466091 793838501 793799043 793622255 793756545 794238865 794609189 794522703 794270992
$$ packed form
1947.9G97409236j45912r8824L86536O24478K53141j98782q8155L86178N50569J85310
1968.3G99263775k02477l7074M54009N29706N7221l06368p2181L85761L94642q2194
1988.7H00384820m16756j17779M28319M04060j38164m07397q8454K67864Q0406m23252
2009G99973667n73933k15531N3108k58327q00848r05990n75066k48849j31071k98619
2029.4G96018541m20153j68443j3411l22580o99878o30260j84893M9352k35021n61177
2049.8G92832077l82245R4295K71499k9266l53754k18510K22086L72768M5538k65956
2070.2G92588532j19031K78533L47257n5433l16798m3095L22760K86758p2539k54631
2090.6G92962313N0425M53353L72410l9458j76788J34290M82320L70324q6486k51711
$$ plain form
2111 794270992 794380248 794832706 795093358 794895113 794595778 794646919 794979632 795115590 794829667 794515729
2131.4 794515729 794664860 795110345 795248151 794947624 794704735 794893324 795266151 795339942 795053065 794861078
2151.8 794861078 795160949 795679390 795845091 795673311 795720398 796250641 796882391 797147930 797186494 797531903
2172.2 797531903 798317313 799099147 799453795 799555540 799937785 800724924 801431417 801660538 801691413 802068591
2192.6 802068591 802833676 803468704 803607464 803577721 803973019 804791510 805441558 805600703 805667937 806150496
2213 806150496 806917548 807419002 807474434 807529271 808016360 808729172 809110940 809059381 809068024 809524715 810167313
2235.4 810167313 810432553 810305595 810360849 810880780 811453938 811583579 811360002 811345458 811808825 812326610
2255.8 812326610 812425196 812255085 812328100 812817216 813330173 813451231 813325763 813470244 814014316 814478815
$$ packed form
2111G94270992J09256M52458K60652j98245k99335N1141L32713J35958k85923l13938
2131.4G94515729J49131M45485J37806l00527k42889J88589L72827P3791k86877j91987
2151.8G94861078K99871N18441J65701j71780M7087N30243O31750K65539L8564L45409
2172.2G97531903P85410P81834L54648J01745L82245P87139P06493K29121L0875L77178
2192.6H02068591P65085O35028J38760k9743L95298Q18491O50048J59145O7234M82559
2213H06150496P67052N01454N5432N4837M87089P12812L81768n1559Q643M56691O42598
2235.4H10167313K65240j26958N5254N19931N73158J29641k23577j4544M63367N17785
2255.8H12326610R8586j70111P3015M89116N12957J21058j25468J44481N44072M64499
$$ plain form
2276.2 814478815 814488232 814338923 814547420 815121114 815535665 815422475 815174222 815395892 815979421 816352129
2296.6 816352129 816277266 816116214 816313863 816780925 817078590 817024410 816929758 817145944 817566574 817810893
2317 817810893 817732155 817661583 817977071 818425536 818497300 818225622 818006158 818108320 818368256 818295538 817801356
2339.5 817801356 817363679 817267954 817150652 816788971 816525280 816672742 817215323 817710698 817688525 817146778
2359.9 817146778 816629291 816512525 816397130 815847814 815066636 814515948 814299285 814030945 813420236 812731624
2380.2 812731624 812422812 812483966 812451899 812051535 811532259 811324477 811412334 811324894 810845315 810313582
2400.6 810313582 810108781 810118377 809910238 809323132 808701217 808421671 808344007 808009446 807315350 806648135
2421 806648135 806301773 806068718 805539429 804701507 803979576 803618670 803328037 802713096 801815331 801051736
$$ packed form
2276.2H14478815R417j49309K08497N73694M14551j13190k48253K21670N83529L72708
2296.6H16352129p4863j61052J97649M67062K97665n4180r4652K16186M20630K44319
2317H17810893p8738p0572L15488M48465P1764k71678k19464J02162K59936p2718m94182
2339.5H17801356m37677r5725j17302l61681k63691J47462N42581M95375k2173n41747
2359.9H17146778n17487j16766j15395n49316p81178n50688k16663k68340o10709o88612
2380.2H12731624l08812O1154l2067m00364n19276k07782Q7857q7440m79579n31733
2400.6H10313582k04801R596k08139n87106o21915k79546p7664l34561o94096o67215
2421H06648135l46362k33055n29289q37922p21931l60906k90633o14941q97765p63595
$$ plain form
2441.4 801051736 800676644 800394833 799754560 798816860 798076034 797746956 797456264 796778738 795833945 795115590
2461.8 795115590 794823587 794578969 793961287 793123245 792539239 792319953 792039216 791346729 790522039 790050745
2482.2 790050745 789912820 789631009 788963318 788256764 787936032 787912309 787699819 787093639 786471903 786222637
2502.6 786222637 786224484 786015630 785432518 784881532 784730554 784756005 784464240 783798754 783183098 782879770
2523 782879770 782661617 782173932 781413078 780727983 780333340 779955089 779224098 778246701 777478695 777080238
2543.4 777080238 776690602 775953293 775024772 774349630 773993969 773552358 772745192 771791995 771116972 770773709
2563.8 770773709 770368636 769622505 768752456 768148839 767809629 767337620 766539454 765726328 765236914 764959157
2584.2 764959157 764515936 763786614 763098001 762759209 762614012 762272656 761650980 761057675 760716081 760449946
$$ packed form
2441.4H01051736l75092k81811o40273r37700p40826l29078k90692o77526r44793p18355
2461.8G95115590k92003k44618o17682q38042n84006k19286k80737o92487q24690m71294
2482.2G90050745j37925k81811o67691p06554l20732k3723k12490o06180o21736k49266
2502.6G86222637J847k08854n83112n50986j50978K5451k91765o65486o15656l03328
2523G82879770k18153m87685p60854o85095l94643l78251p30991r77397p68006l98457
2543.4G77080238l89636p37309r28521o75142l55661m41611q07166r53197o75023l43263
2563.8G70773709m05073p46131q70049o03617l39210m72009p98166q13126m89414k77757
2584.2G64959157m43221p29322o88613l38792j45197l41356o21676n93305l41594k66135
$$ plain form
2604.6 760449946 759938717 759167254 758411407 757836044 757300615 756508052 755406439 754320621 753491938
2623 753491938 752734065 751734018 750484407 749261439 748221338 747188509 745952964 744592190 743359923
2641.3 743359923 742334604 741300642 740040004 738653839 737402022 736340344 735291600 734074175
2657.6 734074175 732766569 731615484 730657279 729681194 728548110 727376223 726367772 725536644 724688292
2676 724688292 723659456 722536743 721572459 720819473 720032573 719023645 717929304 716999769 716210902
2694.3 716210902 715299726 714166224 712974668 711888492 710894585 709828436 708602428 707353175 706260204
2712.7 706260204 705292881 704250872 703082025 701947689 700995743 700190306 699332237 698335528 697383523
2731.1 697383523 696642995 695997477 695197463 694239497 693389595 692751884 692135990 691349983 690451026 689672053
$$ packed form
2604.6G60449946n11229p71463p55847n75363n35429p92563j101613j085818q28683
2623G53491938p57873j000047j249611j222968j040101j032829j235545j360774j232267
2641.3G43359923j025319j033962j260638j386165j251817j061678j048744j217425
2657.6G34074175j307606j151085r58205r76085j133084j171887j008451q31128q48352
2676G24688292j028836j122713r64284p52986p86900j008928j094341r29535p88867
2694.3G16210902r11176j133502j191556j086176r93907j066149j226008j249253j092971
2712.7G06260204r67323j042009j168847j134336r51946q05437q58069r96709r52005
2731.1F97383523p40528o45518q00014r57966q49902o37711o15894p86007q98957p78973
$$ plain form
2751.4 689672053 689107716 688611388 687986016 687231839 686554730 686078012 685652912 685039699 684232354 683471382
2771.8 683471382 682886839 682289839 681408286 680282176 679239869 678401053 677524030 676386535 675044179
2790.2 675044179 673725009 672537744 671288192 669728458 667978168 666364849 664885104 663226426
2806.5 663226426 661267161 659202337 657242477 655387700 653405190 651137412 648766100 646509647
2822.8 646509647 644301832 641913176 639259219 636524498 633896232 631271183 628401577 625224233
2839.1 625224233 621888936 618532002 615057170 611261129 607285857 603605211 600482345 597726405
2855.5 597726405 594978511 592045188 588897288 585497856 581641853 577107906 572044432 566836596
2871.8 566836596 561603487 556191146 550666451 545474529 541041315 537467599 534599900 532286227
$$ packed form
2751.4F89672053n64337m96328o25372p54177o77109m76718m25100o13213q07345p60972
2771.8F83471382n84543n97000q81553j126110j042307q38816q77023j137495j342356
2790.2F75044179j319170j187265j249552j559734j750290j613319j479745j658678
2806.5F63226426j959265k064824j959860j854777j982510k267778k371312k256453
2822.8F46509647k207815k388656k653957k734721k628266k625049k869606l177344
2839.1F25224233l335297l356934l474832l796041l975272l680646l122866k755940
2855.5E97726405k747894k933323l147900l399432l856003m533947n063474n207836
2871.8E66836596n233109n412341n524695n191922m433214l573716k867699k313673
$$ plain form
2888.1 532286227 530539393 529420376 528784275 528253973 527532339 526635170 525680423 524610579 523209155
2906.5 523209155 521331191 519010425 516280770 513070047 509362876 505378544 501462638 497902036
2922.8 497902036 494867057 492448062 490797013 490164995 490780264 492655069 495584100 499392897 504024625
2941.1 504024625 509347141 515035927 520764649 526471913 532285154 538189828 544029534 549700558
2957.4 549700558 555190325 560551763 565732777 570533037 574858367 578848064 582727492 586587310
2973.8 586587310 590332329 593857765 597151399 600253999 603195250 605893075 608234584 610312462
2990.1 610312462 612256587 613970578 615313649 616211832 616727114 617071152 617252946 617073119 616514683
3008.4 616514683 615794241 615007102 613984704 612512112 610615432 608609974 606719732 604819357 602684975
$$ packed form
2888.1E32286227j746834j119017o36101n30302p21634q97169r54747j069844j401424
2906.5E23209155j877964k320766k729655l210723l707171l984332l915906l560602
2922.8D97902036l034979k418995j651049o32018O15269J874805K929031L808797M631728
2941.1E04024625N322516N688786N728722N707264N813241N904674N839706N671024
2957.4E49700558N489767N361438N181014M800260M325330L989697L879428L859818
2973.8E86587310L745019L525436L293634L102600K941251K697825K341509K077878
2990.1F10312462J944125J713991J343071Q98183N15282L44038J81794j79827n58436
3008.4F16514683p20442p87139j022398j472592j896680k005458j890242j900375k134382
$$ plain form
3026.8 602684975 600347519 598001122 595738888 593423963 590852916 588153780 585576952 583074093
3043.1 583074093 580405772 577470005 574457228 571597934 568883955 566138625 563215852 560167074
3059.4 560167074 557216465 554470301 551782787 548917830 545848906 542827606 540028572 537382960
3075.7 537382960 534685194 531783521 528818130 525969625 523105383 520129442 517171800 514252603
3092.1 514252603 511353374 508550048 505829930 503047228 500185430 497412980 494768530 492089599
3108.4 492089599 489290446 486616075 484189481 481698036 478984743 476148993 473301262 470586270
3124.7 470586270 468004614 465456218 462893844 460297793 457798302 455464363 453069329 450483203
3141 450483203 447912723 445478857 443090379 440817028 438673139 436426461 434035242 431660652 429341882
$$ packed form
3026.8F02684975k337456k346397k262234k314925k571047k699136k576828k502859
3043.1E83074093k668321k935767l012777k859294k713979k745330k922773l048778
3059.4E60167074k950609k746164k687514k864957l068924l021300k799034k645612
3075.7E37382960k697766k901673k965391k848505k864242k975941k957642k919197
3092.1E14252603k899229k803326k720118k782702k861798k772450k644450k678931
3108.4D92089599k799153k674371k426594k491445k713293k835750k847731k714992
3124.7D70586270k581656k548396k562374k596051k499491k333939k395034k586126
3141D50483203k570480k433866k388478k273351k143889k246678k391219k374590k318770
$$ plain form
3159.4 429341882 427101314 424974948 422885120 420745701 418586969 416532755 414597034 412632704
3175.7 412632704 410578012 408581614 406730503 404914469 403062016 401223749 399408489 397608936
3192 397608936 395899415 394204557 392382234 390579104 389002264 387572140 386104614 384539992 383003056
3210.3 383003056 381606549 380204648 378729433 377311260 376009107 374796689 373554200 372198313
3226.7 372198313 370879978 369776428 368778735 367638618 366322607 365001827 363809913 362771332
3243 362771332 361857206 360912681 359795839 358683050 357775778 356958359 356000423 354947567 354040116
3261.3 354040116 353273869 352534443 351858884 351277769 350638866 349807024 348879039 347956777 347063065 346245199
3281.7 346245199 345516920 344853222 344256252 343740761 343244195 342655450 341915280 341047883 340211183 339607298
$$ packed form
3159.4D29341882k240568k126366k089828k139419k158732k054214j935721j964330
3175.7D12632704k054692j996398j851111j816034j852453j838267j815260j799553
3192C97608936j709521j694858j822323j803130j576840j430124j467526j564622j536936
3210.3C83003056j396507j401901j475215j418173j302153j212418j242489j355887
3226.7C72198313j318335j103550r97693j140117j316011j320780j191914j038581
3243C62771332r14126r44525j116842j112789r07272q17419r57936j052856r07451
3261.3C54040116p66247p39426o75559n81115o38903q31842r27985r22262q93712q17866
3281.7C46245199p28279o63698n96970n15491m96566n88745p40170q67397q36700o03885
$$ plain form
3302.1 339607298 339201868 338674068 337827682 336819530 335896611 335137993 334427387 333675385 332928210
3320.5 332928210 332260638 331652522 330902606 329965562 329082608 328353316 327750206 327242017 326628566 325805783
3340.9 325805783 324949563 324117392 323318362 322694480 322087228 321240187 320303082 319525212 318882346 318212926
3361.3 318212926 317536473 317021400 316611528 316004306 315082163 314141780 313454092 312906176 312320203 311664850
3381.7 311664850 311070383 310677171 310467929 310404450 310301989 309904158 309401214 309195697 309182912 308899701
3402.1 308899701 308331937 307916999 307767719 307695776 307608426 307414591 307109445 306864619 306726485 306636155
3422.5 306636155 306666195 306870997 307176381 307454377 307731956 308067024 308250159 308128566 307964593 308072805
3442.9 308072805 308424294 308813512 309142709 309508890 309974551 310493439 311086237 311751723 312304556 312827766
$$ packed form
3302.1C39607298m05430n27800q46386j008152r22919p58618p10606p52002p47175
3320.5C32928210o67572o08116p49916r37044q82954p29292o03110n08189o13451q22783
3340.9C25805783q56220q32171p99030o23882o07252q47041r37105p77870o42866o69420
3361.3C18212926o76453n15073m09872o07222r22143r40383o87688n47916n85973o55353
3381.7C11664850n94467l93212k09242o3479j02461l97831n02944k05517j2785k83211
3402.1C08899701n67764m14938j49280p1943q7350j93835l05146k44826j38134r0330
3422.5C06636155L0040K04802L05384K77996K77579L35068J83135j21593j63973J08212
3442.9C08072805L51489L89218L29197L66181M65661N18888N92798O65486N52833N23210
$$ plain form
3463.2 312827766 313663483 314657986 315296263 315502256 315758407 316360086 317216754 318042874 318597496 319137514
3483.6 319137514 319923788 320701778 321371794 322179258 323136359 324106634 324992687 325801730 326593935 327319682
3504 327319682 328025013 328815639 329754412 330914438 332038194 332894236 333733946 334787548 336008459
3522.4 336008459 337070078 337822437 338612080 339741826 341150612 342616230 343884647 344951034 346192360
3540.8 346192360 347708315 349120051 350207120 351355672 352785230 354345143 356009901 357806593
3557.1 357806593 359701574 361615866 363387257 364910066 366713822 369253397 371927440 374388903
3573.4 374388903 376842111 379371405 382066786 385076284 388185918 390881538 393248856 396207929
3589.7 396207929 399545968 402698040 405918300 409390450 412846029 416314155 419844061 423102945
$$ packed form
3463.2C12827766Q35717R94503O38277K05993K56151O01679Q56668Q26120N54622N40018
3483.6C19137514P86274P77990O70016Q07464R57101R70275Q86053Q09043P92205P25747
3504C27319682P05331P90626R38773J160026J123756Q56042Q39710J053602J220911
3522.4C36008459J061619P52359P89643J129746J408786J465618J268417J066387J241326
3540.8C46192360J515955J411736J087069J148552J429558J559913J664758J796692
3557.1C57806593J894981J914292J771391J522809J803756K539575K674043K461463
3573.4C74388903K453208K529294K695381L009498L109634K695620K367318K959073
3589.7C96207929L338039L152072L220260L472150L455579L468126L529906L258884
$$ plain form
3606 423102945 426223159 429646820 433318555 437157303 440904707 444347709 448115438 452302516 456301928
3624.4 456301928 459568888 462361038 466187835 470595568 474750817 478714466 482499331 486239314
3640.7 486239314 490059882 493663788 496702433 499720365 503803074 508218646 512023449 515762687
3657 515762687 519813657 523541033 526876092 530169666 533107042 535559058 538583517 541692317 544035733
3675.4 544035733 546971917 550523281 553887069 557104588 560052276 562347710 564097226 566334546
3691.7 566334546 569121897 571773291 574015558 575802088 577391624 579380929 581579804 583320558
3708 583320558 584401429 585575640 587699294 590048254 591940463 593361259 594550312 595714271 597093225
3726.4 597093225 598847151 600450456 601469040 602125943 603247881 605197728 607028484 607518673 607323408
$$ packed form
3606D23102945L120214L423661L671735L838748L747404L443002L767729M187078L999412
3624.4D56301928L266960K792150L826797M407733M155249L963649L784865L739983
3640.7D86239314L820568L603906L038645L017932M082709M415572L804803L739238
3657E15762687M050970L727376L335059L293574K937376K452016L024459L108800K343416
3675.4E44035733K936184L551364L363788L217519K947688K295434J749516K237320
3691.7E66334546K787351K651394K242267J786530J589536J989305K198875J740754
3708E83320558J080871J174211K123654K348960J892209J420796J189053J163959J378954
3726.4E97093225J753926J603305J018584O56903J121938J949847J830756M90189j95265
$$ plain form
3744.7 607323408 608497322 609705329 610115647 611463130 613605261 615185857 616086483 617234528 618654490
3763.1 618654490 619744360 620586455 621298730 622210145 623587906 624949276 625845373 626381814 627122998
3781.4 627122998 627954543 628706694 629682422 630779207 631811559 632627845 633140504 633697867 634016395
3799.8 634016395 634140313 635080516 635946691 636536062 637781858 639162362 639756560 639779806 640233278
3818.1 640233278 640538514 640982389 642229080 643308520 644101262 644736588 645267189 645964265 646243155
3836.5 646243155 645975053 646296561 647251785 648413599 649656653 650680661 650751948 649302900 648895979
3854.8 648895979 650605798 652178884 652866244 652878046 653097093 653696477 653803647 653986156 654828131
3873.2 654828131 655835450 656699955 656909168 656976461 657432258 657743752 658268154 658828795 659009039 659567833
$$ packed form
3744.7F07323408J173914J208007M10318J347483K142131J580596R00626J148045J419962
3763.1F18654490J089870Q42095P12275R11415J377761J361370Q96097N36441P41184
3781.4F27122998Q31545P52151R75728J096785J032352Q16286N12659N57363L18528
3799.8F34016395J23918R40203Q66175N89371J245796J380504N94198K3246M53472
3818.1F40233278L05236M43875J246691J079440P92742O35326N30601O97076K78890
3836.5F46243155k68102L21508R55224J161814J243054J024008P1287j449048m06921
3854.8F48895979J709819J573086O87360J1802K19047N99384J07170J82509Q41975
3873.2F54828131J007319Q64505K09213O7293M55797L11494N24402N60641J80244N58794
$$ plain form
3893.6 659567833 660447419 660776675 660503566 660179615 660122991 660666049 661627889 662405431 662921846 663244367
3914 663244367 663228691 663115621 663314164 663667917 663933873 664279997 664676011 664824486 664926946 665304422
3934.4 665304422 665737629 666022539 666154325 666234136 666512072 666798890 666865826 667026222 667393863 667766035
3954.8 667766035 668048739 668250859 668384433 668548822 668794453 669003785 669143260 669281185 669461370 669656873
3975.2 669656873 669813633 669931889 670129001 670436084 670654953 670705557 670762539 670941293 671168089 671389520
3995.6 671389520 671607494
3997.6 671607494
$$ packed form
3893.6F59567833Q79586L29256k73109l23951n6624N43058R61840P77542N16415L22521
3914F63244367j5676j13070J98543L53753K65956L46124L96014J48475J02460L77476
3934.4F65304422M33207K84910J31786P9811K77936K86818O6936J60396L67641L72172
3954.8F67766035K82704K02120J33574J64389K45631K09332J39475J37925J80185J95503
3975.2F69656873J56760J18256J97112L07083K18869N0604N6982J78754K26796K21431
3995.6F71389520K17974
3997.6F71607494
##END=$$ End of the data block
