##TITLE=$$ Begin of the data block
##JCAMP-DX=5.00 $$ ACD/SpecManager v 10.08
##SPECTROMETER/DATA SYSTEM=Varian
##DATE=18 Dec 2012 14:24:30
##DATA TYPE=INFRARED SPECTRUM
##DATA CLASS=XYDATA
##ORIGIN=
##OWNER=
##NPOINTS=3735
##FIRSTX=399.26403809
##LASTX=4000.35498047
##MAXX=4000.35498047
##MINX=399.26403809
##MAXY=73.20969391
##MINY=16.19453430
##XFACTOR=1.0000000000
##YFACTOR=0.000000100000000
##FIRSTY=57.88193512
##DELTAX=0.96440572
##XUNITS=1/CM
##YUNITS=TRANSMITTANCE
##XYDATA=(X++(Y..Y))
399.3E78819351J9509926P475357k587776M165459q07076n310554K657051m173775
407E99747963n437660J841926o398124m816056N739937P836800J976738l436928m620514
415.7E92434082n135384n922775j1225433R406929J2372169L167572J396828l870544
423.4E92623444j641388K98233l51639K244339L120956k693481o0654N797043n019684
432.1E94317169j0604553l058701M793206N73158j77803K669258n29060J234207J19056
440.7E89335937K319527J111221n903739l840294l751183J740265N525284L20511l21579
449.4E86535950R98916J119004l332749j787758J605835k60620j992874m246635J48964
458.1E78788033K3765l508720J943130L916779k847023l586312k60810P00187j209602
$$ plain form
399.3 578819351 598329277 605804634 603216858 607382317 606575241 601264687 603921738 599747963
407 599747963 594310303 596152229 589754105 584938049 590677986 598514786 600491524 597054596 592434082
415.7 592434082 587298698 581375923 570150490 579557419 591929588 595097160 596493988 592623444
423.4 592623444 590982056 591280289 590928650 593172989 596293945 593600464 593539810 599336853 594317169
432.1 594317169 583712616 580653915 585447121 586020279 585842476 588511734 587982674 589216881 589335937
440.7 589335937 591655464 592766685 586862946 583022652 579271469 581011734 586537018 586857529 586535950
449.4 586535950 587534866 588653870 585321121 583533363 585139198 584878578 582885704 578639069 578788033
458.1 578788033 578811798 575303078 577246208 581162987 578315964 574729652 574468842 575169029 573959427
466.8E73959427j118431q67157k020874R43718K083168k14920k838021M32930J345063
475.5E71704903l905945k747L871308K052345J741142j722946j753502J5755P07664
484.1E72707977N64881J898040L182145q06389p39250j48011j789970l935967m102478
492.8E66830978P86362O113205N384140j940765k716332j750259j574478K570037J193619
501.5E74896507p64236l41072L4942J308709q4076l205490l946877N1880J461143j620674
511.1E67790756j290550r21288k271690n17845K313805k65542l886528k032279j166916
519.8E57751923j406479r02291J357155J660500J438751K49329l157692q79708m11262
528.5E55700226K59437J099930K52724P37800p69157j159248j456833J43585L263702
$$ plain form
466.8 573959427 572840996 571973839 569952965 570896683 572979851 572764931 569926910 570359840 571704903
475.5 571704903 567798958 567796211 571667519 573719864 575461006 573738060 571984558 572000313 572707977
484.1 572707977 573272858 575170898 578353043 577546654 576807404 576659393 574869423 570933456 566830978
492.8 566830978 567617340 573730545 579114685 577173920 574457588 572707329 571132851 573702888 574896507
501.5 574896507 574132271 573791199 573826141 575134850 575050774 571845284 567898407 567950287 569411430 567790756
511.1 567790756 566500206 565578918 563307228 562789383 565103188 564837646 560951118 558918839 557751923
519.8 557751923 556345444 555443153 556800308 558460808 559899559 560148888 556991196 556111488 555700226
528.5 555700226 555959663 557059593 557312317 558050117 557280960 556121712 554664879 554808464 558072166
537.2E58072166J89515k133828j381912n62782R65156J100922M53262N03579J14631
545.9E57320709R33991K50396j355972R70535J321106L52250M42962l29132L20854
554.5E60227699P897r27544p4120P51191n29366p74155N41993K51999M33120M86908
564.2E60395622k98538r50775M31900R10530q68111j91421p39441j273651p53250r6932
573.8E56565933Q97217m88739q83522p98340r24530n07049P78846J436158R0522J32790
583.5E56299286n23453K37694k76451j489525P97958P75833o752J001358J189271j453553
593.1E56551666j446953m90799j398391n09415j101456n35240p06901k594414k004509
601.8E45763588k453766j812515l311806m990654m753227o451759q224640q938828
$$ plain form
537.2 558072166 558261681 556127853 554745941 554183159 555148315 556249237 556702499 557206078 557320709
545.9 557320709 558254700 558505096 557149124 558119659 559440765 559793015 560235977 559906845 560227699
554.5 560227699 560235596 559308052 559233932 559985123 559455757 558681602 559223595 559475594 559908714 560395622
564.2 560395622 560097084 559146309 559578209 560488739 559620628 559429207 558689766 557416115 556662865 556565933
573.8 556565933 557463150 556974411 556090889 555292549 554368019 553860970 554639816 556075974 556166496 556299286
583.5 556299286 555775833 556013527 555737076 554247551 555045509 555821342 555814590 556815948 558005219 556551666
593.1 556551666 555104713 554613914 553215523 552706108 551604652 551069412 550362511 547768097 545763588
601.8 545763588 543309822 541497307 538185501 533194847 528441620 521989861 513765221 504826393
609.5E04826393r734688j3691101j4057655j3274574j0870591o340484k802849J088600
617.2D35143051p43751j902581l324470p187309j0892029j1282082q339729l674965
624.9C87796135O352959J2740059J6656837J6560097J6020279J2919807P002030L340339
632.7D79388542k797165o330833p971878p198220o247520m990692n95245L749122J0663452
641.3D57669563J3636780J5944710J6544151J5008850J2421646R876633P942848N919609
649E54964790M821396L004570K826233K686844O61545M41627L46260Q2512O89354J498833
658.7E72023964K696381J160392J90239J334648M67186n01670N04875K519149J597596
667.4E81992760n115357L360672K622719J73607L08876O52084M94881j30234q95691
$$ plain form
609.5 504826393 495091705 481400604 467342949 454068375 443197784 436857300 434054451 435143051
617.2 435143051 434399300 432496719 429172249 421984940 411092911 399810829 391471100 387796135
624.9 387796135 394149094 406889153 423545990 440106087 456126366 469046173 476048203 479388542
632.7 479388542 476591377 470260544 462288666 455090446 448842926 443852234 443256989 447006111 457669563
641.3 457669563 471306343 487251053 503795204 518804054 531225700 541102333 549045181 554964790
649 554964790 559786186 562790756 565616989 568303833 568965378 569407005 569753265 569835777 570525131 572023964
658.7 572023964 574720345 575880737 576070976 577405624 577872810 577371140 577876015 580395164 581992760
667.4 581992760 576877403 580238075 582860794 583034401 583343277 583995361 584490242 584360008 583464317
676.1E83464317M58031K164345J259193k92969l30314Q18672N44624m33235r91058
684.7E86661606j789932p28074P51343J109810j27067j421891p38640m90570j754913
693.4E81471672k919617j412086n5466K19879J172600N65338k4452m46243j094437
702.1E77477188j300163p67937O86913L01437L04413J249199J453247J563682Q94013
710.8E81861992J233177J498184J018601M04625K57568J374970J442718J736870J487198
719.5E92315903L77159J335144J527176Q88443O69174k4262m52842p23114j54343N35812
729.1E96294250N16816L35655p15370j382637j447335j296386j064873m57916J69944
737.8E90952148O50025J970558J049538o14167m57420k97966L30849P92312R02291
$$ plain form
676.1 583464317 583922348 586086693 587345886 587052917 586722603 587541275 588085899 587652664 586661606
684.7 586661606 584871674 584143600 584894943 586004753 585877686 584455795 583717155 583226585 581471672
693.4 581471672 578552055 577139969 577084503 577304382 578476982 579042320 579017868 578571625 577477188
702.1 577477188 576177025 575409088 576096001 576397438 576701851 577951050 579404297 580967979 581861992
710.8 581861992 583095169 584593353 585611954 586016579 586274147 587649117 589091835 590828705 592315903
719.5 592315903 592693062 594028206 595555382 596443825 597112999 597088737 596635895 595912781 595758438 596294250
729.1 596294250 596811066 597146721 596431351 595048714 593601379 592304993 591240120 590782204 590952148
737.8 590952148 591602173 593572731 594622269 594008102 593550682 593252716 593583565 594375877 595278168
746.5E95278168J701545L294793K857895J362419J117782R30138K511139K329216J490440
755.1F12873535K392044K335282K560882J067848N49660Q35800M39492M44107p64733
763.8F22733917l44581N47599O98471J69182n43861r59663r22356K76832M00467Q22792
773.5F22878799J269913J332169J619529J196290R78469J721611K448693J480598J253700
782.1F36179771P03240J333923K560806P69806M68674N20249M86602M58374J199875
790.8F44681320R18122j288224m39911M4709O18057R56344P63627O94427M83170J217880
800.5F48649521j153183j166916K64816n56411L63616J345521J312179J03531j98975
809.1F48963699K03553O89926O44378m56924J58691J63041r97773M21982K002945M75540
$$ plain form
746.5 595278168 596979713 600274506 603132401 604494820 605612602 606542740 609053879 611383095 612873535
755.1 612873535 615265579 617600861 620161743 621229591 621779251 622615051 623054543 623498650 622733917
763.8 622733917 622389336 622936935 623635406 623804588 623260727 622301064 621378708 621655540 622056007 622878799
773.5 622878799 624148712 625480881 627100410 628296700 629275169 630996780 633445473 634926071 636179771
782.1 636179771 636883011 638216934 640777740 641547546 642016220 642536469 643023071 643481445 644681320
790.8 644681320 645599442 644311218 643871307 643916016 644534073 645490417 646254044 646948471 647431641 648649521
800.5 648649521 647496338 646329422 646594238 646037827 646401443 647746964 649059143 649162674 648963699
809.1 648963699 649167252 649857178 650501556 650044632 650203323 650366364 649368591 649790573 651793518 652269058
818.8F52269058K36969L42484n10025r0256l12653j67694o43158j090545q88901p66068
828.4F48379211o12640j361389k145462k946320k754249l206520l012581k314453k669754
837.1F27355843j370202j771430l638878k985916j516724j710434k043381j614837
844.8F10704041j607857p82471M25491N20249R76219J732368O37207O79093K320900
853.5F15605240K525825L451767K595177J446686K356567J688767J960678K250747
861.2F33881454J412430O06728J481132K302056J560707J607513N29480O09055J33591
869.9F44124146j88141J326599O52694P07322J115722J280365J312561L77579r22623
878.6F49786224j831665j412735j301345j726151j971970j644439j603508j326447
$$ plain form
818.8 652269058 652506027 652848511 652338486 652248230 651935577 651767883 651124725 650034180 649145279 648379211
828.4 648379211 647766571 646405182 644259720 641313400 638559151 635352631 632340050 630025597 627355843
837.1 627355843 625985641 624214211 620575333 617589417 616072693 614362259 612318878 610704041
844.8 610704041 609096184 608313713 608739204 609259453 610235672 611968040 612605247 613284340 615605240
853.5 615605240 618131065 621582832 624178009 625624695 627981262 629670029 631630707 633881454
861.2 633881454 635293884 635900612 637381744 639683800 641244507 642852020 643381500 643990555 644124146
869.9 644124146 643936005 645262604 645915298 646622620 647738342 649018707 650331268 650708847 649786224
878.6 649786224 647954559 646541824 645240479 643514328 641542358 639897919 638294411 636967964
886.3F36967964j087456n99708k56500j468964q13560N1078k15568q8463J11084P04498
895.9F33304405P86209Q62084J78261o8627J38626j043434o56700M75464l04985q55065
905.6F32816238o99348j432304j775017k866249l228112j939201k227440k592430k113914
914.3F13942223j593323k042961k002487j709404k205964k278404k725029k229347
922E97155304k134247k731781j791725m99496o11496j515313q29353k39754l49197
930.7E86452942j20201k56081K53754J106682J770591J711884J609573K729988K897339
939.3E98156471K037163K121887L262825K684136J629409K412491K465554K453994
947.1F17223930K436753J704025J370850J280479O90155L77502J03837p4311J90354
$$ plain form
886.3 636967964 635880508 635280800 635024300 633555336 632741776 632792854 632577286 632488823 632599907 633304405
895.9 633304405 634090614 634952698 635130959 635062332 635200958 634157524 633500824 633976288 633671303 632816238
905.6 632816238 632116890 630684586 628909569 626043320 622815208 620876007 618648567 616056137 613942223
914.3 613942223 612348900 610305939 608303452 606594048 604388084 602109680 599384651 597155304
922 597155304 595021057 592289276 590497551 589998055 589386559 587871246 587041893 586802139 586452942
930.7 586452942 586332741 586076660 586330414 587437096 589207687 590919571 592529144 595259132 598156471
939.3 598156471 600193634 602315521 605578346 608262482 609891891 612304382 614769936 617223930
947.1 617223930 619660683 621364708 622735558 624016037 624706192 625083694 625187531 625113220 625303574
955.7F25303574r17740j110802r17664j611862j895828k135162k435608l031121k574119
964.4F08673668k009087k131538k165260j789208j461563j542892j072197r77288r88121
973.1E94536514q85925q05244n14222j206932j324463q52813j323281j614532j511612
981.8E84497490j596260j560860j595230k170982k581139k566910l090210l544845
989.5E65791054l983422n008812n434532q170089j3439522j7454033j4107018R74160
997.2D99167786J3901977J4631081Q626213M128189K138939O13785m59519l21693l77045
1005.9E42049713r76295o26984o53267j338272j661415j275482p46308p89146j058846
1014.6E32923698j906662j601181j837577k520676j468353j590844k176742j882439
$$ plain form
955.7 625303574 624385834 623275032 622357368 620745506 618849678 616714516 614278908 611247787 608673668
964.4 608673668 606664581 604533043 602367783 600578575 599117012 597574120 596501923 595524635 594536514
973.1 594536514 593650589 592845345 592331123 591124191 589799728 588946915 587623634 586009102 584497490
981.8 584497490 582901230 581340370 579745140 577574158 574993019 572426109 569335899 565791054
989.5 565791054 561807632 556798820 551364288 543194199 529754677 512300644 498193626 499167786
997.2 499167786 513069763 527700844 536327057 540455246 542594185 543207970 542748451 542426758 542049713
1005.9 542049713 541073418 540446434 539793167 538454895 536793480 535517998 534771690 533982544 532923698
1014.6 532923698 531017036 529415855 527578278 525057602 523589249 521998405 519821663 517939224
1022.3E17939224j572876k496948j819725l62511j880836k823792k092437j130104
1030E03759995j889878k005958j479645j564789j295967k053413j576577j594429n22499
1038.7D89776840n05333j971206n02549l42025n52292j047821q67272n75523N34439
1047.4D83947258J545334j03455P00608J127510R90371N1689k08663J122016O28243
1056D89800911j20163j143761j23672N36156M00314n28984j468239l43666m14505l89938
1065.7D86204453j309853q05893q14171j774597j271591j256714m53491j709976j701203
1074.4D75106964j979217j806755j321869k517624j334801j984901n75791r70955k216530
1083D60398521j357956j660690r80263k925109k844658m084969m972687m573822o711044
$$ plain form
1022.3 517939224 516366348 513869400 512049675 511687164 509806328 506982536 504890099 503759995
1030 503759995 501870117 499864159 498384514 496819725 495523758 493470345 491893768 490299339 489776840
1038.7 489776840 489271507 487300301 486797752 486455727 485903435 484855614 483988342 483412819 483947258
1047.4 483947258 485492592 485389137 486089745 487217255 488207626 488259315 488050652 489172668 489800911
1056 489800911 489680748 488536987 488413315 488949471 489349785 488820801 487352562 487008896 486594391 486204453
1065.7 486204453 484894600 484088707 483274536 481499939 480228348 478971634 478518143 476808167 475106964
1074.4 475106964 473127747 471320992 469999123 467481499 466146698 464161797 463586006 462615051 460398521
1083 460398521 459040565 457379875 456399612 453474503 450629845 446544876 441572189 436998367 430287323
1091.7D30287323p459717q847961p815552r684563j0422020j0556297j1561623j0122566
1099.4C53817024j1465034r309044j1033898j0704956r924240j0695858r181785j0429058
1107.1B71073151q622342r818477p253246p439614p182789n402469n968991k412529
1114.9B16972694m283123r34810q64258l25928J099796O12927K695312k58750K412529
1123.5B17126389J598377K700157K525215P21836J629124j017552Q05798j684036o54469
1132.2B23750839k035675l304329k085323m836521k016640l196373j361084k764931
1139.9B02149963k827510j742993m207840k115803m269085k404766m190578m007092
1147.6A76384296l750991m295426j030140l180046m79202j596928K4262j30482L77197
$$ plain form
1091.7 430287323 422827606 413979645 406164093 396479530 386057510 375501213 363939590 353817024
1099.4 353817024 342351990 333042946 322009048 311304092 301379852 290683994 281502209 271073151
1107.1 271073151 262450809 252632332 245379086 237939472 230756683 225354214 219385223 216972694
1114.9 216972694 212689571 211754761 210890503 210564575 211664371 212277298 214972610 214713860 217126389
1123.5 217126389 218724766 221424923 223950138 224671974 226301098 225283546 226089344 224405308 223750839
1132.2 223750839 221715164 218410835 216325512 211488991 209472351 206275978 204914894 202149963
1139.9 202149963 199322453 197579460 193371620 191255817 186986732 184581966 180391388 176384296
1147.6 176384296 172633305 168337879 167307739 164127693 163648491 162051563 162075825 161945343 162322540
1156.3A62322540K157326p99561L166733J115570K500382K153549K581024M220905
1164A79418468K578526O143990L860454N881424N168915N676002P247792O767883Q635597
1172.7B31379051O337757R098969O991691P305413Q661747Q114242R331856P114944
1180.4B94335670Q676663P211113P539654P150039P200775P978135N659446O579094
1188.1C52330589N191002N777359N148087N352707N789680M742966N876312M825821
1195.9C95034523O154480N737877O133919N953292N055275O410485N663605N881767
1203.6D42025223M832878N079536M477539M105378M750976L802986M229279L097305
1211.3D76401100L490448L197174L030358L466644K451401L028221K242126J839066
$$ plain form
1156.3 162322540 164479866 163680305 166847038 167962608 170462990 172616539 175197563 179418468
1164 179418468 181996994 188140984 192001438 197882862 203051777 208727779 215975571 222743454 231379051
1172.7 231379051 237716808 246815777 253807468 261112881 269774628 277888870 287220726 294335670
1180.4 294335670 303012333 310223446 317763100 324913139 332113914 340092049 345751495 352330589
1188.1 352330589 357521591 363298950 368447037 373799744 379589424 384332390 390208702 395034523
1195.9 395034523 401189003 406926880 413060799 419014091 424069366 430479851 436143456 442025223
1203.6 442025223 446858101 451937637 456415176 460520554 465271530 469074516 473303795 476401100
1211.3 476401100 479891548 483088722 486119080 489585724 492037125 495065346 497307472 499146538
1219D99146538J100502J110077J650886J344834J817627O34422M43802P17773J016274
1227.7E08982735P98874L94935R28993P08809J226197J247215J373596R13544Q24089
1236.4E17398987R21783m3945L45116N61027J032295O11344Q00628J295700L04337
1245E23227272L45230L83225M36668j05019L45002O89087L93829O46934L22075R38874
1254.7E27623177N41992M61082L05596n227N78690K15721N35050O42318J076737P54700
1264.3E32729836N71365R70230O57730J158104O40755O85920J442490J828766J403809
1273E42089005J051177J256638Q41026J504097J739121J277847J003304J429138J755409
1281.7E53946762J468048J410370J212311J865425J562157J632270J728745R80606
$$ plain form
1219 499146538 500247040 501357117 503008003 504352837 506170464 506804886 507248688 507966461 508982735
1227.7 508982735 509781609 510176544 511105537 511814346 513040543 514287758 515661354 516574898 517398987
1236.4 517398987 518320770 518276825 518621941 519182968 520215263 520826607 521627235 522922935 523227272
1245 523227272 523572502 523955727 524392395 524287376 524632378 525321465 525715294 526362228 526684303 527623177
1254.7 527623177 528165169 528626251 528931847 528926620 529505310 529721031 530256081 530898399 531975136 532729836
1264.3 532729836 533301201 534271431 534929161 536087265 536728020 537413940 538856430 540685196 542089005
1273 542089005 543140182 544396820 545237846 546741943 548481064 549758911 550762215 552191353 553946762
1281.7 553946762 555414810 556825180 558037491 559902916 561465073 563097343 564826088 565806694
1289.4E65806694J552887J486015J349945J148491J298256J780739J559563J439895
1297.1E77422485J432000J419372Q69026J024475J179314Q62198Q48885O66351O96029
1305.8E86420135L51639O50177J000023N55535P96852N56717K41012L65219K11029
1314.5E91148338M87709Q19817J044693P46689J95312O07300P74994M89769O80237
1323.2E96994858Q11729M75197M27094P12776N55000K74773K58255N63621L23677j40037
1332.8F01256943r0523l9520J17683k06070K6131P11632K68325l95507j61515J52092
1342.4F01639671j91612k02904R6436O5155k26021l12614M425j29814q6403m55590
1352.1F00200729r50355q18253m39644l1852j30081k8916K2659J43280k04887n64575
$$ plain form
1289.4 565806694 567359581 568845596 570195541 571344032 572642288 574423027 575982590 577422485
1297.1 577422485 578854485 580273857 581142883 582167358 583346672 584208870 585057755 585724106 586420135
1305.8 586420135 586771774 587421951 588421974 588977509 589774361 590331078 590572090 590937309 591148338
1314.5 591148338 591636047 592455864 593500557 594247246 594442558 595049858 595824852 596314621 596994858
1323.2 596994858 597806587 598281784 598708878 599421654 599976654 600251427 600509682 601073303 601396980 601256943
1332.8 601256943 601166420 601126900 601244583 601038513 601064644 601776276 602044601 601649094 601487579 601639671
1342.4 601639671 601448059 601245155 601341591 601406746 601180725 600868111 600872536 600742722 600656319 600200729
1352.1 600200729 599250374 598432121 597992477 597960625 597830544 597801628 597824287 597967567 597762680 597198105
1361.7E97198105J297q63876n08729k04696q34351o58569p98531j187973o24923l11203
1371.4E91206551o82946j042061q66928m11071m23088k59781n98069r78355m62723
1380.1E85481529k70309n57099r07440n73387K84157J370468J256790k61574P27654
1388.7E86550789J117744K29149k31933q6213M92249n93987j280097K87132l71933
1397.4E86112900q35724j317062p24144j54953n19257m65584p2899n80749o07910L11966
1407.1E81146584l12996o67954j72310n87730m30184j45912j17492k99263k06108J78794
1416.7E78385429J23101J158790j499634j029930R67217L96118P98187l92914M51279
1425.4E79357643J310616L88870R35745Q06542j75095l42217P41082J141662O08597
$$ plain form
1361.7 597198105 597199402 596335526 595826797 595622101 594787750 594129181 593330650 592142677 591517754 591206551
1371.4 591206551 590523605 589481544 588614616 588203545 587780457 587520676 586922607 585944252 585481529
1380.1 585481529 585211220 584654121 583746681 583173294 583457451 584827919 586084709 585823135 586550789
1388.7 586550789 587668533 587897682 587665749 587579536 588071785 587477798 586197701 586484833 586112900
1397.4 586112900 585277176 583960114 583235970 583081017 582561760 582096176 582023277 581442528 580834618 581146584
1407.1 581146584 580833588 580165634 579993324 579405594 578975410 578829498 578712006 578412743 578206635 578385429
1416.7 578385429 578508530 579667320 578167686 577137756 578104973 578501091 579299278 578906364 579357643
1425.4 579357643 580668259 581057129 581992874 582799416 582624321 582282104 583023186 584164848 584773445
1434.1E84773445J153336J092109r52644J21918K081413J535034N34325N18951K84348
1442.7E91142235Q49418P33185M62189P88307R64623j93825k4719O82754J45264M06494
1452.4E95955925N15213J024361J484337J120605k085686j070823L882408R25026J003990
1461.1F02755356P64694Q16498K305603L19404N75676R57566O98318R73244J239967
1469.7F11406326K537880J611710O01845J381073K159767K576637Q08373J415405J720505
1478.4F26219521J081314J239853N57975J021157J611366J019287N70335R34449Q9759
1487.1F34345016q29849J176033q22868j996765L57551P78542J25008j6518R18884
1495.8F34035034l569946N57670L36266k680435M14924o73255j640587j096688O45523
$$ plain form
1434.1 584773445 585926781 587018890 586066246 586188164 588269577 589804611 590338936 590857887 591142235
1442.7 591142235 591991653 592724838 593187027 593975334 594939957 594746132 594721413 595404167 595549431 595955925
1452.4 595955925 596471138 597495499 598979836 600100441 598014755 596943932 600826340 601751366 602755356
1461.1 602755356 603520050 604336548 606642151 606961555 607537231 608494797 609193115 610166359 611406326
1469.7 611406326 613944206 615555916 616157761 617538834 619698601 622275238 623083611 624499016 626219521
1478.4 626219521 627300835 628540688 629098663 630119820 631731186 632750473 633320808 634255257 634345016
1487.1 634345016 633515167 634691200 633868332 631871567 632229118 633007660 633132668 633116150 634035034
1495.8 634035034 630465088 631022758 631359024 628678589 629093513 628420258 626779671 625682983 626328506
1504.5F26328506J274949j242905o374130j982994P29713k263832M4250j326599k658691
1513.1F12528267j23062j082535p60460j228104k316017O25878J716194l048706m700928
1521.8F01610527J551132R58290J660042k621345j250954J36032j098633o90460m69437
1530.5E99785194m26673q55790k8228l638039q6021J73645j85662J668396k205162
1539.2E94201660n256958N37377J141777j839753J320382J782951k585030J021424
1546.9E90323830l0480J20507j88027r38721J468621R99336K055969r66949q5984K705918
1556.5E95464020L611183O938515r821053m375839K626266K635231J264229P02820
1564.2E99045372l46260j85585J009064N05447J340103l317985j79253Q34579l62091
$$ plain form
1504.5 626328506 627603455 626360550 619986420 618003426 618733139 616469307 616513557 615186958 612528267
1513.1 612528267 612405205 611322670 610562210 609334106 607018089 607643967 609360161 606311455 601610527
1521.8 601610527 603161659 604119949 605779991 603158646 601907692 602043724 600945091 600254631 599785194
1530.5 599785194 599358521 598502731 598474503 594836464 594750443 594924088 594738426 596406822 594201660
1539.2 594201660 588944702 589482079 590623856 588784103 590104485 591887436 589302406 590323830
1546.9 590323830 590293350 590413857 590225830 589287109 590755730 591755066 593811035 592844086 592758102 595464020
1556.5 595464020 599075203 606013718 596192665 591816826 594443092 597078323 598342552 599045372
1564.2 599045372 598699112 598513527 599522591 600028038 601368141 598050156 597870903 598705482 598343391
1572.9E98343391M66843M88892M48494o291962N56107L17535q66127n33104j367073
1581.6E91562996n97687j744346q23975j209526j932717j924057k106933j104012k497329
1590.3E77622414r27544j921272j730500j283187k384339j725616k654457j039620
1598E63955879k716217j946106j700287k214622r95598k486267j086426k332497k046737
1606.7E46431122k726898j920052j471786l043747j053009k524262r14535j528016
1614.4E31248817m24079M29191p568970l59764j512375o37550j960907l11394l00331
1623.1E18602638m899635r99146j632652N09377k541504k221947m85649j072121o90307
1631.7E04569054j459771R93996P19757k976723m034461R36393l08342j94702Q77075
$$ plain form
1572.9 598343391 598810234 599299126 599747620 593455658 594011765 594329300 593463173 592930069 591562996
1581.6 591562996 590965309 589220963 588396988 587187462 585254745 583330688 581223755 580119743 577622414
1590.3 577622414 576694870 574773598 573043098 571759911 569375572 567649956 564995499 563955879
1598 563955879 561239662 559293556 557593269 555378647 554383049 551896782 550810356 548477859 546431122
1606.7 546431122 543704224 541784172 540312386 537268639 536215630 533691368 532776833 531248817
1614.4 531248817 530824738 531253929 523684959 523325195 521812820 521175270 519214363 518902969 518602638
1623.1 518602638 513703003 512703857 511071205 511580582 509039078 506817131 506331482 505259361 504569054
1631.7 504569054 503109283 504103279 504823036 501846313 497811852 498748245 498439903 498245201 499122276
1640.4D99122276j204071R31740o00662Q96492J679420j351242O68717k370606K264290
1649.1E00036354P74765K440910L162690k089653l793106J243057L425636J115761
1656.8E06316414J994591J123695J423035J620254J280480J875229n27726K845154
1664.5E17951126J770554J818809K202530K194481J268501K86675L683471N04342K408332
1673.2E34088821L294068K287941O10J801682L130111J713829L030701J391106L029594
1681.9E53768463M741020K919350o55174j525727M922257L475494K350235K794838
1689.6E72790756K254753L394242K752113K677307L295517M954491K71759K207603
1697.3E94598541M770546N306320P937966m808731L889198M196205L569641K145424
$$ plain form
1640.4 499122276 497918205 498849945 498249283 499145775 500825195 499473953 500142670 497772064 500036354
1649.1 500036354 500811119 503252029 506414719 504325066 500531960 501775017 505200653 506316414
1656.8 506316414 508311005 509434700 510857735 512477989 513758469 515633698 515105972 517951126
1664.5 517951126 519721680 521540489 523743019 525937500 527206001 527492676 531176147 531680489 534088821
1673.2 534088821 537382889 539670830 539671440 541473122 544603233 546317062 549347763 550738869 553768463
1681.9 553768463 558509483 561428833 560773659 559247932 564170189 567645683 569995918 572790756
1689.6 572790756 575045509 578439751 581191864 583869171 587164688 592119179 592390938 594598541
1697.3 594598541 599369087 604675407 612613373 607804642 611693840 615890045 619459686 621605110
1705F21605110K200051K356605K247887L488655K290458J633492K185822K175560K545242
1713.7F42728882R06372J22299K426758K494430l101959J311493J953278N81283L12882
1722.4F49735718m14582l19595Q93326R29947L24478M45557K109298Q67005k49176
1731.1F54321976K817230L372803o91681n131226K497482K674256J240082J970214
1738.8F63071136K79541j700897K894974K921448Q36868R62830K300796K183151K171860
1747.5F75921707J982193N42298L365631J960067q7356L463363K410050J985092K517395
1756.2F94060440k02484J142197K429962J609268K529602o45142j224441J920624J097564
1764.8G02717590R25980J350861J485137j696167R82056L174591M97742j454926k445068
$$ plain form
1705 621605110 623805161 626161766 628409653 631898308 634188766 635822258 638008080 640183640 642728882
1713.7 642728882 643635254 643757553 646184311 648678741 645576782 646888275 648841553 649422836 649735718
1722.4 649735718 649321136 649001541 649894867 650824814 651149292 651594849 653704147 654571152 654321976
1731.1 654321976 657139206 660512009 659820328 654689102 657186584 659860840 661100922 663071136
1738.8 663071136 663350677 661649780 664544754 667466202 668303070 669265900 671566696 673749847 675921707
1747.5 675921707 677903900 678446198 681811829 683771896 683684540 687147903 689557953 691543045 694060440
1756.2 694060440 693857956 695000153 697430115 699039383 701568985 700923843 699699402 701620026 702717590
1764.8 702717590 703643570 704994431 706479568 704783401 705765457 708940048 709437790 707982864 705537796
1773.5G05537796K598953K233887j128006R61227R33609J159974O30188j106339N15976
1782.2G12337265J188278P31583l99017k54670R67255O59103J63041J435012L63770
1790.9G17191620k69241j367875j258773K783660J422120o13404M85611J413880N72281
1799.5G20359879j163254O97632o34308Q774J113739L80325O58798K79465j36566M30908
1809.2G21995392J007080j025543j53351O68030k4109P39288J62735P00073L30887
1817.9G24400482K96631M56467m99726L90320l49197L11279J483154j130905j095733
1826.5G24262772J018142J906281Q16040k830506j61972J595078J58310k83737j49384
1835.2G26331024N63889P71179l74146M31137M4480J01395k43531P66373J524734l364105
$$ plain form
1773.5 705537796 708136749 710370636 709242630 710203857 711137466 712297440 712927628 711821289 712337265
1782.2 712337265 713525543 714257126 713858109 713603439 714570694 715229797 715392838 716827850 717191620
1790.9 717191620 716922379 715554504 714295731 717079391 718501511 717888107 718373718 719787598 720359879
1799.5 720359879 719196625 719894257 719259949 719268723 720382462 720762787 721421585 721701050 721564484 721995392
1809.2 721995392 723002472 721976929 721823578 722491608 722467499 723206787 723369522 724069595 724400482
1817.9 724400482 724697113 725153580 724653854 725044174 724694977 725006256 726489410 725358505 724262772
1826.5 724262772 725280914 727187195 728003235 725172729 725010757 726605835 726764145 726480408 726331024
1835.2 726331024 726894913 727666092 727291946 727723083 727767563 727868958 727625427 728391800 729916534 726552429
1844.9G26552429R75189J767197J66702p11517m5319O65055k19040J2359m61120K84195
1854.5G28986130O66961J72043L52097k03476L27225M1732q3313l88565k71988K96021
1864.2G29894867K92511N03693j99204P07321l32641j361390K12174M56772O66046
1872.8G30840149j1215p6142l33557K64282O04935J98975K2430p53937n4626J80283
1882.5G30881577N37872O9504m16794L36456j15356O75735m425j525803N02396O81610
1892.1G31622772n58166j23139M90647k70996K67715J67923M9667J34659l40347m23432
1901.8G31017303l20892N01480M10004K39410K49634j65253l54690k17362m94995o41937
1911.4G30222702M44870O9733L27682L75443j66550Q22449j262131j170654O16226
$$ plain form
1844.9 726552429 727527618 729294815 729461517 728750000 728704681 729369736 729150696 729163055 728701935 728986130
1854.5 728986130 729653091 729825134 730177231 729973755 730300980 730342712 730259399 729870834 729598846 729894867
1864.2 729894867 730187378 730691071 730491867 731199188 730866547 729505157 729717331 730174103 730840149
1872.8 730840149 730828934 730752792 730419235 730683517 731288452 731487427 731509857 730755920 730701294 730881577
1882.5 730881577 731419449 731488953 731072159 731408615 731293259 731968994 731964569 730438766 730941162 731622772
1892.1 731622772 731064606 730941467 731432114 731161118 731428833 731596756 731646423 731781082 731440735 731017303
1901.8 731017303 730696411 731197891 731607895 731847305 732096939 731931686 731576996 731359634 730864639 730222702
1911.4 730222702 730667572 730737305 731064987 731440430 731273880 732096329 730834198 729663544 730279770
1920.1G30279770J12762K38343l58887o28052M68292P44400J22834J38549j37863l03421
1929.7G30676727k41012n30319j61362j78757K08206K74277J85623l3111m16413j17416
1939.4G29666443l55835P34329N8518k092286M91486J457825K33688m47693J43204
1948.1G29889679O2180l98407m11606j96762J15356K27280L26080k38342k99759n5008
1957.7G29020691j82724j44119j09711P782k9373p1106k67868P2708L74451r3918m10996
1968.3G28165817k80227Q0413m9133L7613J95770K060l6239L8604k02331m90113j40380
1978.9G27321854k32087j37481j12992N6916N01632k18048m12903m05578m55780l50189
1988.6G25555344l24173K53219M30146m79737o81152L37906J61743j35956L8681j89972
$$ plain form
1920.1 730279770 730392532 730630875 730271988 729643936 730112228 730856628 730979462 731118011 730980148 730676727
1929.7 730676727 730435715 729905396 729744034 729565277 729773483 730047760 730233383 730200272 729783859 729666443
1939.4 729666443 729310608 730044937 730103455 728011169 728502655 729960480 730194168 729746475 729889679
1948.1 729889679 729951859 729553452 729141846 728945084 729060440 729287720 729613800 729375458 729075699 729020691
1957.7 729020691 728837967 728693848 728584137 728591919 728562546 728491440 728223572 728296280 728670731 728576813 728165817
1968.3 728165817 727885590 727966003 727916870 727954483 728150253 728152313 728116074 728154678 727952347 727462234 727321854
1978.9 727321854 727089767 726952286 726839294 726896210 727397842 727179794 726766891 726361313 725905533 725555344
1988.6 725555344 725231171 725484390 725914536 725434799 724753647 725091553 725253296 725117340 725156021 724966049
1998.2G24966049k40402j88293J13983j8769P9651J76087J19705k68402o04172q0643
2007.8G24054794m94308k4643K50626k13242m0360l29818r7580j12610j76392k91671
2017.5G22524796M2877M5776o82297k34604M731M01382J03302k80609j01318l57895
2027.1G21466141r8191k83126l46756l04795M1886K50854R5902r1858m55780L81k63901
2037.7G20010757k69088l47672k87018K33918k60849J72958J04980j4648l14331p49207
2047.4G18279800j32217k32544q8196J89133J51825k97699j4725K82059l15704j63117
2057G17658615m02908l51410l54004j81351K84195j05896j48392j43356m22821p06253
2066.7G15126419k4795n5695o77719k76184k15836j25503m13514o43615o13938o4315
$$ plain form
1998.2 724966049 724725647 724537354 724651337 724632568 724712219 724888306 725008011 724739609 724135437 724054794
2007.8 724054794 723560486 723535843 723786469 723573227 723532867 723203049 723105469 722992859 722816467 722524796
2017.5 722524796 722567673 722613449 721931152 721696548 721701279 722102661 722205963 721925354 721824036 721466141
2027.1 721466141 721367950 721084824 720738068 720433273 720475159 720726013 720821915 720730057 720274277 720274658 720010757
2037.7 720010757 719741669 719393997 719106979 719340897 719080048 719253006 719357986 719343338 719029007 718279800
2047.4 718279800 718147583 717915039 717826843 718015976 718167801 717870102 717855377 718137436 717821732 717658615
2057 717658615 717255707 716904297 716550293 716368942 716653137 716547241 716398849 716255493 715832672 715126419
2066.7 715126419 715101624 715045929 714368210 714092026 713876190 713750687 713337173 712693558 712079620 712015305
2076.3G12015305L84750l32565m46625m21295j25351J98517k34070o22788k71148j24207
2086G10020523m82101P5607J49918J78909J71738j1521J46256m11911l02735L24097
2095.6G09858780O25992O0882k23159Q2397J48621M88739J86843J56937j90887k92588
2105.2G10902557J05896j05667J67694J46027K93503K75268K89841L15552r3918j72806
2114.9G12123947j96991K22473n6152m6005K6855k37884j51444m02374K19498J00860
2124.5G11602783l23791k48413k99759k4338j13678j82495o8665K25601n645K68402
2134.2G10830002J81579m38461J58920o4315Q6288K21710l433M8370k12936L04794
2143.8G11112518J76850J07879J92414j67237j9531J56479K41013K26745J96991q0643
$$ plain form
2076.3 712015305 712400055 712067490 711620865 711199570 711074219 711272736 711038666 710415878 710144730 710020523
2086 710020523 709538422 709614029 709763947 709942856 710114594 710103073 710249329 709837418 709534683 709858780
2095.6 709858780 710484772 710545654 710322495 710404892 710553513 711042252 711229095 711386032 711195145 710902557
2105.2 710902557 711008453 710902786 711070480 711216507 711510010 711785278 712075119 712390671 712296753 712123947
2114.9 712123947 711926956 712149429 712093277 712047272 712074127 711836243 711684799 711282425 711501923 711602783
2124.5 711602783 711278992 711030579 710730820 710706482 710592804 710410309 710341644 710567245 710561600 710830002
2134.2 710830002 711011581 710573120 710732040 710667725 710754013 710975723 710972290 711020660 710807724 711112518
2143.8 711112518 711289368 711397247 711589661 711422424 711402893 711559372 711800385 712027130 712224121 712143478
2153.5G12143478R5673J19858P324K04926r3232O2409J23901j78604k20795R4300P9345
2164.1G12438583j78146P4005K40097L06244j0834k58102m99573k98462K23389j9608
2173.7G12017593j57013l02124j62201k52685r9411K62680l1586J03607j52893L7690
2183.4G11263657N68237K67181p8125J4191n7755k20336L40423m349J13678M75388
2193G12682190N035L28751J02844m4784K12860M62951M89045J32675k9602l69568q9111
2203.6G13883286J37176L86124P33490K54287k78854j59531L19367J28937n0965o3553
2213.3G15289764j46331r1935K82975M43725k09350o7597J21536k95181j22909K56729
2222.9G15461426M1046j1063J93634j09863j83716m18777j4343L16848l07083r4757
$$ plain form
2153.5 712143478 712239151 712359009 712366333 712571259 712478027 712540436 712664337 712485733 712264938 712359238 712438583
2164.1 712438583 712260437 712334442 712574539 712880783 712869949 712611847 712112274 711813812 712037201 712017593
2173.7 712017593 711860580 711558456 711396255 711143570 711044159 711306839 711275253 711378860 711225967 711263657
2183.4 711263657 711831894 712099075 712020950 712035141 711977386 711757050 712097473 712093124 712206802 712682190
2193 712682190 712687225 713015976 713118820 713074036 713286896 713749847 714238892 714371567 714341965 713972397 713883286
2203.6 713883286 714020462 714406586 715140076 715394363 715115509 714955978 715275345 715404282 715353317 715289764
2213.3 715289764 715143433 715051498 715334473 715778198 715568848 715501251 715622787 715327606 715204697 715461426
2222.9 715461426 715502472 715491409 715685043 715575180 715391464 714972687 714958344 715275192 714968109 714873352
2232.5G14873352K77252J96762l63845m00620j65558K3117K70767k5940K81449Q1558
2242.2G15048294k97089j68762J04218J05743l88565P3700J18561j35880j6937K72217
2251.8G14715500Q1787m22363K30560J40991j09253J8616l0365j06049j33590L14331
2261.5G14700165P9880r2926k16218N3788M54635R4834M0664j02996k64817l50113
2271.1G14396896N7450m58Q469M80117m3029j34430j99662j10321J8082m4861l3722
2281.7G14394531O4545L40500m69361l56597O6299O3171J86844m4021J06048k31170
2291.4G14120789J29623j07269n89600J59531J92260J09482n2490J62277R6741j2283
2301G14209061k4720k07595J21688k81677j56479j96914J52435O17828l95736l90931
$$ plain form
2232.5 714873352 715150604 715347366 714983521 714582901 714417343 714440460 714711227 714685287 714966736 715048294
2242.2 715048294 714751205 714582443 714686661 714792404 714403839 714477539 714596100 714460220 714443283 714715500
2251.8 714715500 714797287 714374924 714605484 714746475 714637222 714655838 714625473 714519424 714385834 714700165
2261.5 714700165 714780045 714687119 714470901 714524689 714979324 715074158 715114822 715011826 714747009 714396896
2271.1 714396896 714454346 714453888 714462357 714942474 714899445 714765015 714565353 714455032 714473114 714428253 714394531
2281.7 714394531 714459076 714799576 714330215 713973618 714039917 714103088 714289932 714245911 714351959 714120789
2291.4 714120789 714250412 714143143 713553543 713713074 713905334 714014816 713962326 714124603 714221344 714209061
2301 714209061 714184341 713976746 714098434 713816757 713660278 713463364 713615799 714233627 713837891 713446960
2310.7G13446960N4017K9907q13904m03290L00827k93045L24097J90964j39542k50778
2320.3G12446213o53153k06680L20206J03073n06897j2055l56598m30679Q47321P78122
2329.9G12328873o94580j207734K96555R58710l433p70646m4174M87976N23834L68424
2339.6G12243805k80457L74756j8463k24228M29611l13949k86102M54711M55552P18383
2349.2G13553619J005707m9209m32969m71344o48117o1798r70077n77851k50015r35669
2358.9G10162277J9684R25217L03573m95453J265564J422806n86395Q5831Q37021q17185
2368.5G13122940j95084J128998K00196L27987P58209P26014O103q50525j19934R56955
2378.2G16061859N05295m92249l05K62909j0452L00217M18777R2850l00598l05024
$$ plain form
2310.7 713446960 713500977 713530884 712716980 712313690 712614517 712321472 712645569 712836533 712696991 712446213
2320.3 712446213 711793060 711586380 711906586 712009659 711502762 711490707 711134109 710703430 711550751 712328873
2329.9 712328873 711634293 710426559 710723114 711681824 711678391 710907745 710863571 711351547 711875381 712243805
2339.6 712243805 711963348 712338104 712319641 712095413 712525024 712211075 711924973 712379684 712835236 713553619
2349.2 713553619 714559326 714510117 714077148 713605804 712957687 712895889 711925812 711347961 711097946 710162277
2358.9 710162277 710181961 711107178 711410751 710915298 712180862 713603668 713017273 713103104 713940125 713122940
2368.5 713122940 712927856 714056854 714257050 714585037 715343246 716069260 716075363 715224838 715104904 716061859
2378.2 716061859 716567154 716074905 716074600 716337509 716327057 716627274 717046051 717138901 716838303 716533279
2387.8G16533279k70767K136J07193r5596P1640K08054j5793k98767K17209O5612n16052
2398.4G16008148k29568j42365K36359N45349R7122l31878j25428j56936j63651L3417
2408.1G15770569l93448o0883o2332l34167J7547N7755K23007J75400L0289l29133
2417.7G15094604j06201J27182m96902j14212K34451j63574k74124P858J26114k1210
2427.3G14413986l69491n55573j86005k72750j56021J28402K09427K51846j42974r7657
2437G13223190M7379J2283l04260l86963J98517o561m08554q4305n8136l16086m4632
2447.6G11871872K08206j2588l85056n7220Q3999n20706k23541k8305P0266L20664
2457.2G11327591N9738j32141k72980j17035k38571j62048j16120k83279M3945k6474
$$ plain form
2387.8 716533279 716262512 716264648 716371841 716276245 716347885 716555939 716540146 716241379 716458588 716524200 716008148
2398.4 716008148 715778580 715636215 715872574 716417923 716515045 716183167 716057739 715900803 715737152 715770569
2408.1 715770569 715377121 715316238 715253906 714919739 714937286 714995041 715218048 715393448 715423737 715094604
2417.7 715094604 714988403 715115585 714618683 714504471 714738922 714575348 714301224 714309082 714435196 714413986
2427.3 714413986 714044495 713488922 713302917 713030167 712874146 713002548 713211975 713463821 713320847 713223190
2437 713223190 713270569 713282852 712978592 712591629 712790146 712783585 712375031 712290726 712232590 711916504 711871872
2447.6 711871872 712080078 712067490 711682434 711625214 711709213 711188507 710964966 710936661 711006927 711327591
2457.2 711327591 711387329 711255188 710982208 710865173 710626602 710464554 710348434 710065155 710109100 710082626
2466.9G10082626k48794l54920n4855L3569O3095P7286l35998k03858l18985l72162
2476.5G08367004l61557L6316L14179j25504k5940k93884M5853M7378k75039M9743
2486.2G07778549o10657m07104J46561P629j95084j73950J47095J4114j66778m81720
2495.8G06058655m87366m425M05579J59073k37351k36435m49295m5853K47116j99661
2505.5G05210037m44107m5547L1814m84695k09427r384j5640J82571K09351j37787
2515.1G04287186m29840l26157m14734Q5373K87628m3945j3275j18027k51160m20303
2524.7G02642746l59192n6229K60086R2164K5100l6392l59650Q0262k6398l67889p8583
2535.4G01816025J64184j37558l83224j64871k53525J33285J75324K2430n5237o04248
$$ plain form
2466.9 710082626 709833832 709478912 709424057 709457626 709520721 709598007 709262009 709058151 708739166 708367004
2476.5 708367004 708005447 708041763 708355942 708230438 708204498 707910614 707956467 708003845 707728806 707778549
2486.2 707778549 707167892 706760788 706907349 706914978 706719894 706545944 706693039 706707153 706540375 706058655
2495.8 706058655 705571289 705566864 705972443 706131516 705894165 705657730 705208435 705162582 705409698 705210037
2505.5 705210037 704765930 704720383 704752197 704267502 704058075 704048691 704033051 704215622 704424973 704287186
2515.1 704287186 703857346 703531189 703116455 703201828 703489456 703445511 703432236 703314209 703063049 702642746
2524.7 702642746 702283554 702227325 702487411 702579575 702604675 702568283 702208633 702288895 702262497 701894608 701816025
2535.4 701816025 701980209 701842651 701459427 701294556 701041031 701174316 701349640 701372070 701316833 700712585
2545G00712585n79681m13055J12152K01645k00577j95770P9727K87475j88217l71551
2554.6F99444733m87519k12249J85241Q0643l5400l68042J7166J69754q5602j20010
2564.3F98588715N5236J55945m10614k44751j94854m64173j50833m1199j32599P859
2573.9F97168732L3416o06231l78189L14254J26343j90429k15912k3728m4327l3111
2583.6F96150818k22321l48816j0986m8141k62833j28937q1329k87323j30463N875
2593.2F94635544q6289l08227n13458k38800M577k42233l31040K18354j6022k90375
2602.9F92832031N5924k48108l91083l43018r8953J15738j3809n22842q02613L05J48850
2613.5F90732422o3019k61612n02395j74866j43204k32620p5379L14331Q851m38462
$$ plain form
2545 700712585 700132904 699719849 699832001 700033646 699833069 699637299 699717026 700004501 699816284 699444733
2554.6 699444733 698957214 698744965 698930206 699010849 698975449 698607407 698624573 698794327 698708725 698588715
2564.3 698588715 698643951 698799896 698389282 698144531 697949677 697485504 697334671 697293472 697160873 697168732
2573.9 697168732 697202148 696595917 696217728 696531982 696658325 696467896 696251984 696228256 696183929 696150818
2583.6 696150818 695928497 695579681 695568695 695520554 695257721 695128784 695047455 694760132 694629669 694635544
2593.2 694635544 694549255 694241028 693727570 693488770 693493347 693251114 692920074 693138428 693122406 692832031
2602.9 692832031 692887955 692639847 692248764 691905746 691806793 691922531 691908722 691385880 690583267 690583572 690732422
2613.5 690732422 690669403 690407791 689905396 689730530 689587326 689354706 689279327 689593658 689602509 689164047
2623.1F89164047k71225l09524l44391m44718l71093r2392J12838l23944n70602O256
2632.8F86555252p5302j94321m9896q0566m14048n98144j77765L5324j38321l66669
2642.4F84495544J3581k3957m62799l72390l07770j52664k34146j32904K9602j18256
2652F82733841k75955k54288l0823l54690m25797k00882k66876l02582k35672j28174
2661.7F80258102q773K1362l19061k81754l37982l10669O5079j79978r3155k7008k07672
2672.3F78578491k39715k01722j1901k10419k24304j5107k62222n29327l15705k24151
2681.9F76343918k14920n1651k8458r0484k46354j8310j60599k88849n7144k41775
2691.6F74945374j48468k98005j30386J07193m15726o88934m39911J32904l5171m67301
$$ plain form
2623.1 689164047 688892822 688583298 688238907 687794189 687423096 687330704 687443542 687119598 686548996 686555252
2632.8 686555252 686479950 686285629 686235733 686155167 685741119 685142975 684965210 685000534 684862213 684495544
2642.4 684495544 684509125 684485168 684022369 683649979 683342209 683189545 682955399 682822495 682852097 682733841
2652 682733841 682457886 682203598 682172775 681818085 681392288 681191406 680924530 680621948 680386276 680258102
2661.7 680258102 680249329 680270691 679951630 679669876 679331894 679021225 679086304 678906326 678813171 678786163 678578491
2672.3 678578491 678338776 678137054 678125153 677914734 677690430 677675323 677413101 676883774 676568069 676343918
2681.9 676343918 676128998 676077347 676048889 675958405 675712051 675693741 675533142 675244293 675187149 674945374
2691.6 674945374 674796906 674498901 674368515 674475708 674059982 673371048 672931137 673064041 673028870 672561569
2701.2F72561569k49252L54156J29929o08521j42440j95008o50711k63519J12534n3864
2710.9F70994873l50800k58255m86907k72217j85242l89404J85165n3711m56543n14526
2720.5F68212433n97229k36130N8518L32489k1592m73709l27530l59649j93482o0806
2730.2F66333313k42081m41971k46810O1035m35410m52881M731p7363j76849j21307
2739.8F64204407j32828m22134k29035j20163k68326q4228j50681j00937k17895r842
2749.4F62468338j08795o31485j16730M6082j47858n24216o06308q4610k5863j10398
2759.1F60158157l83148n19943n08041j0910L22341j96533n42373n99137p5302j27640
2768.7F57517471m89654k03247p7210l04947n54886j04293J8234k50168n27878o04629
$$ plain form
2701.2 672561569 672312317 672666473 672796402 672187881 672045441 671850433 671199722 670936203 671048737 670994873
2710.9 670994873 670644073 670385818 669898911 669626694 669441452 669052048 669237213 669183502 668726959 668212433
2720.5 668212433 667615204 667379074 667437592 667770081 667748489 667274780 666947250 666587601 666394119 666333313
2730.2 666333313 666091232 665649261 665402451 665463486 665028076 664575195 664579926 664502563 664325714 664204407
2739.8 664204407 664071579 663649445 663420410 663300247 663031921 662947693 662797012 662696075 662478180 662468338
2749.4 662468338 662359543 661728058 661611328 661657410 661509552 660985336 660379028 660294418 660268555 660158157
2759.1 660158157 659775009 659255066 658747025 658736115 659058456 658861923 658319550 657720413 657645111 657517471
2768.7 657517471 657027817 656824570 656747360 656442413 655887527 655783234 655801468 655551300 655023422 654418793
2778.4F54418793j79215l16543m91867l33786q8273k42919m53568n36652k94876O35376
2788F52116470l0899j155472p86514J5488o4545n97839j42899j26800m82407m74853
2797.7F48269730l95966l08304m98962p12738o63071l05176p39212o81915r7275l52173
2807.3F43514938j74331j22300o26449j038666m17175J38702l00979l54767n78003
2816F40040970n84831m05426o44989p15180m81605l27149l88489k45018m56733m83437
2825.6F35308113n23605q51746n82161n94024o50254n05409n75790n92270o65322q99772
2835.3F28867760j008492p67135m29535o93703j210098p36199q86306j739235j490097
2843.9F19906960j290322j574859j623841j487045j814919j728210j265411j145440
$$ plain form
2778.4 654418793 654239578 653923035 653431168 653097382 653009109 652766190 652312622 651775970 651481094 652116470
2788 652116470 652085571 650930099 650143585 650159073 650094528 649496689 649353790 649226990 648744583 648269730
2797.7 648269730 647873764 647565460 647066498 646353760 645690689 645385513 644646301 643964386 643867111 643514938
2807.3 643514938 643340607 643218307 642591858 641553192 641136017 641274719 640973740 640618973 640040970
2816 640040970 639456139 639050713 638405724 637690544 637208939 636881790 636493301 636248283 635791550 635308113
2825.6 635308113 634784508 633932762 633350601 632756577 632106323 631600914 631025124 630432854 629767532 628867760
2835.3 628867760 627859268 627092133 626662598 625968895 624758797 624022598 623136292 621397057 619906960
2843.9 619906960 618616638 617041779 615417938 613930893 612115974 610387764 609122353 607976913
2851.7F07976913l29589l2502j51672j66130m70390o0959K01301L0403j11045l78456
2861.3F06507874m76723j48544k49520r38835p61490n04341q72765q61015l33900r7847
2870.9F01262894n81017p79228m64325o11267q59871m78096k90031m52996o13327o41632
2880.6E95491104j91803j68495n04875o03600n58662k59934l08609q23784j426925
2889.3E90644417j166344o2141j72997p83691l21045k48566q86459j002960o85654
2897.9E85314560n30739m44336k67448k73247m73099p94029m82254j16921p93609p58133
2907.6E80380745l18260p40433j012573p22656l33405m69589p82471j129456j375236
2916.3E73496666j081085o89621l86315m72908q26110o86722m06952l54386l26461
$$ plain form
2851.7 607976913 607647324 607614822 607463150 607297020 606826630 606765671 606966972 606997375 606886330 606507874
2861.3 606507874 606031151 605882607 605633087 604694252 603932762 603428421 602555656 601694641 601360741 601262894
2870.9 601262894 600681877 599902649 599438324 598827057 597967186 597489090 597199059 596746063 596132736 595491104
2880.6 595491104 595299301 595130806 594625931 594022331 593463669 593203735 592895126 592071342 590644417
2889.3 590644417 589478073 589415932 589242935 588459244 588138199 587889633 587003174 586000214 585314560
2897.9 585314560 584783821 584339485 584072037 583798790 583325691 582531662 582049408 581932487 581138878 580380745
2907.6 580380745 580062485 579322052 578309479 577586823 577253418 576783829 576001358 574871902 573496666
2916.3 573496666 572415581 571725960 571339645 570866737 570040627 569353905 568946953 568592567 568266106
2925E68266106o47927k87704M11072k8611J63880P81250K09579m14161K90603O81153
2934.6E69425240J16310L44200K55241N07813N98373k3346O23894M66690k4261q736
2944.2E72281418N4207K75573j19857L0594N7563k03895k8801J75018l02200r01337
2953.9E71318283n03464l15094J43280M2649l89939P3128k2087j96953j41907N48363
2963.5E70556259Q69713J75514l47366j5373R73777P41158N66482Q46940M62951L42636
2973.2E75172691N97420M51851J51939P07817P10640R40514J276398L71132L11584
2981.8E80691986M16908J46523K25525Q22868Q20999K58560O20537N30892N20439M36897
2991.5E85492134M2267K40478K24991L61748J36108k97775k08664J44196J53541k27584
$$ plain form
2925 568266106 567618179 567330475 567741547 567712936 567876816 568658066 568867645 568453484 568744087 569425240
2934.6 569425240 569541550 569885750 570140991 570648804 571247177 571223831 571847725 572314415 572290154 572281418
2944.2 572281418 572335625 572611198 572491341 572521935 572579498 572375603 572346802 572521820 572219620 571318283
2953.9 571318283 570814819 570499725 570643005 570685654 570295715 570368843 570346756 570149803 570007896 570556259
2963.5 570556259 571425972 571601486 571254120 571238747 572212524 572953682 573520164 574367104 574830055 575172691
2973.2 575172691 575770111 576221962 576373901 577081718 577792358 578732872 580009270 580380402 580691986
2981.8 580691986 581108894 581255417 581480942 582303810 583124809 583383369 584003906 584534798 585055237 585492134
2991.5 585492134 585534401 585774879 585999870 586361618 586497726 586199951 585991287 586135483 586289024 586061440
3001.1E86061440J07612M16489K88772q6441n35392k85569j12266k03934O9351J08147
3010.8E85828209j77460l18527l30429r1667l3875k12745k62185l52745l36799k66876
3020.4E83444901m82445m25530J43357j10856o50672o57502n57785k20070k73895k54631
3030.1E79954872l23982o87180l30505l23029o86073m60739m17328o19011j36795k19383
3039.7E75750847l49121q0223p39365n28336m82482n83802J13716l37905o71196n71900
3049.4E71520233k94380k97966p46803o60858p67785l80706J754o06384p08618m18320
3059E66640167o77452m12140j21460n15632l98369p04613l52783K35634o62346o08673
3068.6E62422333l98140o39267l97682k85721l65563n78460p7591L25203m15116q04100
$$ plain form
3001.1 586061440 586169052 586585541 586874313 586787872 586252480 585966911 585854645 585650711 585720062 585828209
3010.8 585828209 585650749 585332222 585001793 584910126 584876251 584663506 584401321 584048576 583711777 583444901
3020.4 583444901 582962456 582536926 582680283 582569427 581918755 581261253 580703468 580483398 580209503 579954872
3030.1 579954872 579630890 578943710 578613205 578290176 577604103 577143364 576726036 576107025 575970230 575750847
3039.7 575750847 575401726 575321503 574582138 574053802 573571320 572987518 573101234 572763329 572092133 571520233
3049.4 571520233 571225853 570927887 570181084 569520226 568752441 568371735 568373489 567767105 567058487 566640167
3059 566640167 565962715 565550575 565429115 564913483 564515114 563810501 563457718 563693352 563031006 562422333
3068.6 562422333 562024193 561384926 560987244 560701523 560335960 559757500 559679909 560005112 559589996 558785896
3078.3E58785896o98700o47888j71127j54381m68140n16128o00281l41453m73328o32858
3087.9E54081612m44413k30255j8463m12903n79796n69763l96805m08630q29010l24974
3097.6E49866600l929m49028r27849p26509l32489m64516l20892k43034m63028n74685
3107.2E45360641m07753k26516k11067o31295j104469n53436N5618l7003m93660o80198
3116.9E41070862n15824m94613q86917j031227j29624m36363j157684n32265o66428
3125.5E35219917o21223P210l57285p97157o09703p26853m67415n0659o60019r86824
3135.2E29949989r86709n46112k74964o40831o11229n02891j55754m31671q87146p71828
3144.8E24140854r55925p96509l92342k40631o04210o35147n14183r31739o47660n81321
$$ plain form
3078.3 558785896 558087196 557439308 557268181 557113800 556645660 556129532 555529251 555187798 554714470 554081612
3087.9 554081612 553637199 553406944 553388481 552975578 552395782 551826019 551429214 551020584 550191574 549866600
3097.6 549866600 549862671 549413643 548485794 547759285 547426796 546962280 546641388 546398354 545935326 545360641
3107.2 545360641 544952888 544726372 544515305 543884010 542779541 542226105 542281723 542244720 541751060 541070862
3116.9 541070862 540555038 540060425 539173508 538142281 538012657 537576294 536418610 535886345 535219917
3125.5 535219917 534598694 534605904 534248619 533451462 532841759 532114906 531647491 531596832 530936813 529949989
3135.2 529949989 528963280 528417168 528142204 527501373 526890144 526387253 526231499 525799828 524912682 524140854
3144.8 524140854 523184929 522388420 521996078 521755447 521151237 520516090 520001907 519070168 518422508 517841187
3154.5E17841187p67251m15382m06914p68203r06754n77431q19931j031265k77481
3163.1E11870575k83241o94161o83059q11806n41001n82199j083641r13620o28204
3171.8E05649643n30052k66037k36626p93037q74062n65185p47414m67758l91007r81636
3181.5D99796829r22584o51970q37174m51011K6626n34820p84798n62248p19910q81920
3191.1D93477020o91375n60112o26030n48287p37152o25572m05464o20842o96640q41141
3200.8D87124405p41043o08063m94499l1700L5743j025924j407891j92527l06397r12361
3210.4D81439743n60837o96068o01310l06320o93245p96662k91557k35596l42293q55674
3220D76060181j363488o94656M044j17989r00040q40110l52631k78015j34392m30908
$$ plain form
3154.5 517841187 517073936 516658554 516251640 515483437 514576683 513999252 513179321 512148056 511870575
3163.1 511870575 511587334 510893173 510210114 509398308 508857307 508275108 507191467 506277847 505649643
3171.8 505649643 505119591 504853554 504616928 503823891 502949829 502384644 501637230 501169472 500778465 499796829
3181.5 499796829 498874245 498222275 497385101 496934090 496960716 496425896 495641098 495078850 494358940 493477020
3191.1 493477020 492785645 492225533 491599503 491051216 490314064 489688492 489283028 488662186 487965546 487124405
3200.8 487124405 486383362 485775299 485280800 485249100 485284843 484258919 482851028 482658501 482352104 481439743
3210.4 481439743 480878906 480182838 479581528 479275208 478581963 477785301 477493744 477258148 476915855 476060181
3220 476060181 474696693 474002037 474006081 473888092 472988052 472147942 471795311 471517296 471382904 470951996
3229.7D70951996o17943q24318o76727o65589m71763J95770n29289r61952j046563
3238.4D65353622q26034j26648k07825k79770o31294n91583k41585j30539m34341j013184
3248D60870819n59807j43699l92914o81687n27916n21888n17235r7694l60528p63053
3257.7D56304398q84324l82843k40936p12585m99802n27115n30739l49388m80461m76341
3267.3D51219864k76604l97339o39572l14560M4976j81466n26847l17688n28527m85649
3276.9D47596588j54686q99505r67331l54119k01034l58506j87606j55259p21588p58667
3286.6D42838287n02014j8921r3841j91193N1766l84636k92740l75939o51970n99975
3296.2D39778824n00946k45133m79278o26526n05867j91345j8730m38881o89698n62591
$$ plain form
3229.7 470951996 470334053 469509735 468833008 468167419 467695656 467891426 467362137 466400185 465353622
3238.4 465353622 464527588 464400940 464193115 463913345 463282051 462690468 462448883 462318344 461884003 460870819
3248 460870819 460311012 460167313 459774399 459092712 458564796 458042908 457525673 457427979 457067451 456304398
3257.7 456304398 455420074 455037231 454796295 454083710 453583908 453056793 452526054 452176666 451696205 451219864
3267.3 451219864 450943260 450545921 449906349 449591789 449636765 449455299 448928452 448610764 448082237 447596588
3276.9 447596588 447441902 446542397 445575066 445220947 445019913 444661407 444473801 444318542 443596954 442838287
3286.6 442838287 442336273 442317352 442223511 442032318 442084084 441699448 441406708 441030769 440378799 439778824
3296.2 439778824 439277878 439032745 438553467 437926941 437421074 437229729 437210999 436772118 436082420 435519829
3305.9D35519829l79639l27682p88727q03566j08338k46925l74985m21638l72887l43323
3315.5D31352119r67979n30586k52381k96516l40576q13103n17387l46718k57340m80995
3325.2D26548538p87010r37538o65856J02120l00751m59633l83415o36673n92575j87645
3334.8D21699562J13792n74455p81212n40275p72362j330757p55653J03797n21164
3343.5D16641273n47027n64842n73273k85950o66351o35376q6517k11678r98802n99365
3353.1D11472092m27132q98476q37097p09686m93965o30570n722J05057p54127q48809
3362.8D05971565m39491P629n26886q49609n78270l33061j42365l00102o86645r27430
3372.4D01195335k56500l07731p66716n47410j48468J7205p53670o97250j52474l22456
$$ plain form
3305.9 435519829 435140190 434812508 434023781 433220215 433111877 432864952 432489967 432068329 431695442 431352119
3315.5 431352119 430384140 429853554 429601173 429304657 428964081 428150978 427633591 427286873 427029533 426548538
3325.2 426548538 425761528 424823990 424158134 424260254 423959503 423499870 423116455 422479782 421887207 421699562
3334.8 421699562 421813354 421238899 420457687 419917412 419145050 417814293 417058640 417162437 416641273
3343.5 416641273 416094246 415529404 414956131 414670181 414003830 413368454 413281937 413070259 412071457 411472092
3353.1 411472092 411044960 410146484 409309387 408599701 408105736 407475166 407469444 407574501 406820374 405971565
3362.8 405971565 405532074 405539703 405012817 404163208 403584938 403251877 403109512 402809410 402122765 401195335
3372.4 401195335 400938835 400631104 399864388 399316978 399168510 399185715 398432045 397734795 397582321 397259865
3382.1C97259865l34511k13966n03312r03396n24063j3809L3073l17001m97513k51885
3391.7C93733482k28996m73671k94266j79367n46074m84771n59349j44234N18417J76811
3401.3C91517982k55584o64826n05142l35159j36872L1548l92799k74086O8206K20414
3411C89273682k75689n92918m80270l59803q3694k00577P5836J12076k92282m20151
3420.6C86756210J27755M59861j9874j71700m57763J92565N91126k80914O1683M81644
3430.3C87740593k75574n54313N7029r3002j65787P0648J2398K55547L10173P2250
3439.9C87429962Q5526L84521l11813j02730N68237Q33168J347199m79813o15082J91384
3449.6C89330559K08015O02913P5760K41280J38626O82678O69556j26801N03082L25585
$$ plain form
3382.1 397259865 396925354 396711388 396208076 395304680 394780617 394766808 394799881 394482880 393985367 393733482
3391.7 393733482 393504486 393030815 392736549 392557182 392011108 391526337 390966988 390822754 391341171 391517982
3401.3 391517982 391262398 390597572 390092430 389757271 389620399 389651947 389259148 388985062 389053268 389273682
3411 389273682 388997993 388405075 387924805 387565002 387481308 387280731 387356567 387468643 387176361 386756210
3420.6 386756210 386883965 387343826 387323952 387152252 386694489 386887054 387478180 387197266 387258949 387740593
3430.3 387740593 387465019 386910706 386967735 386874733 386708946 386779594 386791992 387047539 387357712 387429962
3439.9 387429962 387515488 387900009 387588196 387485466 388053703 388886871 390234070 389754257 389139175 389330559
3449.6 389330559 389538574 390141487 390217247 390458527 390597153 391279831 391949387 391822586 392325668 392651253
3459.2C92651253L42521M95263M88357k52762l78456R77364Q86078K66113N6267N90553
3468.8C96122551K59895k72064K00310K92549P27615O49453N98487P98645Q99277M39720
3478.5D00716438J9493M51355L78228M58755j08642M38308J143608N06401O67229M5166
3488.1D04716339o0844N75714L97911L60298Q55713R41391L87077N03502J48049M27780
3497.8D09252930Q39080J17035O38237J326333P45773L24974K64320M12102P65686
3506.5D14686470L95355Q46863P37801j99013P16629Q32214J080551O58074l204M85649
3516.1D20237389N77659P90482P18193P37839N00145J125755J099090m31633M59404
3524.8D25814323J294480R47838l85704O19392J396980M23813M26674N51491J582756
$$ plain form
3459.2 392651253 392993774 393489037 393977394 393724632 393346176 394323540 395209618 395475731 395531998 396122551
3468.8 396122551 396382446 396110382 396310692 396603241 397330856 397980309 398578796 399377441 400276718 400716438
3478.5 400716438 400735931 401187286 401565514 402024269 401915627 402353935 403497543 404003944 404671173 404716339
3488.1 404716339 404655495 405231209 405629120 405989418 406845131 407786522 408173599 408677101 408825150 409252930
3497.8 409252930 410092010 410209045 410847282 412173615 412919388 413244362 413508682 413920784 414686470
3506.5 414686470 415081825 415928688 416666489 416467476 417184105 418016319 419096870 419754944 419751740 420237389
3516.1 420237389 420815048 421605530 422323723 423061562 423561707 424687462 425786552 425354919 425814323
3524.8 425814323 427108803 428056641 427670937 428290329 429687309 430111122 430537796 431089287 432672043
3533.5D32672043Q47778O09703J25695j58730J787147Q25234M93126L71551P11480
3542.1D38285027J139869J035805J304970M577J289330K36931P64427J379127O19469
3550.8D46059532J568070j046791P15065J673545J124649J411286Q1940K024040J718292
3559.5D55329628M17976l25050P65762J276894R9716L792076J946755l60833l94096
3568.2D62548828j664848K918129J638183N44739R08280J357078J399422J167793J592751
3576.9D72410355n52521J485748J889725K73704J351815J208877J543541N87998K400322
3585.5D82599564K401542o42204K080994p69883J289330K731132K160645P12662l01819
3594.2D92261963L237381J1139M98466K852707J72806K115440J534691O8207J498871
$$ plain form
3533.5 432672043 433519821 434129524 434255219 434096489 435883636 436708870 437201996 437573547 438285027
3542.1 438285027 439424896 440460701 441765671 441770248 443059578 443296509 444060936 445440063 446059532
3550.8 446059532 447627602 446580811 447295876 448969421 450094070 451505356 451587296 453611336 455329628
3559.5 455329628 455747604 455422554 456188316 457465210 457564926 461357002 463303757 462942924 462548828
3568.2 462548828 460883980 463802109 465440292 465985031 466893311 468250389 469649811 470817604 472410355
3576.9 472410355 471857834 473343582 475233307 475507011 476858826 478067703 479611244 480199242 482599564
3585.5 482599564 485001106 484358902 486439896 485670013 486959343 489690475 491851120 492563782 492261963
3594.2 492261963 495499344 495510483 496008949 498861656 499034462 501149902 502684593 502752800 504251671
3602.9E04251671J388702J262474K536927L384056l16201K416764P56340j619873O208648
3611.6E20269508L256112l125420K637901j86081K458344M795418O89010O96678n38139
3620.3E30953331k71606L033142K895546J739959K174454J943207K046966O373749
3628E50888748N145493p507706Q81691J658478L621292L141479k91061J589699K409477
3636.6E61537590K263947Q33282J411705K346230K538185K507705L48015J045838K894859
3645.3E77727356M986801J007042j692963N645981J467705p72591k084045K692642
3653E88977928L343239K975388O217079l882942k01073M441185J466026J084328Q41751
3661.7F05262909J968040P43905J072158J831589L84712L414040L370552k10152j77192
$$ plain form
3602.9 504251671 505640373 506902847 509439774 512823830 512507629 514924393 515680733 514060860 520269508
3611.6 520269508 523525620 520400200 523038101 522852020 525310364 530105782 530794792 531491470 530953331
3620.3 530953331 530681725 533714867 536610413 538350372 540524826 542468033 544514999 550888748
3628 550888748 556034241 548526535 549408226 551066704 554687996 557829475 557538414 559128113 561537590
3636.6 561537590 563801537 564634819 566046524 568392754 570930939 573438644 573786659 574832497 577727356
3645.3 577727356 582714157 583721199 582028236 587674217 589141922 588369331 586285286 588977928
3653 588977928 592321167 595296555 601513634 597630692 597429619 601870804 603336830 604421158 605262909
3661.7 605262909 607230949 607974854 609047012 610878601 611263313 614677353 618047905 617837753 617660561
3670.4F17660561m194680Q88634N683823Q136177N847740j2150192k268448M279136
3678.1F23882751M118729q63533m93660J931877J547852J464691P38983K86026K977638
3686.8F35591354N137482n980835l623733P547454l642234k502327L597602N71709
3694.5F36696472R62639p706l13453P81860n24254J867981L488884k521515k621918
3703.2F37808990L294755J853027j39313K13394J683502L968201m829712J295700N772477
3711.9F50921021q585816K276688L241348L56445J34430J285935K089996k647781o96946
3720.5F48375320N544358p78199n412063L752060J801529O28738j976089j855164K128143
3729.2F52208633k13623M259110l60794p866669P104035N362243o477966k738724J158371
$$ plain form
3670.4 617660561 613465881 614354515 620038338 628174515 634022255 621872063 619603615 623882751
3678.1 623882751 628001480 627137947 626644287 628576164 630124016 631588707 632327690 632613716 635591354
3686.8 635591354 640728836 634748001 631124268 638671722 635029488 632527161 636124763 636696472
3694.5 636696472 637659111 637651405 637337952 638119812 637595558 639463539 642952423 640430908 637808990
3703.2 637808990 641103745 642956772 642817459 643030853 644714355 648682556 643852844 645148544 650921021
3711.9 650921021 642335205 644611893 647853241 648209686 648344116 649630051 651720047 649072266 648375320
3720.5 648375320 653919678 653141479 647729416 651481476 653283005 653911743 651935654 650080490 652208633
3729.2 652208633 651995010 656254120 655893326 648026657 655130692 660492935 654014969 651276245 652434616
3737.9F52434616j43890J508255K961425l265380J138076J0166245n63965j8756561
3745.6F45478821N715942M255448M320831j021347r698334R667358k7694p577362K122650
3754.3F53236313K948990L999710m295502P25937N842590n079422k657928K623443
3762F57344131L01743m45175L642959p49816m586030J243668M066696K838440p311249
3770.7F56345367J04905K286529l48434N97000k80838J53427J35422K572097J663666
3779.4F63229141o449966M21295J501846O59180K265244j977845j117859J480866N66254
3788F60578156K81906o87867r2468K51846J26725j078186L6544L688813k062149m008408
3797.7F57034912R88999K674636O836777j148987j0773926J30082J306686L093262
$$ plain form
3737.9 652434616 652290726 653798981 656760406 653495026 654633102 664799347 664235382 645478821
3745.6 645478821 651194763 655450211 659771042 658749695 649051361 658718719 658691025 651113663 653236313
3754.3 653236313 656185303 660185013 655889511 656615448 662458038 657378616 654720688 657344131
3762 657344131 657645874 657200699 660843658 660093842 655507812 656751480 660818176 663656616 656345367
3770.7 656345367 656450272 658736801 658388367 658985367 658704529 658857956 658993378 661565475 663229141
3779.4 663229141 656779175 657200470 658702316 659361496 661626740 659648895 658531036 660011902 660578156
3788 660578156 660860062 660172195 660079727 660331573 660458298 659380112 659416656 663105469 661043320 657034912
3797.7 657034912 658023911 660698547 667535324 666386337 655612411 655742493 657049179 660142441
3805.4F60142441N031585m338226n216904L338776K415543l4867p21664p79800J085739
3814.1F60922623M413910l0289j2054596L465958M847030L179932M918060j2261200
3821.8F57401428j690445L282776J172714K279587J429520l251267j498642Q23899
3829.5F59949570K777710K676925p776260J4954O367721m217377j462860Q262024m492187
3838.2F62100220o281281P775192k859191l122254M927826j017380l468399K084427
3845.9F60139160J234512r74273J024551p95212l08914M670792l103104M837494j0863800
3854.6F55861206l969345R198685m52576l416519Q48465J629257K998428l879623n11170
3863.3F58306808O262208l176575n651016J915054L673401O206131k278290j0450668
$$ plain form
3805.4 660142441 665174026 660835800 655618896 658957672 661373215 661338348 660616684 659836884 660922623
3814.1 660922623 665336533 665306244 653251648 656717606 661564636 664744568 669662628 657401428
3821.8 657401428 655710983 658993759 660166473 662446060 663875580 660624313 659125671 659949570
3829.5 659949570 662727280 665404205 657627945 657642899 664010620 659793243 658330383 666592407 662100220
3838.2 662100220 655818939 663594131 660734940 657612686 662540512 661523132 658054733 660139160
3845.9 660139160 661373672 660399399 661423950 660628738 660319824 664990616 661887512 666725006 655861206
3854.6 655861206 651891861 661090546 660637970 657221451 658069916 659699173 662697601 658817978 658306808
3863.3 658306808 664569016 661392441 655741425 657656479 661329880 667536011 665257721 654807053
3871F54807053L94363N579453N914077p933044k015076K353745l91922J049041L888169
3879.7F63645859j596222o869278L381348J179580J613617P678070q838577l435059
3887.4F56759338J748200k99530K807236K547225n263519j382675J844864j588669
3895.1F57172470L15857P04727K124405M045563p651673K484589K812424n656662L849106
3903.8F60200806Q6364k342453r89074K9068J685486p9728L05786J05668o27518l59345
3913.4F58015060k01950Q98209K242889j515503l844986K844697J447525l305665J220093
3922.1F57800369J475983K45972n99747k107010Q240P82776J127166m89730m35944
3930.8F57808075K288971j635513j996766Q36716m66156N34L37677J23825P2632j014328
$$ plain form
3871 654807053 655201416 660780869 666694946 658761902 656746826 659100571 658708649 659757690 663645859
3879.7 663645859 662049637 655180359 658561707 659741287 661354904 669032974 660194397 656759338
3887.4 656759338 658507538 658208008 661015244 663562469 658298950 656916275 658761139 657172470
3895.1 657172470 657488327 658193054 660317459 664363022 656711349 659195938 662008362 656351700 660200806
3903.8 660200806 660287170 657944717 656955643 656984711 658670197 658590469 658896255 659001923 658374405 658015060
3913.4 658015060 657813110 658711319 660954208 659438705 655593719 658438416 659885941 656580276 657800369
3922.1 657800369 659276352 659522324 658922577 656815567 656823807 657606583 658733749 658244019 657808075
3930.8 657808075 660097046 658461533 656464767 657301483 656835327 656835861 657173538 657297363 657369995 656355667
3940.4F56355667J225510J958847k962723q61282O15997J43738J256561j487732P27387
3949.1F56971970J591873k051316L90091N11017m2724K61993O2637r613j250915k76108
3958.7F56158905n1651L82843R09348q48999o62384R8800J97754l5248J23215N45731
3968.4F56818314j81580m45023L13797L04337k73056m41132k7160O58722N8746j41373
3978F56644592N3864p99637o57043M45938P47909k39944m65164Q5220K86560K95181
3987.7F56397476N31235O32172j098633j205902M20379P34024J92719r90830l04794
3996.3F55307846R49478M57230l83072j5640
4000.2F56315842
$$ plain form
3940.4 656355667 657581177 659540024 656577301 655716019 656332016 656475754 657732315 656244583 656971970
3949.1 656971970 658563843 656512527 656902618 657413635 657370911 657632904 657695541 657685928 656435013 656158905
3958.7 656158905 656107254 656490097 657399445 656550446 655888062 655986862 656184616 656149368 656272583 656818314
3968.4 656818314 656636734 656191711 656505508 656809845 656536789 656095657 656068497 656727219 656785965 656644592
3978 656644592 656698456 655898819 655241776 655687714 656435623 656195679 655730515 655815735 656102295 656397476
3987.7 656397476 656928711 657560883 656462250 655256348 655676727 656410751 656603470 655612640 655307846
3996.3 655307846 656257324 656714554 656331482 656315842
4000.2 656315842
##END=$$ End of the data block
