##TITLE=$$ Begin of the data block
##JCAMP-DX=5.00 $$ ACD/SpecManager v 10.08
##SPECTROMETER/DATA SYSTEM=Varian
##DATE=18 Dec 2012 14:24:26
##DATA TYPE=INFRARED SPECTRUM
##DATA CLASS=XYDATA
##ORIGIN=
##OWNER=
##NPOINTS=3735
##FIRSTX=399.26403809
##LASTX=4000.35498047
##MAXX=4000.35498047
##MINX=399.26403809
##MAXY=73.49930573
##MINY=16.20501137
##XFACTOR=1.0000000000
##YFACTOR=0.000000100000000
##FIRSTY=58.21012878
##DELTAX=0.96440572
##XUNITS=1/CM
##YUNITS=TRANSMITTANCE
##XYDATA=(X++(Y..Y))
399.3E82101288K627525J1014443q78029J289940k342034l238525P81402J047516N63202
$$ 582101288 584728813 595743256 594865227 596155167 593813133 590574608 591356010 592403526 592966728
407.9E92966728L363762K243538p986336o881180M740868N804749j24588p955246l185196
$$ 592966728 596330490 598574028 590587692 583706512 588447380 594252129 594127541 586172295 582987099
416.6E82987099N148010j3080635m219856J5363006J651154m243355m835892M111023
$$ 582987099 588135109 575054474 570834618 586197624 587848778 583605423 578769531 582880554
424.3E82880554j102943o12641K566147N85976J76773k440758K211571J25351j580048
$$ 582880554 581777611 581164970 583731117 584317093 584493866 582053108 584264679 584390030 582809982
433E82809982M272538L164863j727905k478981K134476l648606m894218N44090j821556
$$ 582809982 587082520 590247383 588519478 586040497 588174973 584526367 579632149 580176239 578354683
441.7E78354683l424606m066353L672218N995827n303m50515P89756K192040J655693
$$ 578354683 574930077 570863724 574535942 580531769 580526466 580075951 580865707 583057747 584713440
450.4E84713440k34184j672669j598396L80936q95691m331627O77185N794411o153374
$$ 584713440 584479256 582806587 581208191 581589127 580693436 576361809 577038994 582833405 576680031
459.1E76680031j458702K761688J955910j729279m238510j42288j074372Q17261K465935
$$ 576680031 575221329 577983017 579938927 578209648 573971138 573828850 572754478 573571739 576037674
467.7E76037674k801170l632470J75667L259392n348625l048477M937439L838844k127991
$$ 576037674 573236504 569604034 569779701 573039093 567690468 564641991 569579430 573418274 571290283
476.4E71290283n234337L987389L741074j540451k156373o79626J108055k128715J632614
$$ 571290283 566055946 570043335 573784409 572243958 570087585 569407959 570516014 568387299 570019913
485.1E70019913K646217J464195p26127m027176M15840J354484J396065N88837j845627
$$ 570019913 572666130 574130325 573404198 569377022 569792862 571147346 572543411 573132248 571286621
493.8E71286621P63664J367836q24241j572991j046447r40476Q7853L73573Q03833
$$ 571286621 572050285 573418121 572593880 571020889 569974442 569033966 569121819 569495392 570299225
502.5E70299225J02119j984787q02879k43645k16827j742973p48063J158066k267875
$$ 570299225 570401344 568416557 567613678 567370033 567153206 565410233 564662170 565820236 563552361
511.1E63552361K27470O50215l275413j036721R71489n80444k429085j203117k096443
$$ 563552361 563779831 564430046 561154633 560117912 561089401 560508957 558079872 556876755 554780312
519.8E54780312j820183R32731J589470P72477N3367J94779p38945l12653K08435K327
$$ 554780312 552960129 553892860 555482330 556254807 556308174 556502953 555764008 555451355 555659790 555662117
529.5E55662117l51486j074562j278687n01823J788063J035690M4518q47779j921882
$$ 555662117 555310631 554236069 552957382 552455559 554243622 555279312 555323830 554476051 552554169
538.1E52554169L3531L82118J094895R34104L44162J302834l74107j011773J060486
$$ 552554169 552587700 552969818 554064713 554998817 555342979 556645813 556271706 555259933 556320419
546.8E56320419K165490J26838j386452n302j36719J21918R84726j50185O5384P87926
$$ 556320419 558485909 558612747 557226295 557220993 557084274 557206192 558190918 558040733 558106117 558894043
556.5E58894043o40335o94771l73764p51991L41415l38287j231842Q30116J704292
$$ 558894043 558253708 557558937 557185173 556433182 556774597 556436310 555204468 556034584 557738876
565.1E57738876K84691K54021p34825j467438J25084r08966r13963Q85391J200561
$$ 557738876 558023567 558277588 557542763 556075325 556200409 555291443 554377480 555262871 556463432
573.8E56463432M37317j076393k077446j501045J073532K43912j383286J141930J304550
$$ 556463432 556900749 555824356 553746910 552245865 553319397 553563309 552180023 553321953 554626503
582.5E54626503K04010j104546j302032m77562J066437J386223l59879K24419J83143
$$ 554626503 554830513 553725967 552423935 551946373 553012810 554399033 554039154 554263573 554446716
591.2E54446716L96996o29006j703186j53274R3078O5461j307602j452103j460915
$$ 554446716 554843712 554214706 552511520 552358246 552451324 552516785 551209183 549757080 548296165
599.9E48296165k471313j118469j533623k310486l452263m032478m994774p514763
$$ 548296165 545824852 544706383 543172760 540862274 537410011 533377533 528382759 520867996
607.6E20867996q469581r719582j1031799j2650757j2636185j3021736j0188675n951271
$$ 520867996 512398415 502678833 491647034 478996277 466360092 453338356 443149681 437198410
615.3D37198410k773628M89197k67830r23996n686074r246139j0434418j1053924p769051
$$ 437198410 434424782 434913979 434646149 433722153 428036079 418789940 408355522 397301598 389532547
624C89532547k845306O407394J1994591J6506119J7034263J5851746J3110695P140693
$$ 389532547 386687241 393094635 405089226 421595345 438629608 454481354 467592049 474732742
631.7D74732742K918320k291641n446549q113403p046089n251503n300446k074051
$$ 474732742 477651062 475359421 469912872 461799469 454753380 449501877 444201431 442127380
639.4D42127380K633629J0695191J4628791J7188530J7247811J4482841J2661019J0146217
$$ 442127380 444761009 455456200 470084991 487273521 504521332 519004173 531665192 541811409
647.1E41811409O906319N823021M886665K983856K925987K682305J086921M60282N34057
$$ 541811409 548717728 554540749 559427414 562411270 565337257 568019562 569106483 569566765 570100822
655.8E70100822P22046J332703P77588Q46443J352348J619873J251030q90808Q927
$$ 570100822 570822868 572155571 572933159 573779602 575131950 576751823 578002853 577112045 577120972
664.5E77120972J837577J816178P65266m680557K937584K905006O65474N42069Q50868
$$ 577120972 578958549 580774727 581539993 576859436 579797020 582702026 583367500 583909569 584760437
673.2E84760437K88315l89824l87726j4763J463165J888009J10511M69513J399269
$$ 584760437 585048752 584658928 584271202 584256439 585719604 587607613 587718124 588187637 589586906
681.8E89586906j16272n63163j111527k116623m77066K9450m5739k63328j250649l21312
$$ 589586906 589470634 588907471 587795944 585679321 585202255 585231705 585185966 584922638 583671989 583350677
691.5E83350677J61324l28369k070885k628059n32761M33426K70157l55034J11694
$$ 583350677 583512001 583183632 581112747 578484688 577951927 578385353 578655510 578300476 578412170
700.2E78412170q4915j000633r7809n0583M17023O68755p973R90715J613731R84078
$$ 578412170 578327255 577326622 577228813 577178230 577595253 578264008 578256035 579246750 580860481 581844559
709.8E81844559Q82644J551056O62422r8686P87812J160774J301040J493035J958351
$$ 581844559 582727203 584278259 584940681 584841995 585629807 586790581 588091621 589584656 591543007
718.5E91543007J672668R75991J132850P53632M04358O54144N39856O3324j90086N23872
$$ 591543007 593215675 594191666 595324516 596078148 596482506 597136650 597676506 597739830 597549744 598073616
728.1E98073616K0981j199532L20854l2043k036285r86138o4277j00861l98178n08385
$$ 598073616 598094597 596895065 597215919 597183876 595147591 594161453 594097176 593996315 593598137 593089752
737.8E93089752O32668Q77800K08435p94106m48303Q98476o15845n46646K197189K705994
$$ 593089752 593722420 594600220 594808655 594014549 593566246 594464722 593848877 593302231 595499420 598205414
747.4E98205414K456322K024688J949082K376175J857223J736641J564255J215401
$$ 598205414 600661736 602686424 604635506 607011681 608868904 610605545 612169800 613385201
755.1F13385201J230354K044334K777786J796723J054573N55534M84886P1564J52931
$$ 613385201 614615555 616659889 619437675 621234398 622288971 622844505 623329391 623400955 623553886
763.8F23553886J177521J14136l81126O1416J74256n18075p31468N67246J71127r25331
$$ 623553886 624731407 624845543 624464417 624525833 624700089 624182014 623450546 624017792 624188919 623263588
773.5F23263588K86674K316552J521682J110878J798897J903420K306823J092911J119080
$$ 623263588 623550262 625866814 627388496 628499374 630298271 632201691 634508514 635601425 636720505
782.1F36720505J214599J580391J939431N28183J197204J317215J153107M35486M16030
$$ 636720505 637935104 639515495 641454926 641983109 643180313 644497528 645650635 646086121 646502151
790.8F46502151M88663r96170L28293P57065K63824l8299K79693M88282l02506J35651
$$ 646502151 646990814 645994644 646322937 647080002 647343826 647305527 647585220 648073502 647770996 647906647
800.5F47906647r04541k71530R66720J94168O59714R37881J16044L29055J016465J00631
$$ 647906647 647002106 646730576 647697296 647891464 648551178 649489059 649605103 649934158 650950623 651051254
810.1F51051254L2959l41186k15378P80029l61862n22690P79495J351777M40750J070327
$$ 651051254 651084213 650743027 650527649 651307678 650945816 650423126 651202621 652554398 652995148 654065475
819.7F54065475J352005n00869j216660j303634j91422l39584q73413l41721k71454
$$ 654065475 655417480 654916611 653699951 652396317 652204895 651865311 650991898 650650177 650378723
828.4F50378723j140594k002106j480255k955628l692550k817650k658768k379074
$$ 650378723 649238129 647236023 645755768 642800140 639107590 636289940 633631172 631252098
836.1F31252098k750816k856484k299080j983947j907463j489220j961289k424621
$$ 631252098 628501282 625644798 623345718 621361771 619454308 617965088 616003799 613579178
843.9F13579178j731072j661872j236268J83182R30405J190491J929321J700058J096611
$$ 613579178 611848106 610186234 608949966 609133148 610063553 611254044 613183365 614883423 615980034
852.5F15980034J256103J480484K724495K894402K488327K603569K039375K367325
$$ 615980034 617236137 618716621 621441116 624335518 626823845 629427414 631466789 633834114
860.3F33834114K130241J417428P81555Q59298J154137J265946J631393R87854J029587
$$ 633834114 635964355 637381783 638163338 639022636 640176773 641442719 643074112 644061966 645091553
868.9F45091553L80554M40979O93436k58179K13089N49164J619644J798553J4572j131210
$$ 645091553 645472107 645913086 646606522 646348343 646561432 647110596 648730240 650528793 650543365 649412155
878.6F49412155p37762p39518j725997j886063k254028j713868j017646j284905j601219
$$ 649412155 648674393 647934875 646208878 644322815 642068787 640354919 639337273 638052368 636451149
887.3F36451149p35130n04761j838379j165161J66893O21681k70615n8212J257248
$$ 636451149 635716019 635211258 633372879 632207718 632374611 632996292 632725677 632667465 633924713
895.9F33924713P27654N27687K35023O21605K52876j257705j184197o03180K01531
$$ 633924713 634652367 635180054 635415077 636036682 636289558 635031853 633847656 633244476 633446007
904.6F33446007L8872p20330j542396k114411k832374k454300j384621k414436k720833
$$ 633446007 633484879 632764549 631222153 629107742 626275368 623821068 622436447 620022011 617301178
913.3F17301178k402763j923371j744575k455788k091408j578750k576981l287010
$$ 617301178 614898415 612975044 611230469 608774681 606683273 605104523 602527542 599240532
921E99240532k236786k252235k015038j067657j017380o66313p30820q63609r62220
$$ 599240532 597003746 594751511 592736473 591668816 590651436 589985123 589254303 588390694 587428474
929.7E87428474q65287k70958K59552O39610O56700J434364J935044J991844K736664
$$ 587428474 586563187 586292229 586551781 587191391 587848091 589282455 591217499 593209343 595946007
938.4E95946007K196846J761017K803611L197174K625084K325402K019119J847687
$$ 595946007 598142853 599903870 602707481 605904655 608529739 610855141 612874260 614721947
946.1F14721947K188873K342682K172623J417388J108895N05371L08876J82037l76434
$$ 614721947 616910820 619253502 621426125 622843513 623952408 624457779 624766655 624948692 624572258
954.8F24572258K33459n44281q52355j028481j812477j698113k328148k430191k640838
$$ 624572258 624805717 624261436 623409081 622380600 620568123 618870010 616541862 614111671 611470833
963.4F11470833k649460j925583k002067j938134j640548j831398j760254j447678
$$ 611470833 608821373 606895790 604893723 602955589 601315041 599483643 597723389 596275711
971.2E96275711r37958l72390p87812j421127j351624q93173r86252j047668r76830
$$ 596275711 595337753 594965363 594177551 592756424 591404800 590511627 589525375 588477707 587500877
979.8E87500877j478538j348763j460304j564674j795349k413598j986160k394180
$$ 587500877 586022339 584673576 583213272 581648598 579853249 577439651 575453491 573059311
987.6E73059311l520088l669129l916435m882698n587234q243752j3257713j7445870
$$ 573059311 569539223 565870094 561953659 557070961 551483727 543239975 529982262 512536392
995.3E12536392j3851814J070175J3057671J4269142R075050M422112J682014L50914
$$ 512536392 498684578 499754753 512812424 527081566 536156616 540578728 542260742 542611656
1003E42611656P91626j69487j156845p75185l87420m76189j366234j289863j445885
$$ 542611656 543403282 543233795 542076950 541301765 540914345 540438156 539071922 537782059 536336174
1011.7E36336174j848793j278038r95216j016922r63517j921577k738419k248497k030296
$$ 536336174 534487381 533209343 532214127 531197205 530233688 528312111 525573692 523325195 521294899
1020.3E21294899j380272j255150j996956k145805j420593j248665j967392j971779
$$ 521294899 519914627 518659477 516662521 514516716 513096123 511847458 509880066 507908287
1028.1E07908287k453232j939811j778222k002449j403732j755676j382866j416016
$$ 507908287 505455055 503515244 501737022 499734573 498330841 496575165 495192299 493776283
1035.8D93776283j539917j539497p19833p76482j877556m88853k30828p62062k98614
$$ 493776283 492236366 490696869 489977036 489200554 487322998 486834145 486603317 485841255 485542641
1044.5D85542641M28047K37808K90146j47743r53636M94957O78138P49893L37906R5787
$$ 485542641 485970688 486208496 486498642 486350899 485397263 485892220 486570358 487320251 487658157 487753944
1054.1D87753944N51262K84310L50570J4611Q70704N7602o14471o23703j017418k80647
$$ 487753944 488305206 488589516 488940086 488954697 489825401 489883003 489268532 488644829 487627411 487346764
1063.7D87346764n37491l75519j424027j617202j411858p86667O6147j045151q83369
$$ 487346764 486809273 486433754 485009727 483392525 481980667 481194000 481260147 480214996 479331627
1072.4D79331627k114525j970863k448197k579956q00361j383553j226234j760254
$$ 479331627 477217102 475246239 472798042 470218086 469417725 468034172 466807938 465047684
1080.1D65047684o15883j290741j886330j056442k307625k437477l654175l005752
$$ 465047684 464431801 463141060 461254730 460198288 457890663 455453186 451799011 448793259
1087.9D48793259l798294l957558m648972p366562o745033p793617p809219j0526352
$$ 448793259 444994965 441037407 436388435 429021873 422276840 414483223 406674004 396147652
1095.6C96147652j1314125j0447121j1383553j0598907j1524735j0010490j1501369
$$ 396147652 384833527 374386406 363002853 352403946 340879211 330868721 319367352
1102.3C19367352r526501r780159j0888653q893642j0757122p669335r261589q005104
$$ 319367352 309840851 300060692 289172039 280278397 269521275 261851940 252590351 244585247
1110B44585247p317238p093983n273628o122265k565746l376274p32670j087608j70288
$$ 244585247 237268009 230174026 224900398 218778133 216212387 212836113 212103443 211015835 210845547
1118.7B10845547Q92639J10016K813930L17612K482510J674919K248821J308975L95985
$$ 210845547 211738186 211848202 214662132 214979744 217462254 219137173 221385994 222694969 223090954
1127.4B23090954K445679l74661Q52642k056160j180858j583291k823352k545338n026951
$$ 223090954 225536633 225161972 226014614 223958454 222777596 221194305 218370953 215825615 210798664
1136.1B10798664k042675l474731j302109j997852k277604j803894m395580k513161
$$ 210798664 208755989 205281258 203979149 201981297 199703693 197899799 193504219 190991058
1143.8A90991058m446201k729015m477234l141632k689991m131012j466561k973575
$$ 190991058 186544857 183815842 179338608 176196976 173506985 169375973 167909412 164935837
1151.5A64935837J18675k381229n31903K32640l23906K118969K15816L230171N39570
$$ 164935837 165054512 162673283 162141380 162374020 162050114 164169083 164384899 167615070 168154640
1160.2A68154640K007141K144394K730942M845524L318634N355682L036824O350898
$$ 168154640 170161781 172306175 175037117 179882641 183201275 188556957 191593781 197944679
1167.9A97944679N647335O048184P398739O164150Q495655O441879Q852692P536983
$$ 197944679 203592014 209640198 217038937 223203087 231698742 238140621 246993313 254530296
1175.6B54530296P968216Q519249P639885R217339P191143Q654785P294636P537365
$$ 254530296 262498512 271017761 278657646 287874985 295066128 303720913 311015549 318552914
1183.3C18552914P259121O939621P705955O123657O873627N047913N673675N504379
$$ 318552914 325812035 332751656 340457611 346581268 353454895 358502808 364176483 369680862
1191C69680862N210038N108184M951783O390037M896393O119118N677261N917397O002044
$$ 369680862 374890900 379999084 384950867 391340904 396237297 402356415 408033676 413951073 419953117
1199.7D19953117N400505O420594N145492N599594N137215N118904M546585M410897
$$ 419953117 425353622 431774216 436919708 442519302 447656517 452775421 457322006 461732903
1207.4D61732903N149459L998108L749085K956619L693581L522949L384857L415794
$$ 461732903 466882362 470880470 474629555 477586174 481279755 484802704 488187561 491603355
1215.1D91603355K273140K568322J570243J572228J877708J824608J456032Q71811
$$ 491603355 493876495 496444817 498015060 499587288 501464996 503289604 504745636 505617447
1222.9E05617447J208877R46351J233024M87709M92020R90829O38199M05426O63986
$$ 505617447 506826324 507772675 509005699 509493408 509985428 510976257 511614456 512019882 512683868
1231.5E12683868J732026R04426Q51517J018028Q01163P16057K28157Q76655O97937
$$ 512683868 514415894 515320320 516171837 517189865 517991028 518707085 518935242 519811897 520509834
1240.2E20509834O41747N70030R55734Q85849J50681N05523M11416N43708j44996L55949
$$ 520509834 521151581 521721611 522677345 523563194 523713875 524219398 524630814 525174522 525029526 525385475
1249.9E25385475J051979O53649O43806R9602P44934P28950M92554K61002J74255O77643
$$ 525385475 526437454 527091103 527734909 527834511 528579445 529308395 529800949 530061951 530236206 530913849
1259.5E30913849J25465M17557Q32520Q39347L60756P72934J119271Q90846J275329
$$ 530913849 531039314 531456871 532289391 533128738 533489494 534262428 535381699 536272545 537547874
1268.2E37547874O25153P23038R78470J400261J298522J066018J348495R79462J656418
$$ 537547874 538173027 538896065 539874535 541274796 542573318 543639336 544987831 545967293 547623711
1276.9E47623711J440315J428108J711884J368026J314698J270713J746674J476135
$$ 547623711 549064026 550492134 552204018 553572044 554886742 556157455 557904129 559380264
1284.6E59380264J556092J664848J653709J464577J027603J538315J553497J533356
$$ 559380264 560936356 562601204 564254913 565719490 566747093 568285408 569838905 571372261
1292.3E71372261J221619J276779J909904J559410J124344J184082J194878J092453
$$ 571372261 572593880 573870659 575780563 577339973 578464317 579648399 580843277 581935730
1300E81935730J329384J035690R01642J092300O78597O35490N10216N53284J026306
$$ 581935730 583265114 584300804 585202446 586294746 586973343 587608833 588119049 588672333 589698639
1308.7E89698639R79957Q01392M20723J80740L39623L81622N47867L78418N49583Q36335
$$ 589698639 590678596 591479988 591900711 592081451 592421074 592802696 593350563 593728981 594278564 595114899
1318.3E95114899M90303Q95996R54857O62307N85709M05922N10826M94003Q05703Q51402
$$ 595114899 595605202 596501198 597456055 598118362 598704071 599109993 599620819 600114822 600920525 601771927
1328F01771927K77557J7128K47917M39110J35422l27492l04794J33324Q735K00997
$$ 601771927 602049484 602066612 602314529 602753639 602889061 602561569 602256775 602390099 602398834 602599831
1337.6F02599831L13491m96368l51715M88739M69856j98059k19917J56822J28593j41029
$$ 602599831 602913322 602416954 602065239 602553978 603023834 602825775 602605858 602762680 602891273 602750244
1347.3F02750244l43551k27089k55089j85242o74324o55289k22549k40707p325j89666
$$ 602750244 602406693 602179604 601924515 601739273 601064949 600409660 600187111 599946404 599939079 599749413
1356.9E99749413l72315n49354j66932P5417j94016l32794j111908j12762q4152q48198
$$ 599749413 599377098 598827744 598660812 598736229 598542213 598209419 597097511 596984749 596900597 596052399
1366.6E96052399n57442p63817j089058n28221m88167o35490k59781p67403j516990
$$ 596052399 595494957 594731140 593642082 593113861 592625694 591990204 591730423 590963020 589446030
1375.2E89446030o37741P3280l32146p94296l97148l63426m08326p26738p26966K28691
$$ 589446030 588808289 588881569 588549423 587755127 587357979 586994553 586586227 585859489 585132523 585361214
1384.9E85361214J266060J142120j49040O03485R59511K25067J8081J94855L93486
$$ 585361214 586627274 587769394 587620354 588223839 589183350 589408417 589426498 589621353 590014839
1393.6E90014839j100616j405831N69802o8169m03595j042404r57527k02370m78325
$$ 590014839 588914223 587508392 588078194 588010025 587606430 586564026 585606499 585404129 584925804
1402.2E84925804o59408l94211j086502p20787N29251P5454n78041o44912p28188n98030
$$ 584925804 584266396 583872185 582785683 582064896 582594147 582669601 582091560 581446648 580718460 580120430
1411.9E80120430l26195K7809j49612J03874L32108K2468N02701j883240m67910J085968
$$ 580120430 579794235 579822044 579672432 579776306 580108414 580130882 580633583 578750343 578282433 579368401
1421.5E79368401P00073N59578p28951O67076J398392K09580N54809Q18672m13017
$$ 579368401 580068474 580628052 579899101 580566177 581964569 582174149 582728958 583547630 583134613
1430.2E83134613J43356J289826N77774N36461J715469J804237j046409k68669K002334
$$ 583134613 583277969 584567795 585145569 585682030 587397499 589201736 588155327 587886658 589888992
1438.9E89888992Q15392J67770O63910M41322Q73414Q20770R62753P40624K85072J4648
$$ 589888992 590704384 590872154 591536064 591977386 592850800 593671570 594634323 595374947 595660019 595674667
1448.5E95674667M40979Q54912M18892P6256K327J290436J573028q621k040749m98504
$$ 595674667 596115646 596970558 597389450 597465706 597468033 598758469 600331497 600322876 598282127 597783623
1458.2E97783623L520927J555023J393357R90524Q77495K461777Q39729n65720Q07991
$$ 597783623 601304550 602859573 604252930 605243454 606120949 608582726 609422455 608856735 609664726
1466.8F09664726J125183Q62389J003609K278022K167817R32655K45361K477570L127060
$$ 609664726 610789909 611652298 612655907 614933929 617101746 618034401 618279762 620757332 623884392
1475.5F23884392J168365J201096J913490Q66356J136017J044044N60227J265182J102715
$$ 623884392 625052757 626253853 628167343 629033699 630169716 631213760 631773987 633039169 634141884
1484.2F34141884P10869J046867K64511m50210J120567r45625k083207N54886Q05130
$$ 634141884 634852753 635899620 636164131 635713921 636834488 635888863 633805656 634360542 635165672
1492.9F35165672k81295k79046O23703l965950N89409k2850k587356N59196m09469
$$ 635165672 634884377 634605331 635229034 631263084 631852493 631829643 629242287 629801483 629392014
1501.6F29392014q30460q79364L89214J323318k709274q563767m77524K131615j348114
$$ 629392014 628561554 627682190 628071404 629394722 626685448 618121681 617644157 619775772 618427658
1510.2F18427658n5962j849403l177147k89421n57175j6212j264572k393265K70348
$$ 618427658 618371696 616522293 613345146 613055725 612498550 612482338 611217766 608824501 609094849
1518.9F09094849J511955j324387l336677k85378P0725J951370j933327j688003k20604
$$ 609094849 610606804 609282417 605945740 605660362 605731087 607682457 605749130 604061127 603840523
1527.6F03840523j246720n52253j56746n14450j533013o56891l060226N28107K64320
$$ 603840523 602593803 602041550 601884804 601370354 599837341 599180450 596120224 596648331 596912651
1536.3E96912651j98784K366715j213417o326332l03917M24537o56051Q96759P26280
$$ 596912651 596713867 599080582 597867165 591540833 591236916 591661453 591005402 591902161 592628441
1545E92628441k120629J340828L50724P10411j12572j716042J433831J044502K099609
$$ 592628441 590507812 591848640 592199364 592909775 592797203 591081161 592514992 593559494 595659103
1553.6E95659103q00476p85293K366104K477875K680244j976204m110985J145516K364807
$$ 595659103 594858627 594073334 596439438 598917313 601597557 599621353 595510368 596655884 599020691
1562.3E99020691J129684J005936l4103l55721R96933K56653J055679l113937n5771
$$ 599020691 600150375 601156311 601122208 600766487 601763420 602020073 603075752 599961815 599906044
1571E99906044R48029k16141L89442k6130P43255n733108M7989N34706j199532q39767
$$ 599906044 600854073 600637932 601027374 601001244 601744499 596011391 596059380 596594086 595394554 594554787
1580.6E94554787j094780m91905j927643q80928j019631j518059j484870k630120j466598
$$ 594554787 593460007 592968102 591040459 590159531 589139900 587621841 586136971 583506851 582040253
1589.3E82040253k362061j445007j995583j509933j288834k366981j607056k891617
$$ 582040253 579678192 578233185 576237602 574727669 573438835 571071854 569464798 566573181
1597E66573181j550178k404175j796265j978340k420006j536522k706489r09806j711425
$$ 566573181 565023003 562618828 560822563 558844223 556424217 554887695 552181206 551271400 549559975
1605.7E49559975j550026l138809k279931j827354l128777p52449k315712j144027
$$ 549559975 548009949 544871140 542591209 540763855 537635078 536882629 534566917 533422890
1613.4E33422890k070847o01883l21045q317184P10525j141281p21969k054444l15017
$$ 533422890 531352043 530750160 530429115 522111931 522822456 521681175 520959206 518904762 518589745
1622.1E18589745j090851n220223J15891r90143M84466l011169k441177n84717r62257
$$ 518589745 517498894 512278671 512394562 511404419 511888885 508877716 506436539 505851822 504889565
1630.8E04889565l45307j306534N99785k00920k565041l246650O57348j12075K50854
$$ 504889565 504544258 503237724 503837509 503636589 501071548 497824898 498482246 498370171 498621025
1639.5D98621025J195374j294022P97310p76024P49474J937980m13856P72705l147812
$$ 498621025 499816399 498522377 499319687 498543663 499293137 501231117 500817261 501589966 498442154
1648.1D98442154J958427Q16155K380524K575302l668709k475777K226219M315415
$$ 498442154 500400581 501216736 503597260 506172562 502503853 500028076 502254295 506569710
1655.9E06569710J408882J883583R81140J129341J512871J660614K417107k0066K733765
$$ 506569710 507978592 509862175 510843315 511972656 513485527 515146141 517563248 517543182 520276947
1664.5E20276947J281967J519165J973076K626877K681961k84882L799401O78863K116204
$$ 520276947 521558914 523078079 525051155 527678032 530359993 530075111 533874512 534553375 536669579
1673.2E36669579L185310K039947M4938J515693K840958J732597L339462J752358K829590
$$ 536669579 539854889 541894836 541939774 543455467 546296425 548029022 551368484 553120842 555950432
1681.9E55950432M915314M547004m72641k900390M480323L518982K483063L009262
$$ 555950432 560865746 565412750 564940109 562039719 566520042 570039024 572522087 575531349
1689.6E75531349K099991K885590K853698K963829L104363M267845R98230K850723
$$ 575531349 577631340 580516930 583370628 586334457 589438820 593706665 594704895 597555618
1697.3E97555618M773560N391998O595993m521713M337311L885879L499031K586289
$$ 597555618 602329178 607721176 614317169 609795456 614132767 618018646 621517677 624103966
1705F24103966K434768K519303K106018L507042K382011J121826K178688K569275K730713
$$ 624103966 626538734 629058037 631164055 634671097 637053108 638174934 640353622 642922897 645653610
1713.7F45653610R21555o27747K304688K702179m247132J627426K586823P15942J42060
$$ 645653610 646575165 645947418 648252106 650954285 646707153 648334579 650921402 651637344 651779404
1722.4F51779404J6784o7901O81686Q22067M49448Q70819K033081R3765n94940K910080
$$ 651779404 651796188 651728287 652409973 653232040 653681488 654552307 656585388 656679153 656084213 658994293
1732F58994293L948593Q68836o004257J893844K593689R45130K202072O82525k170105
$$ 658994293 662942886 663811722 657807465 659701309 662294998 663240128 665442200 666124725 663954620
1740.7F63954620L004227L034592J087646R81064J939163J775894J697693K033921
$$ 663954620 666958847 669993439 671081085 672062149 674001312 675777206 677474899 679508820
1748.4F79508820P64617L665009K543793j76392L345871K359162J856765K383347O6299
$$ 679508820 680273437 683938446 686482239 686305847 689651718 692010880 693867645 696250992 696317291
1757.1F96317291J191864K244568J742020K697220m62799j060257K007598R11103Q20465
$$ 696317291 697509155 699753723 701495743 704192963 703730164 702669907 704677505 705588608 706409073
1765.8G06409073J373138J035843j657409J413726L260422J20773k232666j763839
$$ 706409073 707782211 708818054 707160645 708574371 711834793 711955566 709722900 707959061
1773.5G07959061K920761K189712q72802R30175O24543J246032P07932j232758N65567
$$ 707959061 710879822 713069534 712196732 713126907 713751450 714997482 715705414 714472656 715038223
1782.2G15038223J195984J023865j93939m88358R82514R03320L20511J220245K75574
$$ 715038223 716234207 717258072 717064133 716575775 717558289 718461609 718782120 720002365 720277939
1790.9G20277939j0147j523133j456604K593689J152420o77032O90689J652069N19791
$$ 720277939 720267792 718744659 717288055 719881744 721034164 720357132 721047821 722699890 723219681
1799.5G23219681j300202R69315l78876j69449J047287L21732M77676M22974Q9340
$$ 723219681 721919479 722888794 722509918 722340469 723387756 723709488 724187164 724610138 724699478
1808.2G24699478K30408P04269r57260j07422O84738K97013Q73489M6616O38962J42822
$$ 724699478 724929886 725634155 724676895 724569473 725254211 725551224 726424713 726471329 727110291 727253113
1817.9G27253113L6468K57950o61392N36880J61057N60074R75799j377945o0424J258773
$$ 727253113 727289581 727547531 726886139 727423019 727584076 728144150 729119949 727742004 727681580 728940353
1827.5G28940353J297074P82776k545090n35507J464157K95486j48010J4954O81991
$$ 728940353 730237427 731020203 728475113 727939606 729403763 729699249 729551239 729566193 730248184
1836.2G30248184M08478n01709N54276k25297K67106K41088Q16727J270142l982392
$$ 730248184 730656662 730154953 730709229 730483932 730751038 730992126 731808853 733078995 729096603
1844.9G29096603R62677J685028p9193k40936L38059M62341l36151K33230o1416L32184
$$ 729096603 730059280 731744308 731665115 731424179 731762238 732224579 731888428 732121658 732060242 732392426
1854.5G32392426K43225P3242N88150l94821n8670Q8729K02866j98975k71606N0964
$$ 732392426 732635651 732708893 733297043 732902222 732843552 732932281 733135147 732936172 732664566 732715530
1864.2G32715530L9826N69610j81961P11289l0594j493225L95355O31332L07923k9068
$$ 732715530 732755356 733324966 733143005 733854294 733823700 732330475 732725830 733357162 733665085 733636017
1873.8G33636017L33862m9515K8153L19748K53601O0425n70679o332J19552L38440
$$ 733636017 733969879 733920364 733948517 734268265 734521866 734582291 734011612 734005280 734124832 734463272
1883.4G34463272j33209k27127K14233j58386P91016M3258j469192Q5449N82886l28980
$$ 734463272 734330063 734102936 734317169 734158783 734949799 734993057 733523865 733609314 734192200 733863220
1893.1G33863220J4649N02777l56293L97263J45950J2741K64130k26441l85895m42352
$$ 733863220 733877869 734380646 734024353 734421616 734567566 734580307 734844437 734617996 734232101 733789749
1902.7G33789749L71628K95105J27563J984j71280J28479m730o81305o62689O39648
$$ 733789749 734161377 734456482 734584045 734586029 734414749 734543228 734538498 733857193 733194504 733834152
1912.4G33834152j50375O3705N94559j43280P65076j027298j222000L38134J75019
$$ 733834152 733683777 733747482 734342041 734198761 734963837 733936539 732714539 733052673 733227692
1921.1G33227692N65948l12881n75257M06647M62647Q5296K43302q1635m24042l90396
$$ 733227692 733793640 733480759 732905502 733312149 733774796 733860092 734103394 734021759 733597717 733207321
1930.7G33207321l87573J43127l1738K1973Q0719J09634p0419l10440l5477m73251
$$ 733207321 732819748 732962875 732931137 732953110 733033829 733143463 733073044 732762604 732727127 732253876
1940.3G32253876M40368J62964j484070M38767J100387K76948l0671M0589l00217m60052
$$ 732253876 732694244 732857208 731373138 731811905 732912292 733189240 733158569 733199158 732898941 732438889
1950G32438889n88761j86691L22342J83029Q9874j05591K89689J16043l41568k77100
$$ 732438889 731850128 731663437 731985779 732168808 732258682 732153091 732442780 732558823 732217255 731940155
1959.6G31940155O6681J02310m59061J8464n722j07193J02081l73459n17731j77383
$$ 731940155 732006836 732109146 731650085 731668549 731662827 731555634 731657715 731284256 730766525 730589142
1969.3G30589142J80511r9334L24783L69263j55793j68304k04620L2730l62473j24740
$$ 730589142 730769653 730670319 730995102 731364365 731208572 731040268 730835648 730868378 730505905 730381165
1978.9G30381165P2555j44882J373j41830j1750j40762k48871m52423k03934j62735
$$ 730381165 730453720 730308838 730310211 730168381 730156631 730015869 729766998 729314575 729110641 728947906
1988.6G28947906o09664K20794M04969o35300l00064Q41064J97525o26678l07770j68839
$$ 728947906 728338242 728559036 728964005 728328705 728028641 728869705 729067230 728440552 728132782 727963943
1998.2G27963943j48391j81427J73111k0905k2430K8610j95847J46866j49994l42178
$$ 727963943 727815552 727634125 727807236 727786331 727763901 727792511 727596664 727743530 727593536 727251358
2007.8G27251358m23508k24533j17569Q774J10779l28598J71585J84936j75170n37033
$$ 727251358 726827850 726603317 726485748 726494522 726605301 726276703 726448288 726633224 726458054 725921021
2017.5G25921021j17341K14463p35016l89862J02844L42865J43127k99911l94745n79224
$$ 725921021 725803680 726018143 725283127 724893265 724996109 725338974 725482101 725182190 724787445 724208221
2027.1G24208221J9455L968m37851n06821m6387Q2245r155J70517j28327K05842j71814
$$ 724208221 724227676 724231644 723793793 723286972 723240585 723322830 723313675 723484192 723355865 723561707 723389893
2037.7G23389893o06995k39410M7454o2484m42276p325o4773L10898J80893o02951
$$ 723389893 722782898 722543488 722590942 722528458 722086182 722078857 722014084 722324982 722505875 721902924
2047.4G21902924l47443k86789j02997j11008P7363J0299k8991o8589n94711j21079
$$ 721902924 721555481 721268692 721165695 721054687 721132050 721142349 721113358 721044769 720450058 720328979
2057G20328979J23368o9504n09415j95236J95923k59705m8370p2556k24761m97284
$$ 720328979 720452347 720382843 719873428 719678192 719874115 719614410 719566040 719493484 719268723 718771439
2066.7G18771439l01056j79367n19028k34909j50604j67923n90897p20673o01120k36129
$$ 718771439 718470383 718291016 717771988 717537079 717386475 717218552 716627655 715906982 715305862 715069733
2076.3G15069733K54440j40991l01056l79410k09427k90451n22690k75268n3025J28479
$$ 715069733 715324173 715183182 714882126 714502716 714293289 714002838 713480148 713204880 713151855 713280334
2086G13280334l8681J05973J62353K10114l1281k72979J06658n8517j00327N1194K23465
$$ 713280334 713241653 713347626 713509979 713720093 713688812 713415833 713522491 713463974 713363647 713414841 713638306
2096.6G13638306J18255J36261O8894j3581O01883K17743J9074k7848j39846o7902
$$ 713638306 713756561 713892822 713961716 713948135 714550018 714767761 714786835 714758987 714619141 714551239
2106.2G14551239k11792N14069L78036P095J18485q469J73493L94211J57928k90680
$$ 714551239 714339447 714853516 715231552 715238647 715357132 715348663 715522156 715916367 716074295 715783615
2115.9G15783615j42593k13547n875K59705j602l83682m24042J19323o4849p1259k60010
$$ 715783615 715641022 715427475 715421600 715681305 715679703 715296021 714871979 714991302 714926453 714855194 714595184
2126.5G14595184l62320j33590l12119J26572J8387j02311M5548K90375K16598k82211
$$ 714595184 714232864 714099274 713787155 713913727 713932114 713829803 713875351 714165726 714382324 714100113
2136.1G14100113L0746P4921J53k09351K90604N81741m1275K16598P9422J36033K00347
$$ 714100113 714130859 714205780 714205933 713996582 714287186 714868927 714827652 715044250 715123672 715259705 715460052
2146.7G15460052j20468j00326O9046K82135J62430L04565m6692k70538o8436J00937
$$ 715460052 715339584 715239258 715308304 715590439 715752869 716057434 716010742 715740204 715671768 715772705
2156.4G15772705L94363K40021J07880l15247j93100J54648L4485j6098k17514J18027
$$ 715772705 716167068 716407089 716514969 716199722 716006622 716161270 716195755 716179657 715962143 716080170
2166G16080170K61383O3476k4032k21405k57569j81350p8125R7656J62430Q773j17645
$$ 716080170 716341553 716405029 716380997 716159592 715902023 715720673 715642548 715740204 715902634 715911407 715793762
2176.6G15793762m35791m19388k42385l2273K37045J69373L09067J39770P6905k1134
$$ 715793762 715357971 714938583 714696198 714663925 714900970 715070343 715379410 715519180 715596085 715574951
2186.3G15574951j10626k5787l9063L99246L7690R9029N11017K99072J60523L8223
$$ 715574951 715464325 715438538 715399475 715798721 715836411 715935440 716446457 716745529 716906052 716944275
2195.9G16944275N56183L41568N6457J67694K5254R5215N6838K24228l4027O0807K60849
$$ 716944275 717500458 717842026 717898483 718066177 718091431 718186646 718243484 718467712 718433685 718494492 718755341
2206.5G18755341J11618K51236J41983J79138j54648l37753r461J63651J17111N3329
$$ 718755341 718866959 719118195 719260178 719439316 719284668 718946915 718937454 719101105 719218216 719271545
2216.1G19271545K36741O8054k7695L8910j31683j42746o867k68402r0027L25623j19400
$$ 719271545 719508286 719576340 719548645 719587555 719455872 719313126 719306259 719037857 718947830 719273453 719154053
2226.8G19154053k09656k4643K71606J29776l80706L1509N81818L33099n76019n03464
$$ 719154053 718944397 718919754 719191360 719321136 718940430 718971939 719553757 719886856 719310837 718807373
2236.4G18807373j21155L0670K03019j8311J43890j15356l48663j90888J39389J14594
$$ 718807373 718686218 718716888 718919907 718901596 719045486 718930130 718581467 718390579 718529968 718644562
2246G18644562k26975l3951P9270K40326j29090j7013j39237l24325M89426J00555
$$ 718644562 718417587 718383636 718462906 718703232 718574142 718557129 718417892 718093567 718582993 718683548
2255.7G18683548R6130P630j03302K20947j60446j70822j67923J77612J37939M01230
$$ 718683548 718779678 718787308 718684006 718904953 718744507 718573685 718405762 718583374 718721313 719122543
2265.3G19122543L95661m15802K4566J77918k55890m57001o9961j75705k07291K53220
$$ 719122543 719518204 719102402 719126968 719304886 719048996 718591995 718522034 718346329 718139038 718392258
2275G18392258J06659M01687J91574n5236l04184k82441M5929m3487J98135l27835
$$ 718392258 718498917 718900604 719092178 719036942 718732758 718450317 718496246 718452759 718650894 718323059
2284.6G18323059k11410J18713J39389L5095k11334J58615l61404K02865M28696m01611
$$ 718323059 718111649 718230362 718369751 718404846 718193512 718352127 717990723 718193588 718622284 718220673
2294.3G18220673p9346J50604J35956N2643L30276k66037k95639J84174j44272q6365
$$ 718220673 718141327 718291931 718427887 718480530 718810806 718544769 718249130 718433304 718289032 718202667
2303.9G18202667o84662k78549O256J44806N20401j602K35901k32391l24631k85111
$$ 718202667 717518005 717239456 717245712 717390518 717910919 717909317 718145218 717912827 717588196 717303085
2313.5G17303085k54287K12860l22418j72730k17743l17917l05023n5008M97208p0877
$$ 717303085 717048798 717261658 716939240 716766510 716548767 716230850 715925827 715870819 716368027 716297150
2323.2G16297150n24750o59180l9978O81687L41796j9912O56814L92533j017304o70090
$$ 716297150 715772400 715113220 715073242 715754929 716096725 716076813 716733627 717126160 716108856 715438766
2332.8G15438766J75324q6823k59170J001739R62830p36618q12454o7368J88675L53546
$$ 715438766 715614090 715527267 715268097 716269836 717232666 716496048 715683594 715616226 715804901 716158447
2342.5G16158447N89371K72293l89175K136P21664K20261J004944J541519q76846j478882
$$ 716158447 716747818 717020111 716630936 716633072 717354736 717574997 718579941 720121460 719244614 717765732
2352.1G17765732o53687n8365M44565p29980l85132n64423p55462l73078Q97827P96891
$$ 717765732 717112045 717053680 717498245 716768265 716383133 715818710 715063248 714690170 715587997 716384888
2361.8G16384888k5254J199265n64652j165924J54877Q08258J083145J219864O53839
$$ 716384888 716359634 717558899 716994247 715828323 715983200 716791458 717874603 719094467 719748306
2370.4G19748306k55508J04828j09482O07681J12305r37576L8375N14451M08020j73111
$$ 719748306 719492798 719597626 719488144 720095825 720208130 719270554 719308929 719823380 720231400 720058289
2380.1G20058289J602L95660N56793M02756l50571k11181r0027N4626R4910N6000O714
$$ 720058289 720059891 720455551 721012344 721415100 721064529 720853348 720763321 720817947 720912857 720968857 720975571
2390.7G20975571j25046K79007p1640l5019J72195j28936l14866k70843K8839m46472
$$ 720975571 720850525 721129532 721057892 721022873 721195068 721066132 720751266 720480423 720509262 720062790
2400.3G20062790p6523M32968J20163j28479l47900J11313J86996L2578k46354m94995
$$ 720062790 719986267 720419235 720539398 720410919 720063019 720174332 720361328 720393906 720147552 719652557
2410G19652557o5078K45208L35694l0518k94723j31150l1356j56022j31454J5945q9187
$$ 719652557 719587479 719832687 720168381 720137863 719843140 719711990 719680634 719524612 719393158 719409103 719319916
2420.6G19319916J28784Q0109o02951n34363J95007p5531j91574L68042K6398m51660
$$ 719319916 719448700 719528809 718925858 718391495 718586502 718510971 718319397 718687439 718713837 718262177
2430.2G18262177m47693P324J51138j0300J4725J04599K93274l60794n06134j53809
$$ 718262177 717814484 717821808 717972946 717962646 717977371 718081970 718375244 718014450 717508316 717354507
2439.9G17354507n4168K41165l20282l96729K9374j37864l04260j98135M21600K83966
$$ 717354507 717300339 717541504 717221222 716824493 716853867 716716003 716411743 716213608 716635208 716919174
2449.5G16919174l46832j22910j94168l87344l9520j58997j97830J86462L7995k92664
$$ 716919174 716572342 716449432 716255264 715867920 715828400 715669403 715471573 715658035 715696030 715403366
2459.2G15403366r1400M6310j27182k02102l79868j97220j06964j04675o1569l42484
$$ 715403366 715311966 715358276 715231094 715028992 714649124 714451904 714344940 714240265 714178696 713836212
2468.8G13836212J68991K26059q0414o9198k16675j05057k60467J8615j06582l88336
$$ 713836212 714005203 714231262 714150848 714081650 713864975 713759918 713499451 713518066 713411484 713023148
2478.5G13023148j4801l9978r8420k96249j38245j51596k08893l4561k19574j27868
$$ 713023148 713008347 712968369 712869949 712573700 712435455 712283859 712074966 712040405 711820831 711692963
2488.1G11692963j74713k1134j17111j79443j6556k64359n2032j36643k41317l1739
$$ 711692963 711518250 711497116 711380005 711200562 711184006 710919647 710867615 710730972 710489655 710457916
2497.7G10457916P0191k1057j34964P8735k63290m05961J28708R4986m84237l75977
$$ 710457916 710528107 710507050 710372086 710450821 710187531 709781570 709910278 710005264 709521027 709145050
2507.4G09145050M0207m3411j25428j29470j0300j00403l2959R8038m2954r8037m48304
$$ 709145050 709185257 709141846 709016418 708886948 708876648 708776245 708743286 708841324 708798370 708700333 708252029
2518G08252029n07431j15509K53449J91040p0648k24839k51693l27912n51300J28098
$$ 708252029 707744598 707629089 707882538 708073578 708002930 707778091 707526398 707198486 706647186 706775284
2527.6G06775284K67715r5062K136j53122J14136L4103q5907j983l00141l23333k3423
$$ 706775284 707042999 706947937 706950073 706796951 706911087 706945190 706859283 706857300 706557159 706233826 706210403
2538.2G06210403k3803m38462k30941J69830K33917l00674m61045N3177j86004N7602
$$ 706210403 706186600 705748138 705517197 705687027 705920944 705620270 705159225 705212402 705026398 705084000
2547.9G05084000K14843k32086k52304O4011J71966l65753m62417n5695K52838k13852
$$ 705084000 705298843 705066757 704814453 704878464 705050430 704684677 704222260 704166565 704419403 704205551
2557.5G04205551n22003p0038r765M9591j8845m2877k42996k12555J63040n8670k8839
$$ 704205551 703683548 703613510 703603745 703653336 703634491 703591614 703348618 703136063 703299103 703240433 703211594
2568.1G03211594l12348o98547l27301L8757J5335K33841L25852m34418o25382l55300
$$ 703211594 702899246 702200699 701873398 701912155 701927490 702161331 702487183 702052765 701427383 701072083
2577.8G01072083p2251J71967p553o3172q2092j41983k58408k40020j65329l24173
$$ 701072083 700999832 701171799 701164246 701101074 701018982 700876999 700618591 700378571 700213242 699889069
2587.4F99889069k69776K96478J28403m30374j11237j74789l4637k61002q57773k16217
$$ 699889069 699619293 699915771 700044174 699613800 699502563 699327774 699293137 699032135 698174362 697958145
2597.1F97958145N8136j46866l22113M4937K81220j88675k90146n02243l39432R1553
$$ 697958145 698016281 697869415 697547302 697592239 697873459 697684784 697394638 696892395 696552963 696644516
2606.7F96644516J61362r9793j09634j94550p41577j51062L24402k4414k04468n46875
$$ 696644516 696805878 696706085 696596451 696401901 695660324 695509262 695833664 695809250 695604782 695057907
2616.4F95057907p28149k12708K49558J32599P6828l05024n41687l85818o2866Q7890
$$ 695057907 694329758 694117050 694366608 694499207 694576035 694271011 693729324 693343506 693280640 693368530
2626F93368530m47921m70353l33252p2250J8997l50799k97928k16828l1509O256J0452
$$ 693368530 692920609 692450256 692117004 692044754 692063751 691712952 691415024 691198196 691166687 691172943 691183395
2636.6F91183395j99813l60871m05044n55344j16272j35803j5030j95465p11594j76468
$$ 691183395 690983582 690622711 690217667 689662323 689546051 689410248 689395218 689199753 688488159 688311691
2646.3F88311691o0196j11541j03913j79367l4714p0877j54953k17208n86701p92160
$$ 688311691 688251495 688139954 688036041 687856674 687821960 687751083 687596130 687378922 686792221 686000061
2655.9F86000061J24741L55072k60849l53775l33710n5466p4768k49710j20697j09177
$$ 686000061 686124802 686479874 686219025 685865250 685531540 685476074 685401306 685151596 685030899 684921722
2665.5F84921722l70407l66897j22757l58124j88980J26800j18713j34659Q3542r0942
$$ 684921722 684551315 684184418 684061661 683703537 683514557 683641357 683522644 683387985 683471527 683380585
2675.2F83380585m60892j19400K64511k47497o55289o14472m93927l1967J15433n1651
$$ 683380585 682919693 682800293 683064804 682817307 682162018 681547546 681053619 681021652 681137085 681085434
2684.8F81085434j18713j40229q3694l58887j83029j8692k52075k49176k82669r4071
$$ 681085434 680966721 680826492 680742798 680383911 680200882 680182190 679930115 679680939 679398270 679304199
2694.5F79304199k99301l94516j90964q0337q1330l50036j2894l29285n72357o7901
$$ 679304199 679004898 678610382 678419418 678339081 678257751 677907715 677894821 677565536 676993179 676925278
2704.1F76925278r2697K41394J40533m03213l26310r9258k33917m71955m41284k92969
$$ 676925278 676832581 677073975 677214508 676811295 676484985 676385727 676151810 675679855 675238571 674945602
2713.8F74945602J1292k61231m84085P9499Q4076k78778j90430m85459q18481k03705
$$ 674945602 674956894 674695663 674211578 674291077 674375153 674096375 673905945 673420486 672602005 672398300
2723.4F72398300K21787p0801m05502m95377n91431k39639L56293J28860j17874l85284
$$ 672398300 672620087 672549286 672143784 671648407 671056976 670817337 671173630 671302490 671184616 670799332
2733F70799332l70331k24152k55508K12173q0948j92260L433m37393m54789l13339
$$ 670799332 670429001 670204849 669949341 670161514 670080566 669888306 669891739 669454346 668999557 668686218
2742.7F68686218j63345j27945k28958k98538l86277l15017J75857M09012l85590p02819
$$ 668686218 668522873 668394928 668165970 667867432 667481155 667166138 667341995 667751007 667365417 666662598
2752.3F66662598p0496M8752o04553m78058J19095l4943m71115p89108l06549J13906
$$ 666662598 666592102 666640854 666036301 665558243 665677338 665642395 665171280 664382172 664075623 664189529
2762F64189529K18964Q3008o28815o31637m45786j40228J69143l06701n26810o8054
$$ 664189529 664408493 664491501 663862686 663231049 662785263 662645035 662814178 662507477 661980667 661912613
2771.6F61912613J2131k81525j64566m26559n49622l66745l86887j67694l66058n82504
$$ 661912613 661924744 661643219 661478653 661052094 660502472 660135727 659748840 659581146 659215088 658632584
2781.3F58632584k52533k8534m19846m94995k12021q5602J57776l28140p66068m90188
$$ 658632584 658380051 658351517 657931671 657436676 657224655 657139053 657296829 656968689 656202621 655712433
2790.9F55712433j53198n09262q07190n4551P7591k80380l79181l19748m96521p39059
$$ 655712433 655559235 655049973 654242783 654188232 654265823 653985443 653606262 653286514 652789993 652050934
2800.5F52050934n62592p40356p13272l32718r9487l35541k87552r2163n43213o20194
$$ 652050934 651488342 650747986 650034714 649701996 649602509 649266968 648979416 648887253 648344040 647723846
2810.2F47723846p44934m26559j47553k95791l24631o38657k84500m12903o79092n85937
$$ 647723846 646978912 646552353 646404800 646109009 645784378 645145721 644861221 644448318 643769226 643183289
2819.8F43183289n93491j36185k72217n51071n97381n73654q06046q38890l70560l07617
$$ 643183289 642589798 642453613 642181396 641630325 641032944 640459290 639653244 638814354 638443794 638136177
2829.5F38136177l31688q84704q93860l78113o15807q03260q82226p51762o73981r41581
$$ 638136177 637804489 636919785 636025925 635647812 635032005 634228745 633346519 632594757 631920776 630979195
2839.1F30979195j006928p67288j201401j679954j465264j460991j301536j128426
$$ 630979195 629972267 629204979 628003578 626323624 624858360 623397369 622095833 620967407
2846.8F20967407j138954k014770k246781r36966j044121j088562l50341J71814M91256
$$ 620967407 619828453 617813683 615566902 614629936 613585815 612497253 612146912 612318726 612809982
2855.5F12809982j64222j27793M46244J0452o99959o32515l66669k3422J30882p45468
$$ 612809982 612645760 612517967 612964211 612974663 612274704 611642189 611275520 611252098 611382980 610637512
2865.2F10637512q79326p78389j311226r35783j20582J61170m82940j116333p31659
$$ 610637512 609758186 608979797 607668571 606732788 606612206 606773376 606290436 605174103 604442444
2873.8F04442444m66881n57899j32447k03743q45680q56399n91851j73568k93541p62482
$$ 604442444 603975563 603417664 603285217 603081474 602235794 601379395 600787544 600613976 600320435 599557953
2883.5E99557953o23474o79932n30128l53661p29103p28035n92232m75197l39050l80630
$$ 599557953 598934479 598254547 597724419 597370758 596641655 595913620 595321388 594846191 594507141 594126511
2893.1E94126511k93160m03328q52470j404267j171073l72925m21410l37791j88904
$$ 594126511 593833351 593430023 592577553 591173286 590002213 589629288 589207878 588870087 588681183
2901.8E88681183l98255l74679o01807o19812m81720j85127m78744j095810n80750
$$ 588681183 588282928 587908249 587306442 586686630 586204910 586019783 585541039 584445229 583864479
2910.5E83864479m87213l20053o45485j754952j269340o56548p20825j078338p19300
$$ 583864479 583377266 583057213 582411728 580656776 579387436 578730888 578010063 576931725 576212425
2919.2E76212425l66974j267700n37910L13263j45111l95928l78418P1182j66664k0904
$$ 576212425 575845451 574577751 574039841 574353104 574207993 573812065 573433647 573504829 573338165 573317261
2928.8E73317261J48010k60391M19731M01306J91536N76782K87018r9487j9532Q44307
$$ 573317261 573465271 573204880 573624611 574025917 574217453 574794235 575081253 574981766 574962234 575806541
2938.5E75806541R00536K28844J08642K1973M21486N35126M70085K58178n92804l44009
$$ 575806541 576707077 576935921 577044563 577066536 577488022 578023148 578493233 578751411 578158607 577814598
2948.1E77814598K36702j30539l63960R8381j94435r20754n32646j24283J54724J29700
$$ 577814598 578051300 577920761 577556801 577655182 577460747 576539993 576007347 575883064 576037788 576167488
2957.7E76167488l75976m88892k0790M68292L49236N33485N15060o86l8643J94282
$$ 576167488 575791512 575302620 575281830 575750122 576099358 576632843 577147903 577147217 577108574 577302856
2967.4E77302856N99442P33795M59747M46282P87239O61697N75142M18320J95389P60727
$$ 577302856 577902298 578636093 579095840 579542122 580329361 580991058 581566200 581984520 582179909 582940636
2977E82940636P48062J103287R62333j37291K18468M13399M62036N90210P66411R47532
$$ 582940636 583688698 584791985 585754318 585617027 585835495 586248894 586710930 587301140 588067551 589015083
2986.7E89015083L48053L97454M70657O05850O62499J87111L30352L94974L82805J15051
$$ 589015083 589363136 589760590 590231247 590837097 591499596 591686707 592017059 592412033 592794838 592909889
2996.3E92909889n05028m17213R4185J98860O5765J09253L5706L0785K12173K27051
$$ 592909889 592404861 591987648 592081833 592280693 592346458 592455711 592491417 592522202 592734375 592961426
3006E92961426j08643o23588o09055N5809L45993j75094p72515o89850J43700K77634
$$ 592961426 592852783 592229195 591620140 591675949 592021942 591846848 591074333 590384483 590528183 590805817
3015.6E90805817j98250j80054l46756l91006k42958n24559o27366k62985l3378j67923
$$ 590805817 590607567 590427513 590080757 589689751 589446793 588922234 588294868 588031883 587998505 587830582
3025.2E87830582n85022o10543j53617l98674m08631j31492m59710k59552j03454l97339
$$ 587830582 587245560 586635017 586481400 586082726 585674095 585542603 585082893 584823341 584719887 584322548
3034.9E84322548o54793o17180k72560k99263n00564m83208l30963l23563o08902j021461
$$ 584322548 583667755 583050575 582778015 582478752 581978188 581494980 581164017 580840454 580231552 579210091
3044.5E79210091n87654L37142o2255q07267p87582l65334j37558o14318o26984l19786
$$ 579210091 578622437 578959579 578897324 578090057 577302475 576937141 576799583 576185265 575558281 575238495
3054.2E75238495m99306k94990k06490l65868n61523r90028n78003m24614m04282l8910
$$ 575238495 574739189 574444199 574237709 573871841 573310318 572320290 571742287 571317673 570913391 570874481
3063.8E70874481o48422l31650K6589o43387o89011p00760m19197k28004j95847k41890
$$ 570874481 570226059 569894409 569920998 569277611 568588600 567887840 567468643 567240639 567044792 566802902
3073.5E66802902o89583k28843N9280l82004l85780l85895n09872n77851n54962l38936
$$ 566802902 566113319 565884476 565943756 565561752 565175972 564790077 564280205 563702354 563147392 562808456
3083.1E62808456n88951o30645p6485l51906m46091k32086o44455n64575l06129k87400
$$ 562808456 562219505 561588860 561512375 561160469 560714378 560482292 559837837 559273262 558967133 558679733
3092.7E58679733l36036n06440o84967m96902p248j27907l54767m56085q93173r08127
$$ 558679733 558343697 557837257 557152290 556655388 556648140 556520233 556165466 555709381 554816208 553908081
3102.4E53908081l39394l36113p01675n54352k81219k37580m41398n09606n95932n19104
$$ 553908081 553568687 553232574 552530899 551976547 551695328 551457748 551016350 550506744 549910812 549391708
3112E49391708l22189m81567k99836n21431p14035l72352l94783o80657q89511k76298
$$ 549391708 549069519 548587952 548288116 547766685 547052650 546680298 546285515 545604858 544715347 544439049
3121.7E44439049l79982r31206o26640p99370p20940m49409m33808l13034n04379p69920
$$ 544439049 544059067 543127861 542501221 541701851 540980911 540531502 540097694 539784660 539280281 538510361
3131.3E38510361m91791m28886p01523l59268n40085o24352o79664q99086k94953q16154
$$ 538510361 538018570 537589684 536888161 536528893 535988808 535364456 534684792 533785706 533490753 532674599
3141E32674599j097374n18112n77584n98831n51147k02637n35355q88176m54025n72853
$$ 532674599 531577225 531059113 530481529 529882698 529331551 529128914 528593559 527705383 527251358 526678505
3150.6E26678505n92880m19884q46901j142540l89786j0490n51186q09555q57734p56417
$$ 526678505 526085625 525665741 524818840 523676300 523286514 523276024 522724838 521915283 521057549 520301132
3160.3E20301132q73947m97665k44484j167832q90312k25029o52885j054802j113129
$$ 520301132 519427185 518929520 518685036 517517204 516626892 516401863 515748978 514694176 513581047
3168.9E13581047o95381o05087m47655k31896m81376k49901o46896r54399o96564j260567
$$ 513581047 512885666 512280579 511832924 511601028 511119652 510869751 510222855 509268456 508571892 507311325
3178.6E07311325q82606r1935l42445p16820p78312o43654l41912k92587q57544r28268
$$ 507311325 506428719 506336784 505994339 505277519 504499207 503855553 503513641 503221054 502363510 501435242
3188.2E01435242o79779p46727m45023j36642m12903o84357o53801r16519p58095q71963
$$ 501435242 500755463 500008736 499563713 499427071 499014168 498329811 497676010 496759491 496001396 495129433
3197.9D95129433j223450o11458p92885n05142K70653m53186q58040l96271o77452
$$ 495129433 493905983 493294525 492501640 491996498 492267151 491813965 490955925 490559654 489882202
3206.5D89882202j198845k28691k3727j071129q82111l97567j42479n74875r10721
$$ 489882202 488683357 488454666 488430939 487359810 486477699 486080132 485937653 485362778 484452057
3215.2D84452057n14336p77397p30324j93710m94385j098633q72917m81758m21905
$$ 484452057 483937721 483160324 482430000 482236290 481741905 480643272 479770355 479288597 478866692
3223.9D78866692m19197n58777n82085m22974k72674k68707l13454m54559n18723o63795
$$ 478866692 478447495 477888718 477306633 476883659 476610985 476342278 476028824 475574265 475055542 474391747
3233.5D74391747p69082k84080k87781q87833j067810o75544m22249j58310N0659p87353
$$ 474391747 473622665 473338585 473050804 472162971 471095161 470419617 469997368 469839058 469889717 469102364
3243.2D69102364o86837k24380p34749n05676p18193j034394m97436l75633m42086
$$ 469102364 468415527 468191147 467456398 466950722 466232529 465198135 464700699 464325066 463882980
3251.9D63882980k72636j01547j52016n26199o35147q07763r48677j76620j16158o20956
$$ 463882980 463610344 463508797 463356781 462830582 462195435 461387672 460438995 460262375 460146217 459525261
3261.5D59525261m99725q34008o83479K0065k73285o81152l22227j69564j26190l35655
$$ 459525261 459025536 458191528 457508049 457528114 457254829 456573677 456251450 456081886 455955696 455620041
3271.2D55620041p74689n14984q82950o58302N7144o54907o98586k82554k88048k76604
$$ 455620041 454845352 454330368 453447418 452789116 452846260 452191353 451492767 451210213 450922165 450645561
3280.8D50645561k80037m14085l46718K0294n69992r71985l51791r9907l52592p1793
$$ 450645561 450365524 449951439 449604721 449625015 449055023 448083038 447731247 447631340 447278748 447206955
3290.4D47206955j08376r50813p74536l76244k899M1199p35550p49397n45845n80979
$$ 447206955 447098579 446147766 445373230 444996986 444994087 445035286 444299736 443550339 443004494 442423515
3300.1D42423515o81266k95525o7673l31764L7384l06435m74281k86522n86548l69682
$$ 442423515 441742249 441446724 441379051 441047287 441084671 440778236 440303955 440017433 439430885 439061203
3309.7D39061203n94597n81283n14374j009484o78024j68381J59913j42403r04350
$$ 439061203 438466606 437885323 437370949 436361465 435683441 435515060 435674973 435532570 434628220
3318.4D34628220q64029m74930l39470q13408o25534j58577q48198o96030m65889o82601
$$ 434628220 433764191 433289261 432949791 432136383 431510849 431352272 430504074 429808044 429342155 428659554
3328.1D28659554m67377n23949m79622p60841n17655m11911o06422K25906k32162q23975
$$ 428659554 428192177 427668228 427188606 426427765 425910110 425498199 424891777 425117683 424885521 424061546
3337.7D24061546n14602n86052o35910o87142o16150q43811o20231l92304p07931o02188
$$ 424061546 423546944 422960892 422324982 421637840 421021690 420177879 419557648 419165344 418457413 417855225
3347.3D17855225p30210n31082l56560m68826k97279q00095j133232r92699q55064
$$ 417855225 417125015 416593933 416237373 415768547 415471268 414671173 413537941 412545242 411690178
3356D11690178m80919m23508l76854l17840l66860l91197o01501j80550k35290r94301
$$ 411690178 411209259 410785751 410408897 410091057 409724197 409333000 408731499 408550949 408315659 407321358
3365.7D07321358q00438o01158m96331n08117o21567m02756o13289n30166l32871p08961
$$ 407321358 406520920 405919762 405423431 404915314 404293747 403890991 403277702 402747536 402414665 401705704
3375.3D01705704p44210m14009k52952j62010k93580n96199p27386o57806j52741m94652
$$ 401705704 400961494 400547485 400294533 400132523 399838943 399242744 398515358 397857552 397704811 397210159
3384.9C97210159q69445j16730m45290m37965K24457j15815j79634m89998r68399n58014
$$ 397210159 396340714 396223984 395778694 395340729 395565186 395449371 395269737 394779739 393811340 393253326
3394.6C93253326j21574p7553o18362j10245M77066m36172k66571j77880n81360j73187
$$ 393253326 393131752 393054199 392435837 392325592 392802658 392366486 392099915 391922035 391340675 391167488
3404.2C91167488n02472o92177n40886L29018N73158p35130r48868n16090J10779j28518
$$ 391167488 390665016 389972839 389431953 389760971 390334129 389598999 388650131 388134041 388244820 388116302
3413.9C88116302o30760j70746J1826L42903M10347J27907o93283p86095K42806J72157
$$ 388116302 387485542 387314796 387326622 387669525 388079872 388207779 387514496 386728401 386971207 387143364
3423.5C87143364k11372q9798M31671K40631m02107j34964L42674j51711l54004L54233
$$ 387143364 386931992 386842194 387273865 387514496 387112389 386977425 387320099 387168388 386814384 387168617
3433.2C87168617j34964m539M76227J74598K17896n7259j51520R6589R16442L25318
$$ 387168617 387033653 387029114 387505341 387679939 387897835 387840576 387689056 387785645 388702087 389027405
3442.8C89027405n77469Q8501K65579M35677l53089P0496O20346K07710Q59299K40822
$$ 389027405 388449936 388538437 388804016 389239693 388886604 388957100 389577446 389785156 390644455 390885277
3452.5C90885277k32544M76150N07889J71051L72696L78380K04544O50482O18935Q04634
$$ 390885277 390652733 391128883 391636772 391807823 392180519 392558899 392763443 393413925 394032860 394837494
3462.1C94837494K72369l85780N5427N71900P43828o5270N17540J007576N6839k6092
$$ 394837494 395109863 394724083 394779510 395351410 396095238 396029968 396547508 397555084 397611923 397585831
3471.7C97585831P76252J041718L31650M11262N37987L33633J55602J27029N96543
$$ 397585831 398362083 399403801 399735451 400146713 400684700 401018333 401173935 401300964 401897507
3480.4D01897507J031418Q84208m539O75926O63643L08494J278191M24919m69932R5787
$$ 401897507 402928925 403813133 403808594 404484520 405148163 405456657 406734848 407159767 406689835 406785622
3490.1D06785622P61184O55823N38902N92194K88048J098022J096611J65291O0272
$$ 406785622 407546806 408202629 408741531 409333725 409621773 410719795 411816406 411981697 412041969
3498.7D12041969L11585N82580J268387J452980L84674J43471J52779P11822R15604
$$ 412041969 412353554 412936134 414204521 415657501 416042175 416185646 416338425 417050247 417965851
3507.4D17965851P34787N92880k89993O40983J415482Q23593m0283J73759R04579R33838
$$ 417965851 418700638 419293518 419003525 419644508 421059990 421883583 421843300 422017059 422921638 423855476
3517.1D23855476R43032O41746N22461J57929R21211J380424K4109J05477Q11691J553535
$$ 423855476 424798508 425440254 425962715 426120644 427041855 428422279 428446388 428551865 429363556 430917091
3526.7D30917091O27861o6223M12178J308441J197663R8610J001358P29980J313629
$$ 430917091 431544952 431478729 431890907 433199348 434397011 434495621 435496979 436226959 437540588
3535.4D37540588J266861k14233P26776Q93135J218949L57208J000557J299781L90244
$$ 437540588 438807449 438593216 439319992 440213127 441432076 441789284 442789841 444089622 444479866
3544.1D44479866J223145L25241J188774l853M27093J303406J055908K429161j80053
$$ 444479866 445703011 446028252 447217026 447213173 447640266 448943672 449999580 452428741 452248688
3552.7D52248688K69432J041031J293144J875267J19324J157379J073341M72756J05819
$$ 452248688 452518120 453559151 454852295 456727562 456846886 458004265 459077606 459550362 459656181
3561.4D59656181J293679J259117K76756L645897J096916J80893O67725j091652K900734
$$ 459656181 460949860 462208977 462485733 466131630 467228546 467409439 468077164 466985512 469886246
3570.1D69886246J513900Q61016J272011P99560O95343J065865J827049N56259J706658
$$ 469886246 471400146 472261162 473533173 474332733 475028076 476093941 477920990 478477249 480183907
3578.8D80183907J580047N38674J118965J221046R74465p3548L293877L893051J78490
$$ 480183907 481763954 482302628 483421593 484642639 485617104 485543556 488837433 492730484 492908974
3587.5D92908974J222076j458092J118355K288971K454376J593972l5439K800140j03797
$$ 492908974 494131050 492672958 493791313 496080284 498534660 500128632 500093193 502893333 502789536
3596.1E02789536P02514K779846O80962K414322J029053J25770J886482J771698J442604
$$ 502789536 503492050 506271896 506952858 509367180 510396233 510522003 512408485 514180183 515622787
3604.8E15622787K009736L082122J6938K430229O86378j950340N923195L340454j582413
$$ 515622787 517632523 520714645 520731583 523161812 523848190 521897850 527821045 531161499 529579086
3613.5E29579086L943978j074143J352234M237976J194496J645317o37970K24877K978821
$$ 529579086 533523064 532448921 533801155 538039131 539233627 540878944 540240974 540465851 543444672
3622.2E43444672K337570J497764K135659K051429J899414O658631N268936r495773
$$ 543444672 545782242 547280006 549415665 551467094 553366508 560025139 565294075 555798302
3629.9E55798302J075020K861518M647332L518791m58565J425057K985458K812920
$$ 555798302 556873322 559734840 564382172 567900963 567442398 568867455 571852913 574665833
3637.6E74665833P45010J284332J747093K483254K481003J38664J781502L111457M920388
$$ 574665833 575410843 576695175 578442268 580925522 583406525 583545189 585326691 588438148 593358536
3646.3E93358536Q30345k440224N988236J885605j299782k344628L322678L766594
$$ 593358536 594188881 591748657 597736893 599622498 598322716 595978088 599300766 603067360
3654F03067360L254700O266517n108032n16128M232521J855659J540299N60150K234726
$$ 603067360 606322060 612588577 607480545 606964417 611196938 613052597 614592896 615153046 617387772
3662.7F17387772J014251J173630J634483j80358L207092L373756P36656M47503m851418
$$ 617387772 618402023 619575653 621210136 621029778 624236870 627610626 628347282 628794785 623943367
3671.4F23943367J095695O056061P941284L846970j1826515j010552M583168M028092
$$ 623943367 625039062 631095123 639036407 642883377 631056862 630046310 634629478 638657570
3679.1F38657570j298866l87116K086258J513977J160736N9586L17993L986893N997467
$$ 638657570 637358704 636971588 639057846 640571823 641732559 641792145 642110138 646097031 652094498
3687.8F52094498o684723l929901Q246154l597412l003158L716812O36063J154327
$$ 652094498 645409775 641479874 649726028 646128616 643125458 646842270 647478333 648632660
3695.5F48632660K11029j160049O85043L05481J768417L182602k579117k888107L071671
$$ 648632660 648843689 647683640 648368683 648674164 650442581 653625183 651046066 648157959 651229630
3704.1F51229630J804122J09101K82516J815186M218445m318619K156296N610504j0318527
$$ 651229630 653033752 653142853 653425369 655240555 659459000 655140381 657296677 662907181 652588654
3712.8F52588654K015380L533326P69348j09024R54284K048417k390213J3732N875855
$$ 652588654 654604034 658137360 658906708 658797684 659751968 661800385 659410172 659423904 665299759
3721.5F65299759j381073o359329L335876J894837J073303j781006k076111K339859
$$ 665299759 663918686 657559357 660895233 662790070 663863373 662082367 660006256 662346115
3729.2F62346115P37457N146866l05328q404160O789017L276901p061691q26569K730027
$$ 662346115 663083572 668230438 667925110 659520950 666309967 669586868 662525177 661698608 664428635
3737.9F64428635J06048J61667K318726l304520J320648J0601197l151169j7800675
$$ 664428635 664534683 664696350 667015076 663710556 665031204 675632401 672481232 654680557
3745.6F54680557O995545L725052L216018k044296q760071J0604019l06701p434998
$$ 654680557 661676102 665401154 668617172 666572876 657812805 668416824 668110123 660675125
3753.3F60675125L520432L418655L607101m485626M71497O258392m646072l523712
$$ 660675125 664195557 667614212 671221313 666735687 667207184 673465576 668819504 665295792
3761F65295792J983490M44183J21002L597641r00192m561768J642609M455872K799148
$$ 665295792 667279282 667723465 667844467 671442108 670541916 665980148 667622757 672078629 674877777
3769.7F74877777p094879p08084K059173K26822L76435m54865K02561R8266K511978
$$ 674877777 667782898 667074814 669133987 669360809 669737244 669282379 669484940 669583206 672095184
3778.4F72095184J908188n862808J23062J369019N75409K045898j926270j490631J137238
$$ 672095184 674003372 668140564 668263626 669632645 670208054 672253952 670327682 668837051 669974289
3787.1F69974289M79507N09339r1858J16043r8267j21383n78003M15497M046783j489029
$$ 669974289 670453796 670963135 670871277 670987320 670889053 670767670 670189667 670605164 674651947 673162918
3796.7F73162918n281677N85480L043823N860596k334443q853378Q91571J074600L361664
$$ 673162918 667881241 668466721 671510544 677371140 675036697 666183319 667074890 668149490 671511154
3805.4F71511154N823288m962692n515518K908096J316681O2485M26559m34494N35584
$$ 671511154 677334442 672371750 666856232 669764328 671081009 671143494 671570053 671135559 671671143
3814.1F71671143M640884J691895j2069626K186966M246139M242401O331711j3724670
$$ 671671143 676312027 678003922 665934296 668121262 672367401 676609802 682941513 669216843
3821.8F69216843k297364K954178J150971K205810Q74176l131103r40933J041259K948075
$$ 669216843 666919479 669873657 671024628 673230438 674104614 670973511 670032578 671073837 674021912
3830.5F74021912K626114p803650O07833O206284n274353k186661O990204l447113
$$ 674021912 676648026 668844376 669452209 675658493 670384140 668197479 675187683 671740570
3838.2F71740570l778458P738038m165192l575745N455475q36563l758621J668014
$$ 671740570 667962112 675700150 671534958 667959213 673414688 672578125 668819504 670487518
3845.9F70487518J091156j43280J229248r61380Q63724N739975m047623L271332j0525131
$$ 670487518 671578674 671435394 672664642 671703262 672566986 678306961 674259338 677530670 667005539
3854.6F67005539l637543Q946991j72806l123321R83047J643525K388839m024276p56226
$$ 667005539 663367996 672314987 672142181 669018860 670001907 671645432 674034271 670009995 669253769
3863.3F69253769N812454l363495o365738K357102M909134P372513l228684j0597076
$$ 669253769 675066223 671702728 665336990 667694092 672603226 679975739 676747055 666149979
3871F66149979R06601M768295N593872q287048j964722K884445m08172J184234L678589
$$ 666149979 667056580 671824875 677418747 669131699 667166977 670051422 669643250 670827484 674506073
3879.7F74506073j891861o839066L227692J374359J502228O866837r981461k287292
$$ 674506073 672614212 665775146 669002838 670377197 671879425 678746262 668764801 666477509
3887.4F66477509K795562K84577M332199K406616p796478j01395L251495k137756j34735
$$ 666477509 669273071 669557648 673889847 676296463 668499985 668398590 671650085 669512329 669377594
3896.1F69377594R29947J663284K602463p637482L868103K479325o079483N065918
$$ 669377594 670307541 671970825 674573288 666935806 670803909 673283234 667203751 672269669
3903.8F72269669m04587k503739m61654m57764J882324L81165l10669n40543o41327
$$ 672269669 671865082 669361343 668899689 668441925 670324249 670705414 670394745 669854202 669212875
3912.5F69212875l90243m74014J133956L327942j430587m441986K733459Q47626l125000
$$ 669212875 668822632 668348618 669482574 672810516 671379929 666937943 669671402 670519028 667394028
3921.1F67394028J001129J338348K180023k90527l763657k20413J093140J501312o91986
$$ 667394028 668395157 669733505 671913528 671623001 667859344 667638931 668732071 670233383 669541397
3929.8F69541397o14242K767410j889572l021851J079102N72967K93045O66504j50604
$$ 669541397 668927155 671694565 669804993 666783142 667862244 668435211 668728256 669394760 669244156
3938.5F69244156q45719r65194J402664K165375l290634j606980O59256P25861K634735
$$ 669244156 668398437 667433243 668835907 671001282 667710648 666103668 666762924 667488785 670123520
3947.2F70123520o29578K07825O81229k935563L58963L92304q240O88782p19833p28989
$$ 670123520 669493942 669701767 670382996 667447433 667806396 668198700 668190460 668879242 668159409 667430420
3956.8F67430420j23901N48400k21328O8206O01273l16009j36414K3499J79595K85111
$$ 667430420 667306519 667854919 667633591 667701797 668303070 667987061 667850647 667874146 668053741 668338852
3966.5F68338852J06659j08795m15650n83038L65372L67050n16663O7139K42691J62048
$$ 668338852 668445511 668336716 667921066 667338028 667703400 668070450 667553787 667620926 667863617 668025665
3976.1F68025665p39441m14352Q53348K67257k46429j03149K94418J14822J80741o17905
$$ 668025665 667286224 666871872 667725220 667992477 667746048 667642899 667937317 668052139 668232880 667614975
3985.7F67614975o63681O90155K67563L24097n60303n93262L53928L97033P63703j007157
$$ 667614975 666951294 667641449 667909012 668233109 667672806 667079544 667433472 667830505 668594208 667587051
3995.4F67587051p06253O15921j8768K5024J94169
$$ 667587051 666880798 667496719 667477951 667502975 667697144
4000.2F67697144
$$ 667697144
##END=$$ End of the data block
