##TITLE=$$ Begin of the data block
##JCAMP-DX=5.00 $$ ACD/SpecManager v 10.08
##SPECTROMETER/DATA SYSTEM=Varian
##DATE=18 Dec 2012 14:24:12
##DATA TYPE=INFRARED SPECTRUM
##DATA CLASS=XYDATA
##ORIGIN=
##OWNER=
##NPOINTS=3735
##FIRSTX=399.26403809
##LASTX=4000.35498047
##MAXX=4000.35498047
##MINX=399.26403809
##MAXY=74.25273895
##MINY=16.35860634
##XFACTOR=1.0000000000
##YFACTOR=0.000000100000000
##FIRSTY=61.27105331
##DELTAX=0.96440572
##XUNITS=1/CM
##YUNITS=TRANSMITTANCE
##XYDATA=(X++(Y..Y))
399.3F12710533o832275n054207l01628L870353m442977q885155k467728q228416o70967
407.9E79697533J1190452K511597j708336J781960j245308n986824j250725j364441
415.7E83625908n012665j748123K14500Q717881L333015j082878k111015p072182l972969
424.3E74891472J381035P307090N068627j255798l686257K383042P013435k287789
432.1E90814857o365051l467445k767830j492500Q13026J426582N77317N87692J103897
440.7E81230545K435074r01032l116226L97339j353531j062050J125985J485252N107231
449.4E85348587K858505k358322q029976p562904J560058J545868K208023L18108r667969
458.1E66219978L82119M343833L753205L524132k401009p246323J83678K355652J292534
$$ y = [612710533, 605878258, 600824051, 600522423, 604392776, 599949799, 591064644, 588596916, 580368500, 579697533, 590887985, 593399582, 591691246, 593473206, 592227898, 586241074, 584990349, 583625908, 578613243, 576865120, 577079620, 585797501, 589130516, 588047638, 585936623, 578864441, 574891472, 576272507, 583579597, 588648224, 587392426, 583706169, 586089211, 593102646, 590814857, 584449806, 580982361, 578214531, 576722031, 577535057, 578961639, 579538956, 580126648, 581230545, 583665619, 582764587, 579648361, 580045700, 578692169, 577630119, 578756104, 580241356, 585348587, 588207092, 585848770, 577818794, 570255890, 571815948, 573361816, 575569839, 575887947, 566219978, 566602097, 570945930, 574699135, 578223267, 575822258, 568575935, 568759613, 571115265, 572407799]
466.8E72407799K407303o878930j128883M416046k53410k15759l878289q93592J823539
475.5E67805824j185379m65584M009934P58820j436234M46587l744164k240257K725906
484.1E66675453M590683K344208n36423L13187J704216J219101o500015o327744L232536
492.8E66715202K859192K785683J702843k371674m577064j294137J848221K606964
500.5E70275230K626152o00166j76163k940445l382072K138519o60896l482780K50549
509.2E64047928J130752k519645r32350P53822k645912q14133L536835P68623m973373
517.9E58352547l709030k766266M29878K862320J591606p1945j450005q54530l25279
526.6E54059296l52288l32145P95059P80067k202415l200073J06010L143387O32439
$$ y = [572407799, 574815102, 567936172, 566807289, 571223335, 570969925, 570754166, 566875877, 565982285, 567805824, 566620445, 566154861, 570164795, 570923615, 569487381, 569933968, 566189804, 563949547, 566675453, 571266136, 573610344, 573073921, 573387108, 575091324, 576310425, 569810410, 563482666, 566715202, 569574394, 572360077, 574062920, 571691246, 567114182, 565820045, 567668266, 570275230, 572901382, 572301216, 572125053, 569184608, 565802536, 567941055, 567280159, 563797379, 564047928, 565178680, 562659035, 561726685, 562480507, 559834595, 559020462, 562557297, 563325920, 558352547, 554643517, 551877251, 552307129, 555169449, 556761055, 556689110, 555239105, 554384575, 554059296, 553707008, 553374863, 554169922, 554949989, 552747574, 549547501, 549653511, 552796898, 553429337]
535.2E53429337J294517J453857k023239j408310n83572j15395j31454R88007J075134
543.9E53978882k36092k40593m69360L39508k31590J587219J888733j79711L24440
552.6E56761436l3988J05972q86765m88052L25928K69546p87468j394424Q31947j137962
562.3E53566170j258164M77410K275734K400703j539078p02438l34892m13132n31654
570.9E53940659q41485N78232m04663M45595J89934n28145n19562r95674L74489K28805
580.6E52468185n17120l50037O41518N09720j149139j891671N35164K576180O87141
589.3E53509941k23846j147080n93109J225014Q33473o62155j735191q44155j337700
597.9E49025192j150551j457519k086144j195221j497154k379265m834747m817734
$$ y = [553429337, 554723854, 556177711, 554154472, 552746162, 552162590, 552047195, 551915741, 552903748, 553978882, 553742790, 553502197, 553032837, 553372345, 553140755, 554727974, 556616707, 556436996, 556761436, 556727448, 556833420, 555946655, 555458603, 555784531, 556054077, 555266609, 553872185, 554704132, 553566170, 552308006, 552785416, 555061150, 557461853, 555922775, 555220337, 554885445, 554472313, 553940659, 553099174, 553677406, 553272743, 553718338, 553908272, 553380127, 552860565, 551864891, 552239380, 552468185, 551951065, 551601028, 552242546, 552752266, 551603127, 549711456, 550246620, 552822800, 553509941, 553286095, 552139015, 551545906, 552770920, 553604393, 552942238, 551207047, 550362892, 549025192, 547874641, 546417122, 544330978, 543135757, 541638603, 539259338, 534424591, 529606857]
605.6E29606857m665870n964547p200203r435539j1156921j3510513j2443505j2698555
613.4D52531204j0189934n717048k734528Q97141j294785k144089m948463q356705
621.1D18042793j0691681j1375389o540680k053642N292625J2339898J7572059J6977577
628.8D39563560J5375329J1991386O570854K372780k278290m314499q080291p084961
636.5D54115868n338021m868812r56192L252601J1468087J5125694J6979523J6222610
644.2E06001358J4746857J3157310R382858P589837O337814M180984K619210K616844
651.9E66633072J612472Q93517K127800J304932m75350k86217J514092K865448J693001
660.6E77882767N03196J027298J44310o11419J216278K113457Q12683n817871K897071
$$ y = [529606857, 524940987, 518976440, 511776237, 502340698, 491183777, 477673264, 465229759, 452531204, 442341270, 436624222, 433889694, 434786835, 433492050, 431347961, 426399498, 418042793, 407351112, 395975723, 389435043, 387381401, 392674026, 405013924, 422585983, 439563560, 454938889, 466930275, 473501129, 475873909, 473595619, 469281120, 461200829, 454115868, 448777847, 443909035, 442952843, 446205444, 457673531, 472799225, 489778748, 506001358, 520748215, 533905525, 543288383, 550878220, 557216034, 561397018, 564016228, 566633072, 568245544, 569139061, 571266861, 572571793, 572096443, 571810226, 573324318, 576189766, 577882767, 578385963, 579413261, 579557571, 578946152, 580162430, 582275887, 583088570, 577270699, 580167770]
669.3E80167770M262848R55582M32396P44285l6201M8370K31057N01403J061097J200218
678.9E89568825l54309M75921J563645q00286p77778J16729j019020j034965K90146
687.6E88028908O79359k50702j277122p43027M3030j429329j584663o46286j149979
696.3E81670189r77478K7733L21808q5221J39084p31430j084633O24657Q56361k03628
705.9E80557442j55487J096840J548728J288453J031265J764641J949043J98975M4097
714.6E89323997Q66318J313439J380920J747971K091484J202545Q72345N78651J182595
723.3F00560265Q44688r27048J5374L85932K6207K1973m81720k26707o65474j261635
733E98291855r76639m45366l50189J94244N48096O62231J250306l52860j719818m32053
$$ y = [580167770, 584430618, 585386200, 585818596, 586562881, 586526680, 586575050, 586806107, 587307510, 588368607, 589568825, 589214516, 589690437, 591254082, 590453796, 589676018, 589792747, 588773727, 587738762, 588028908, 588708267, 588457565, 587180443, 586437416, 586480446, 585051117, 583466454, 582820168, 581670189, 580692711, 580720444, 581042252, 580957031, 581096115, 580364685, 579280052, 579904709, 580761070, 580557442, 580401955, 581498795, 583047523, 584335976, 585367241, 587131882, 589080925, 589279900, 589323997, 590190315, 591503754, 592884674, 594632645, 596724129, 597926674, 598799019, 599377670, 600560265, 601404953, 600477905, 600493279, 600879211, 600905418, 600927391, 600445671, 600218964, 599553490, 598291855, 597315216, 596869850, 596519661, 596713905, 597262001, 597924232, 599174538, 598821678, 597101860, 596669807]
742.6E96669807J080475R65500M46320J367531J754379K022095K489318K317620K091903
751.3F11204948J066666J105843K145118K665940K508049J273498J141510J388283
759F24499855R08394Q30154N53704j50605M87214J447029R90257K49367q06504m76074
768.6F28532791n25093j252785N43709N47104m39491Q94584J473694J565361K333222
777.3F33673096K463989J737595J030998K87094J32027J546783K915649J911469N14831
786F46213531R47342J206971O71005N93109J162338M74930m39682k90298m7760J18332
795.6F50609818l45612N26047J493301Q27484l33252j206970n01175M37622M71039
804.3F51978302N61829J148071L12881l28521N15899J030503J086273n79758j081161
$$ y = [596669807, 597750282, 598715782, 599162102, 600529633, 602284012, 604306107, 606795425, 609113045, 611204948, 612271614, 613377457, 615522575, 618188515, 620696564, 621970062, 623111572, 624499855, 625408249, 626238403, 626792107, 626641502, 627128716, 628575745, 629566002, 629815369, 629008865, 628532791, 628007698, 626754913, 627298622, 627845726, 627406235, 628300819, 629774513, 631339874, 633673096, 636137085, 637874680, 638905678, 639192772, 639324799, 640871582, 643787231, 645698700, 646213531, 647160873, 648367844, 649038849, 649631958, 650794296, 651269226, 650829544, 650539246, 650491486, 650609818, 650264206, 650790253, 652283554, 653111038, 652777786, 651570816, 651069641, 651507263, 651978302, 652540131, 653688202, 654001083, 653672562, 654188461, 655218964, 656305237, 655725479, 654644318]
813F54644318P1640k92969p37763J419449K676239M45099j91727p29675q66852L4333
822.6F56472092l17993J94320p81250j794128o46591J77002r89762j956863j853867
831.3F48502960k448120k810821l646241k791786j701774k499047k889519k677803
839F27037849k292556k549248k854424k486915j303902j058082j160775r20334k37197
847.7F12174416R07974L19328N55115J553688J905365K191467K157440K723427K160835
856.4F26649055J952019L087883K692681J503295J240921J411706J212005K081566
864.1F41831131J652069O43692J258850J281433J008911L36838O11954M91943r9640
872.8F49017181N98679P79114N80368O65130M07105l48740j86157j510239k378234
$$ y = [654644318, 654715958, 654422989, 653685226, 655104675, 657780914, 658226013, 658034286, 657304611, 656437759, 656472092, 656154099, 656348419, 655567169, 653773041, 653126450, 653303452, 652313690, 650356827, 648502960, 646054840, 643244019, 639597778, 636805992, 635104218, 632605171, 629715652, 627037849, 624745293, 622196045, 619341621, 616854706, 615550804, 614492722, 613331947, 612411613, 612174416, 613082390, 613401718, 613956833, 615510521, 617415886, 619607353, 621764793, 624488220, 626649055, 628601074, 631688957, 634381638, 635884933, 637125854, 638537560, 639749565, 641831131, 643483200, 644126892, 645385742, 646667175, 647676086, 648012924, 648624878, 649116821, 649017181, 649615860, 650394974, 650975342, 651640472, 652047577, 651698837, 651512680, 650002441, 647624207]
881.5F47624207j895752j955948r65958j470413j350556j248245q35190n70106j494751
890.2F35837288J17645k03438n93452J27144N75256J246376K76108L72963J9302J11199
899.8F37886391K05497j099472p47223k37922l52097n79185p78809j782379k254143
908.5F30260658k115364k153625j942215k401924k611351k511521j743049j429291
916.2F13352318k101708k525596k612152k398491j870804k024269k934685j953621
923.9E94930992j173439j318664j157151j038818q10700r41925j91993k41013m96254
932.6E87561035N64690J426506J789436J406593K179261K282943J415749K534599K862893
941.3F04023705K583427K512093K356185K482758K090263K233696K130356J130219
$$ y = [647624207, 645728455, 643772507, 642806549, 641336136, 639985580, 638737335, 637902145, 637332039, 635837288, 635954933, 635751495, 635158043, 635285187, 635860443, 637106819, 637382927, 637755890, 637775192, 637886391, 638091888, 636992416, 636245193, 636007271, 635655174, 635075989, 634297180, 632514801, 630260658, 628145294, 625991669, 624049454, 621647530, 619036179, 616524658, 614781609, 613352318, 611250610, 608725014, 606112862, 603714371, 601843567, 599819298, 596884613, 594930992, 593757553, 592438889, 591281738, 590242920, 589432220, 588490295, 588298302, 588057289, 587561035, 588125725, 589552231, 591341667, 592748260, 594927521, 597210464, 598626213, 601160812, 604023705, 606607132, 609119225, 611475410, 613958168, 616048431, 618282127, 620412483, 621542702]
949F21542702J050033J758499P72171J97144L57018m08059k36625o73218j159477r68285
958.6F22231903j200371j865234k135468k100486k797661k756920k152100j745071
966.3F05478592k008705k122002j748276j306457q47168j146469j002541q61778j106987
975E93328209j211433j221695q50831j112213j407432j398316j639175j340714j141510
983.7E82004890j851730k413597k697296k554321k805710l723831m057427m832725
991.4E57068253n625153q260040j2921906j7041626j3931846J262741J3635597J4481087
999.1E28667107Q564682L980026K288322R10912L67241n32303r88846m78058p33261
1007.8E42045822j564979j305428n32341j573601k171173j401558j066246j619530
$$ y = [621542702, 622592735, 624351234, 625123405, 625320549, 625677567, 625269508, 625032883, 624359665, 623200188, 622231903, 621031532, 619166298, 617030830, 614930344, 612132683, 609375763, 607223663, 605478592, 603469887, 601347885, 599599609, 598293152, 597445984, 596299515, 595296974, 594435196, 593328209, 592116776, 590895081, 590044250, 588932037, 587524605, 586126289, 584487114, 583146400, 582004890, 580153160, 577739563, 575042267, 572487946, 569682236, 565958405, 561900978, 557068253, 551443100, 543183060, 530261154, 513219528, 499287682, 500550423, 514186020, 528667107, 537231789, 541211815, 543500137, 544411049, 544778290, 544245987, 543257141, 542779083, 542045822, 540480843, 539175415, 538643074, 537069473, 534898300, 533496742, 532430496, 530810966]
1015.5E30810966j224403j021347k079163k032318j640625j462249k304154k101402
1023.2E16945305j194306j556053j362304j413002j972466k391319j506996j794396
1031E03754463k390938j838531j694832j092148j707001j885986j734199n22499j72310
1039.6D90716019j184082k74239p48558j021347r76372o39000k05497M62417K69737
1048.3D86399078p70797R53979J047897R54209R3117N5160J374817K83890n2834q26034
1058D89512482L7880l6507q08792o25801j442528m47578K76680Q67614o06651j614876
1067.6D85111923j423454j187248m84505j654434j381455k054939j434593j635857
1075.3D73855438k714691q17604j491737j973381j684113j065025j827545j952553
$$ y = [530810966, 529586563, 528565216, 526486053, 524453735, 522813110, 521350861, 519046707, 516945305, 515750999, 514194946, 512832642, 511419640, 509447174, 507055855, 505548859, 503754463, 501363525, 499524994, 497830162, 496738014, 495031013, 493145027, 491410828, 490888329, 490716019, 489531937, 489257698, 488509140, 487487793, 486511421, 485872421, 485666924, 486129341, 486399078, 485628281, 486582260, 487630157, 488584366, 488677483, 488732643, 490107460, 490391350, 490338516, 489512482, 489550362, 489513855, 488705063, 488079262, 486636734, 486189156, 486465836, 487333450, 486726799, 485111923, 483688469, 482501221, 482016716, 480362282, 478980827, 476925888, 475491295, 473855438, 471140747, 470323143, 468831406, 466858025, 465173912, 464108887, 462281342, 460328789]
1083D60328789j756897k370606j368065k761497l374558m610748m476242n118332o981315
1091.7D27510529o535149q777580q435707r949418j0712814j1108131j1391297r243393
1099.4C51357040j0979080j0137787j2324142j0834885r489383j0002213q937530j0924340
1107.1B67727680q374538r565792p397747p574463p265625m833317n375595j764565
1114.9B15576038l414001j067486r00459K69718O38905M45804L135739l60909K657833
1123.5B16981182J593495K359905J942367k26879J431999p72400J418438j142425o89545
1132.2B22896137k070942l715439k567157m222451j518096l915463j633148k475433
1139.9B00778008k670746j717835m255428k321758m977780k515316m080143l361530
$$ y = [460328789, 458571892, 456201286, 454833221, 452071724, 448697166, 444086418, 439610176, 434491844, 427510529, 420975380, 412197800, 403762093, 393812675, 383099861, 371991730, 360600433, 351357040, 340377960, 330240173, 317916031, 307081146, 297591763, 287589550, 278652020, 267727680, 259353142, 249787350, 242389603, 234815140, 227549515, 222716198, 217340603, 215576038, 212162037, 211094551, 210194092, 210463810, 211102715, 211548519, 214684258, 214323349, 216981182, 218574677, 220934582, 222876949, 222650070, 224082069, 223309669, 224728107, 223585682, 222896137, 220825195, 217109756, 214542599, 210320148, 208802052, 204886589, 203253441, 200778008, 198107262, 196389427, 192133999, 189812241, 184834461, 182319145, 178239002, 174877472]
1147.6A74877472k522450m024429o25248k619705J82724j345444l36857K06547L42846
1156.3A64135456K412777l72829K607059J085720L202324K322922K153930M616166
1164A82163525L036918N729904L832112O044655M970665N962295P410298N988788Q966541
1172.7B34105701O680851Q388043P568321Q117676Q820896P608299Q628922P539825
1180.4B97458534R261170P330589P589226P419510P288589P727814N686798O532898
1188.1C56295128M848900O032409O142769N733452N301704M388886O368484N537339
1195.9D00649071O308365N585670N603829N855255N444564O394577N123673N526733
1203.6D46491737N207367N078392M332009M232864N104103M134484L849792L273735
$$ y = [174877472, 172355022, 168330593, 167705345, 165085640, 165268364, 163922920, 163586063, 163792610, 164135456, 166548233, 166175404, 168782463, 169868183, 173070507, 175393429, 177547359, 182163525, 185200443, 190930347, 194762459, 200807114, 205777779, 211740074, 219150372, 225139160, 234105701, 240786552, 249174595, 256742916, 264860592, 273681488, 281289787, 289918709, 297458534, 306719704, 314050293, 321639519, 329059029, 336347618, 344075432, 349762230, 356295128, 361144028, 367176437, 373319206, 379052658, 384354362, 388743248, 395111732, 400649071, 406957436, 412543106, 418146935, 424002190, 429446754, 435841331, 440965004, 446491737, 451699104, 456777496, 461109505, 465342369, 470446472, 474580956, 478430748, 481704483]
1211.3D81704483M055901L251152K551384K780227K459488L033943J867524J822357
1219E03526459J830291J499901J179657R34296J155968L16848P95403P46422P09610
1227.7E12694855M70772L39813R15222P82967J192474Q15735J227112P55386N45463
1236.4E19739799Q99773K48718Q39730N18722R46923P43713M45671R57260N72014P73773
1246E26686096K72713K23541J9303L91311N90134L13148N98564M5891R97696R95789
1255.7E31134186M62303K80838K93617Q23937J10855N57747Q51478R23462Q33130O19202
1265.3E36890755N74226L39470J091042J035690R41429Q75092J349678J440353Q60405
1274E45398140J430397J364746J586418J843338J595001J290665J242256J357575J324920
$$ y = [481704483, 485760384, 489011536, 491562920, 494343147, 496802635, 499836578, 501704102, 503526459, 505356750, 506856651, 508036308, 508970604, 510126572, 510443420, 511238823, 511985245, 512694855, 513165627, 513505440, 514420662, 515203629, 516396103, 517211838, 518438950, 519194336, 519739799, 520639572, 520888290, 521728020, 522246742, 523193665, 523937378, 524383049, 525340309, 525912323, 526686096, 526958809, 527182350, 527201653, 527592964, 528183098, 528496246, 529094810, 529140701, 530138397, 531134186, 531596489, 531877327, 532170944, 532994881, 533105736, 533663483, 534514961, 535438423, 536271553, 536890755, 537464981, 537804451, 538895493, 539931183, 540872612, 541747704, 543097382, 544537735, 545398140, 546828537, 548193283, 549779701, 551623039, 553218040, 554508705, 555750961, 557108536, 558433456]
1282.7E58433456J359368J182785K040558K397804J603546Q24509R45396J593933J665192
1291.3E72046547J666984J443253J498146J406479J447601J561280J327285J135979
1299E83533554R65500J446075J086693P79495Q41866M63791P83462Q99735Q06999O91795
1308.7E92298965P44706J000671R07364N92194Q4114J58233O11153J125145J080704
1317.4E98603249l54996n70870R73282J269188J002388N42603K72789N65376M61845
1326F02764854Q01850R45282P61833N66788n1956r0142K7886j12114J3885R0676l50380
1336.7F05368462j44310L56216R995j57776J22986M64706M45251j60865n67627k96631
1346.3F05440407J08719K18239k10381n81589K8534j49383o68755m97513j63727j94892
$$ y = [558433456, 559792824, 560975609, 563016167, 565413971, 567017517, 567842026, 568787422, 570381355, 572046547, 573713531, 575156784, 576654930, 578061409, 579509010, 581070290, 582397575, 583533554, 584499054, 585945129, 587031822, 587811317, 588653183, 589116974, 589900436, 590800171, 591607170, 592298965, 593043671, 594044342, 594951706, 595543900, 595628014, 595786247, 596397400, 597522545, 598603249, 598248253, 597677383, 598650665, 599919853, 600922241, 601464844, 601737633, 602303009, 602764854, 603566704, 604511986, 605273819, 605840607, 605788651, 605698509, 605726395, 605614281, 605628166, 605718842, 605368462, 605224152, 605580368, 605590363, 605432587, 605555573, 606020279, 606465530, 606304665, 605737038, 605440407, 605549126, 605767365, 605556984, 604975395, 605003929, 604854546, 604185791, 603688278, 603524551, 603329659]
1355.9F03329659n10560l20434q1406M73404K09236l30352j12839j499748n41764j49765
1365.6F00465431q57048l02849k88276j120224j043244l92875m3793p00417j656494
1374.3E94060211p40509k17743m18129m70390m97704l12118k92893k94456n29862l64723
1383.9E89921684M38156J078759P85370o17447N38597J209449L60413j76697j62849
1392.6E93375435N89294m72259j641274M83933k21062q40759j311531r36547j82418
1401.3E88842812m20533m0550K60658j142044j191749J71356k70004p75338m03366
1409.9E85031242l75175n03197l05900J14212l58429l29285K31895k39868K83165j394272
1419.6E82154388k89764R86290L73230O40526n47257K72103J148796K62565P35054
$$ y = [603329659, 602819099, 602498665, 602417259, 602890663, 603099899, 602769547, 602656708, 601156960, 600615196, 600465431, 599608383, 599305534, 599017258, 597897034, 596853790, 596460915, 596417122, 595716705, 594060211, 593319702, 593101959, 592683830, 592213440, 591715736, 591403618, 591110725, 590816269, 590286407, 589921684, 590359840, 591438599, 592223969, 591606522, 592145119, 593354568, 593714981, 593538284, 593375435, 593964729, 593492470, 591851196, 592335129, 592114067, 591273308, 589961777, 589025230, 588842812, 588422279, 588381729, 588642387, 587500343, 586308594, 586479950, 586209946, 585434608, 585031242, 584656067, 584152870, 583846970, 583961182, 583602753, 583273468, 583505363, 583265495, 583548660, 582154388, 581864624, 582850914, 583224144, 583864670, 583317413, 583589516, 584738312, 585000877, 585735931]
1428.3E85735931O87714j14555L37944R28001O14624N93453J407547J285667j094627
1437E90381699L88908K127380Q80165L97759P02629n9509M92019P55806R29146J119385
1446.6E98115387Q61855j88523L56865J019936K49519K36778M62342J296081J597519
1455.3F04007759M28162j485215n67245K493553J029968J723290J275330O87370J820488
1464F11413460L16696N19676J298142J318626J028671R26323K156983J169357m04892
1472.6F19743042K425346L164406K415772M73251J452179K469826J472587R53636L98751
1481.3F34968796M14314J301193J467552J008797P36618r5062n03197J356964o17752
1490F40038223k676887J38321P54280J18828l2845N65682l566285O34156M68177k621688
$$ y = [585735931, 586423645, 586309090, 586647034, 587575035, 588189659, 588783112, 590190659, 591476326, 590381699, 590770607, 592897987, 593778152, 594175911, 594878540, 594819031, 595311050, 596066856, 596996002, 598115387, 598977242, 598788719, 599145584, 600165520, 600415039, 600651817, 601114159, 602410240, 604007759, 604435921, 602950706, 602383461, 604877014, 605906982, 607630272, 608905602, 609592972, 611413460, 611730156, 612249832, 613547974, 614866600, 615895271, 616821594, 618978577, 620147934, 619743042, 622168388, 625332794, 627748566, 628221817, 629673996, 632143822, 633616409, 634570045, 634968796, 635383110, 636684303, 638151855, 639160652, 639897270, 639802208, 639299011, 640655975, 640038223, 637361336, 637499657, 638253937, 638372765, 638339920, 638905602, 635339317, 635973473, 636441650, 633819962]
1499.6F33819962Q8996p33337j455269p80945Q91457L67241p462769o881180J481972
1508.3F19336128L132019o49719l36113j972389k609062L6697n51681l79143j488762
1517F14517975k248154O05927J630554j585884l983231J53275Q64067R71832k892380
1525.7F08033981R7809L92952j817207j012535l99208o0082l77464o3439l478736K23846
1535.3F01539917M4212l55491J618652l682022o328850K611389J633149j987801J309318
1544E96402473J597176j984444J355973J66588M60891j75743j555443J178322J146546
1552.7E98592339K381782j203918k47269K434807J912651j779518j5045662R962845
1560.4E97008057N003852K784691J204033N74265j39427j13755Q66585L43437P44858
$$ y = [633819962, 633908958, 633175621, 631720352, 630939407, 631830864, 632198105, 624735336, 617854156, 619336128, 622468147, 621818428, 621482315, 619509926, 616900864, 616937561, 616385880, 616006737, 614517975, 612269821, 612875748, 614506302, 612920418, 608937187, 609090462, 609954529, 610926361, 608033981, 608131790, 608524742, 606707535, 605695000, 605295792, 605235710, 604858246, 604794807, 601316071, 601539917, 601584129, 601228638, 602847290, 599165268, 592836418, 595447807, 597080956, 595093155, 596402473, 597999649, 596015205, 597371178, 597537766, 597998657, 597822914, 596267471, 597445793, 598592339, 600974121, 599770203, 599522934, 601957741, 603870392, 602090874, 587045212, 597008057, 602011909, 604796600, 606000633, 606574898, 606435471, 606321716, 607188301, 607531738, 608276596]
1569.1F08276596m117660N44052J600074j7471l9673j27105J094245n842933J3161
1577.7F01383286M79507j180458j099434j563911l67012j490860q75092j429901j990776
1586.4E91865349j730423k340584j246986k557106j741524k287941j533623j349869
1594.1E77077293k339210j788368l060227j407509k822723k123756k014275k178421
1601.9E59342804j218834l145218j489105k271271j912193l190308k236633j800842
1609.6E42078400l227730q66394k581101j462097k464409p67364j62506p546425O02875
1618.2E23603249j263047o35833k624436r41925m60281m059372n94330j592789M92249
1626.9E11923485k825699k521782r01909q09479l53469j789132O93589l2311k116470
$$ y = [608276596, 604158936, 604702988, 606303062, 606285591, 606245918, 606118813, 607213058, 601370125, 601383286, 601862793, 600682335, 599582901, 598018990, 597651978, 596161118, 595286026, 593856125, 591865349, 590134926, 587794342, 586547356, 583990250, 582248726, 579960785, 578427162, 577077293, 574738083, 572949715, 569889488, 568481979, 565659256, 563535500, 561521225, 559342804, 558123970, 554978752, 553489647, 551218376, 549306183, 546115875, 543879242, 542078400, 538850670, 537984276, 535403175, 533941078, 531476669, 530709305, 530546799, 523000374, 523603249, 522340202, 521704369, 519079933, 518138008, 517677727, 513618355, 513024025, 511431236, 511923485, 509097786, 506576004, 505674095, 504864616, 504511147, 502722015, 503415604, 503383293, 501266823]
1635.6E01266823l367462M81567J00555L14179J329155r73053J117706m94118J221657
1644.3E00997009K200966r09424J30806k931289K903823J257401K757988L674774L304939
1653E13386993o069755j298752L896141J622124J966324Q47358J428376J628303J527672
1661.6E18934784K868118o3705K769813J469384J513023K021484J808129J324005N24330
1670.3E33169365M044952J096306K508621L084832J949730O68182K290192L519134
1678E52331314J685867K582436J251717K891464M594307J313515p53289P14607M774857
1686.7E71386795L342857K746048L074265K072716L169250K919769K879677L419190
1694.4E95010567N242195j62888J799507N334130O198883P209434m978103M133987
$$ y = [501266823, 497899361, 498380928, 498481483, 498795662, 500124817, 499151764, 500269470, 499775352, 500997009, 503197975, 502288551, 502419357, 499488068, 502391891, 503649292, 506407280, 510082054, 513386993, 507317238, 506018486, 509914627, 511536751, 513503075, 514350433, 515778809, 517407112, 518934784, 521802902, 521739197, 524509010, 525978394, 527491417, 529512901, 531321030, 532645035, 533169365, 537214317, 538310623, 540819244, 543904076, 545853806, 546521988, 548812180, 552331314, 554017181, 556599617, 557851334, 560742798, 565337105, 566650620, 565897331, 566611938, 571386795, 574729652, 577475700, 580549965, 582622681, 585791931, 588711700, 591591377, 595010567, 600252762, 600089874, 601889381, 607223511, 613422394, 620631828, 615653725, 619787712]
1702.1F19787712L824387L704223K429924J804581K621117K565384L464775K591324
1709.9F42793427J968688K282410K071610K147293Q47397K81982K487030K520142m727021
1718.5F52672958J592789K837067R78470K96859l52249m63714P33261J099624P85828
1727.2F60180893O67648J530609j42898P0419L156128L200989O71387n581208J548386
1735.9F65302353K597046J254959K356033K66114j891251L101654K698517N15365J124802
1744.6F77325592K849808K134933J365738K022934R14841L734207K454987m46396L175354
1753.3F95531998K382507K153091K962647L79333Q50907K004165J389618K490464l12958
1761.9G09831772j019974J831589J011886J114579J309127J300049j136932R18274
$$ y = [619787712, 623612099, 627316322, 629746246, 631550827, 634171944, 636737328, 640202103, 642793427, 644762115, 647044525, 649116135, 651263428, 652110825, 652392807, 654879837, 657399979, 652672958, 654265747, 657102814, 658081284, 658378143, 658025894, 657562180, 658295441, 659395065, 660180893, 660848541, 662379150, 662236252, 662306671, 665462799, 668663788, 669335175, 663753967, 665302353, 667899399, 669154358, 671510391, 671776505, 669885254, 672986908, 675685425, 676200790, 677325592, 680175400, 682310333, 683676071, 685699005, 686613846, 690348053, 692803040, 692356644, 695531998, 697914505, 700067596, 703030243, 703409576, 704260483, 706264648, 707654266, 710144730, 709831772, 708811798, 710643387, 711655273, 712769852, 714078979, 715379028, 714242096, 715160370]
1769.7G15160370K676620J83030j396485j961441K667542K111358r10644R29031M66232
1778.3G19925613R04465O83365p33032O55517J108704R97620j11161k87475R31015
1787G24074631O25992j1063J118164M03748K88772j014709j627274K488022J311264
1795.7G27657547m02298Q56628J316834J38016j309357R32617j11999j8769R62677
1804.4G30021896K24381L67660L23639O3935N74340J038971q94928j49002M66004n646
1814G32031250P27921L49655Q61511R1629J83563M38614o08292K44828m3488P26471
1823.7G35003662J087723j738434n59463J549072K143936R80911l564224m27246J687012
1832.3G36162949J907L8376M42581N81894R3307p15408N51682P7056L93296j78681
$$ y = [715160370, 717836990, 718020020, 716623535, 714662094, 717329636, 719440994, 718530350, 719459381, 719925613, 720830078, 721513443, 720780411, 721435928, 722544632, 723542252, 723431091, 723143616, 724074631, 724700623, 724689560, 725807724, 726211472, 726500244, 725485535, 723858261, 726346283, 727657547, 727255249, 728111877, 729428711, 729566727, 728257370, 729189987, 729077988, 729059219, 730021896, 730246277, 730613937, 730937576, 731001511, 731575851, 732614822, 731719894, 731570892, 732036896, 732031250, 732759171, 733108826, 733970337, 734061966, 734245529, 734684143, 734075851, 734320679, 734277191, 735003662, 736091385, 734352951, 733793488, 735342560, 737486496, 738467407, 734903183, 734475937, 736162949, 736164856, 736203232, 736645813, 737227707, 737321014, 736605606, 737157288, 737234344, 737627640, 737448959]
1842G37448959O79779J669312l930893P99789K020417J65558o09665K98462L79333
1850.7G38921051m03595L31802j23901N59158L95508j74255K91672j3962K81524k34680
1860.3G39830322K88544j69144l40957J00326j0986O44531k07825L64991p07779r99451
1869.9G38792572R27277P45544O64826j76468j10932k59399J62964M28695j0910R7885
1879.6G41262054l34549P5608j27564K060n5465m6692M48684K54593J014176L4485
1889.2G42527390j655274k49481K81525m52042J48468R21783q6898J77230j01928N951
1898.9G41516724J45263k30102k04468l25851N70449J48163j67770L6774n8594M0512
1908.5G41471100k43302n26046n08728N36270J04751J99051L15705r0561O10962j610871
$$ y = [737448959, 738128738, 739798050, 735867157, 736666946, 738687363, 738852921, 738243256, 738541718, 738921051, 738517456, 738849258, 738725357, 739284515, 739680023, 739505768, 739797440, 739783478, 740065002, 739830322, 740118866, 739949722, 739608765, 739709091, 739698105, 740342636, 740134811, 740499802, 739792023, 738792572, 739719849, 740465393, 741130219, 740953751, 740842819, 740583420, 740746384, 741175079, 741164169, 741262054, 740927505, 741003113, 740875549, 740877609, 740822144, 740775452, 741224136, 741478729, 742492905, 742527390, 740872116, 740622635, 740904160, 740452118, 740600586, 741522369, 741435471, 741612701, 741510773, 741516724, 741661987, 741431885, 741227417, 740901566, 741472015, 741620178, 741452408, 741489182, 741430588, 741471100, 741227798, 740701752, 740193024, 740729294, 740834045, 741033096, 741348801, 741258240, 741869202, 740258331]
1918.2G40258331r05151N61829J70364M60129n41764l45382O06994P51419J79215K1210
1927.8G41217194j27640m34036l62702n61218J37176L07389l510j35803K58026L69873
1937.5G40664749l92761l79410m48532M46091K6550j502151N18646Q77304J9531p2327
1947.1G39757690R1858j30386n74722m03290K02789J44654Q6135J51215k65121K8686
1956.7G39089508J24817o4926j94702k8077J05210l17459o256J2283O8817J95923k98386
1967.3G38686752n44662o9428J74713l54156Q7509J61972o1645L7613j7167J21232
1977G38222733l77350j11466m1961j75858j48621l10363P2937r7733j75629l41873
1986.6G36514816p4768j71432p94068K594j4419o79245J27334Q48999J70060k93274
$$ y = [740258331, 739353180, 739915009, 740085373, 740545502, 740003738, 739658356, 740265350, 741016769, 741195984, 741217194, 741089554, 740655518, 740292816, 739731598, 739868774, 740176163, 740172653, 740036850, 740294876, 740664749, 740271988, 739892578, 739444046, 739890137, 739916687, 738414536, 738933182, 739810486, 739830017, 739757690, 739849548, 739719162, 739144440, 738741150, 738943939, 739088593, 739174728, 739325943, 739060822, 739089508, 739214325, 739149399, 738954697, 738926620, 739031830, 738714371, 738708115, 738720398, 738789215, 738985138, 738686752, 738142090, 738072662, 738247375, 737893219, 737980728, 738142700, 738081055, 738118668, 738101501, 738222733, 737845383, 737733917, 737691956, 737516098, 737367477, 737057114, 737130051, 737032318, 736856689, 736514816, 736440048, 736268616, 735474548, 735477142, 735462723, 734783478, 734910812, 735759811, 735929871, 735636597]
1996.3G35636597q0567j56860k18659r4070K72980j90582n875K91290L9368n4856o44683
2006.9G34794083m99802m18625j53427l6621P858J64337k42386N799j12152j90659
2016.5G33318405m81720n1346L04642m38614j39313j02615L82233L64227j58081l71704
2026.2G32626114p13959o0959j41296k85339l73917k33383J84250J78527j37481o54297
2035.8G30388260j984Q1940m3564j36261j07956j15661m40903M71115o3782l29361
2045.5G29701843k91366m70658K38877l85819l04565P6828K06146J74942j31149k29950
2055.1G28585129m13132R4910p9270k06222l77655l74832O5231j90735j13602k76718
2064.7G26713104j95541k67639k13089j297l91159j65024l49198o48269m25415k85340
$$ y = [735636597, 735556030, 735399170, 735180511, 735086441, 735359421, 735168839, 735162964, 735454254, 735493622, 735438766, 734794083, 734294281, 733875656, 733722229, 733685608, 733693466, 733857803, 733615417, 733621216, 733509064, 733318405, 732836685, 732785339, 733089981, 732651367, 732512054, 732409439, 732791672, 733155899, 732997818, 732626114, 731912155, 731851196, 731709900, 731424561, 731050644, 730817261, 731001511, 731180038, 731042557, 730388260, 730386276, 730468216, 730424652, 730288391, 730180435, 730064774, 729623871, 730094986, 730031204, 729701843, 729410477, 728939819, 729178696, 728792877, 728488312, 728565140, 728771286, 728946228, 728815079, 728585129, 728171997, 728266907, 728187637, 727981415, 727603760, 727228928, 727294159, 727103424, 726989822, 726713104, 726517563, 726249924, 726036835, 726035538, 725644379, 725479355, 725130157, 724481888, 724056473, 723771133]
2074.4G23771133m98352l45230J86310O8970k55280n05752k25144o2790j98288l67965
2084G21567612l62549j66092l04489J52435L23486J08643N6610K9068P6676q5679l9367
2094.6G21356354J08566L73764J80054J13525J7929n7983L91617J76315K52075N3101
2104.3G22965317l5477M1351k07367J33057J65100K81677L7308K20337L85208r8343
2113.9G23888168K12784J31378o6604j70059j09787N0888J42440j22070n69305j06659
2123.6G23281174P7362j9074l34625m23813m31290k35443M57001K73361J17264k89612
2133.2G22472305j21612J71051m8599J11007k02713L27225M96750L00598J21078m12673
2142.9G23214417m7303K47116O00663K09503m09928k71988Q5450M37545L47596J74942
$$ y = [723771133, 723272781, 722927551, 723113861, 723182831, 722927551, 722421799, 722196655, 722133865, 721935577, 721567612, 721205063, 721038971, 720734482, 720886917, 721210403, 721319046, 721375656, 721404724, 721481400, 721395721, 721356354, 721464920, 721838684, 722018738, 722132263, 722150192, 722092209, 722483826, 722660141, 722912216, 722965317, 722929840, 722971191, 722763824, 722896881, 723061981, 723343658, 723380966, 723601303, 723986511, 723888168, 724100952, 724232330, 724165726, 723995667, 723885880, 723936768, 724079208, 723957138, 723387833, 723281174, 723358536, 723339462, 723004837, 722581024, 722149734, 721914291, 722371292, 722644653, 722761917, 722472305, 722350693, 722521744, 722473145, 722584152, 722381439, 722708664, 723205414, 723506012, 723627090, 723214417, 723167114, 723414230, 724014893, 724224396, 723814468, 723542480, 723627930, 724065475, 724413071, 724588013]
2152.5G24588013j28327K12937K41546m7607J48392L8452r6283j06278J86234k40631
2162.1G24796448k97394L45917L29055J2742l69416L8758L20587o4926n73807k59476
2171.8G24278488L08685O3706J7548l78190m26254o9733J17188M2953k86254P4386
2181.4G23742523J33515o028L70636M91486n3406R0027J80893l18298l2349J02997
2191.1G24701996M77447K06757j7929M45557K65426L92685N9662R3613J00708J60370
2200.7G26886292M82254j84861j6632O0806J12229N76172L70865l8224p4386J32828
2210.4G28307343m0665j1978o1341L6011J90430L63235J10321m73327J21002J86920
2220G28727951R9640L281m62265k55051m7073L7307J11466J67999j53122K76947L76434
$$ y = [724588013, 724459686, 724672623, 724914169, 724866562, 725014954, 725053406, 724957123, 724850845, 725037079, 724796448, 724499054, 724844971, 725174026, 725186768, 724817352, 724856110, 725176697, 725111771, 724537964, 724278488, 724587173, 724650879, 724668427, 724290237, 723863983, 723794250, 723911438, 723954391, 723668137, 723742523, 723876038, 723870010, 724240646, 724732132, 724678726, 724768753, 724949646, 724631348, 724598999, 724701996, 725179443, 725386200, 725368271, 725813828, 726079254, 726471939, 726531601, 726625214, 726725922, 726886292, 727368546, 727183685, 727167053, 727227859, 727340088, 727916260, 728287125, 728248901, 728174515, 728307343, 728266678, 728254700, 728193359, 728229370, 728419800, 728783035, 728893356, 728420029, 728541031, 728727951, 728827591, 728830872, 728368607, 728113556, 728066483, 728103790, 728215256, 728383255, 728230133, 728507080, 728883514]
2230.6G28883514l12881k99759k78625M2800k2201J31683p1869k59018L85819J05438
2240.3G28304901L0136k14004j02234J7624k17819q7433k72141J51749J02081K1362
2249.9G27734222R1935R7274M2420j55335M45862K06146j75857k46811j13678P706
2259.5G27933884J0528J17951k44599J66626M4174J77002M75388L8605p1717m88739
2269.2G28159103k76031k54593J65405L08838j46866M3869K7848L24478j0758l1280
2278.8G28310013j32370j99127J27563r6588J55640l07770K746K31324j6327J25427
2288.5G28200531j26572J37711m55628J63117L71933o88553j28784K21634J79138n01709
2298.1G27372818k34756N10177J49002P9193J96076k17057q39538K2278M55017L11050
$$ y = [728883514, 728570633, 728270874, 727992249, 728035049, 728012848, 728144531, 728072662, 727813644, 728199463, 728304901, 728335037, 728121033, 728018799, 728036423, 727818604, 727731171, 727459030, 727610779, 727712860, 727734222, 727826157, 727923431, 727965851, 727810516, 728256378, 728462524, 728286667, 728039856, 727926178, 727933884, 727944412, 728062363, 727817764, 727984390, 728028564, 728205566, 728680954, 728719559, 728647842, 728159103, 727883072, 727628479, 727793884, 728102722, 727955856, 727999725, 728027573, 728352051, 728341293, 728310013, 728177643, 727978516, 728106079, 728009491, 728165131, 727857361, 727860107, 728091431, 728075104, 728200531, 728073959, 728211670, 727756042, 727919159, 728291092, 727602539, 727473755, 727695389, 727874527, 727372818, 727138062, 727648239, 727797241, 727876434, 728072510, 727855453, 727015915, 727038193, 727493210, 727804260]
2307.8G27804260L21350m95758o72683l40043K59018P6065m12826j96686M578j11237
2317.4G26236038l33481j8386N9127j48315k77023N46646K30484o55976k1972j04599
2327.1G25512543k18964o15463n82657m09241J33820Q30459O04630R42001l32260o02493
2336.7G25262375J97677M64020J90811m98962N20706L88870M34952M73099q4076l61175
2346.3G26988297j51978P25174J105270R98535o29425j355285j108399m07638j2894
2355G26151657j134567Q15048M70581n49469M23050L16162o9046M82712J445770j280136
2364.7G27071762j067352o714m8370J127319J117020Q35189m2877L74603J13984n4779
2374.3G29419785L30429j80283L00827L93372J73721j25198j86234J17798M75082O38352
$$ y = [727804260, 728125610, 727629852, 726957169, 726617126, 726876144, 726952209, 726539383, 726342697, 726347275, 726236038, 725902557, 725884171, 725943298, 725794983, 725517960, 726064606, 726295090, 725639114, 725617142, 725512543, 725293579, 724678116, 724095459, 723686218, 723820038, 724650497, 725255127, 726197128, 725864868, 725262375, 725460052, 725924072, 726114883, 725615921, 726136627, 726525497, 726960449, 727433548, 727349472, 726988297, 726836319, 727561493, 728666763, 729665298, 729035873, 727680588, 726572189, 726164551, 726151657, 725017090, 725832138, 726302719, 725753250, 726176300, 726492462, 726423416, 726906128, 728351898, 727071762, 726004410, 725997696, 725949326, 727076645, 728193665, 729028854, 728985977, 729360580, 729474564, 729419785, 729750214, 729569931, 729870758, 730264130, 730437851, 730312653, 730126419, 730244217, 730719299, 731357651]
2383.9G31357651l968j83563r0408J1444P9422M0665j09330m94384q4839K61154o1188
2394.6G30722656j37710K59323J29928j85394n7373j03912N4016j4343r1172m2877
2404.2G30533142J16654K49633p4615j49155l75824k03323R9563j3656j31684l80706
2413.8G29670029q4458K99225J43814k14996j63040j32675j64032J01928J61896q2779
2423.5G29534912l49960m4251k37503k43606L7689m20838j23291J39695j8540j68380
2433.1G28105927j49003j8997J63727L11050k65960k27432L5400M6616l58048p43713
2442.8G26899567k0218J68762O7978J01700k7771k30027k68707j38626j67770j14289
2452.4G26270599k55355p4082j35803Q5678K84042l50341j04142L5477j04828j39007
$$ y = [731357651, 731353683, 731170120, 731079712, 731091156, 731170578, 731211243, 731101913, 730607529, 730522690, 730783844, 730722656, 730584946, 730844269, 730974197, 730788803, 730731430, 730627518, 730681534, 730667191, 730576019, 730533142, 730649796, 730899429, 730824814, 730675659, 730299835, 730096512, 730196075, 730182419, 730050735, 729670029, 729585571, 729884796, 730028610, 729813614, 729650574, 729517899, 729353867, 729455795, 729617691, 729534912, 729184952, 729140701, 728903198, 728659592, 728697281, 728276443, 728153152, 728292847, 728274307, 728105927, 727956924, 727937927, 728101654, 728412704, 728146744, 727919312, 727954712, 728001328, 727643280, 726899567, 726879349, 727048111, 727116089, 727217789, 727190018, 726959991, 726691284, 726552658, 726384888, 726270599, 726015244, 725941162, 725805359, 725891037, 726175079, 725824738, 725720596, 725756073, 725651245, 725512238]
2462.1G25512238j81275l30276l07694K98538J91651r0714l53927k26059J76086R3002
2471.7G24781570j87683j54037K76794l75137n63126l09219l01361J17874Q39l7689
2481.3G23248825j65863L7384j53274l73002P6600m55246m86832j08337n5771p0649
2491G21493835O8360K34909m6311j76162m84619m39988j17797L3340J04675J73874
2500.6G20844116L1052k53525Q0338Q7509l2578l37066m21067j64795l39660j44043
2510.3G19350281J2207L30887m0970l20130k8381l06702J13449q0032n26428l30124
2519.9G18174057R6436N69686p5912o67496l59878j03455r4452K10037q9492j95008
2529.6G17464523R0485j32675L82309Q6593m23889j54037r7657l2882k53830j80588
$$ y = [725512238, 725330963, 725000687, 724692993, 724991531, 725183182, 725092468, 724738541, 724512482, 724688568, 724781570, 724593887, 724439850, 724716644, 724341507, 723778381, 723469162, 723167801, 723285675, 723286514, 723248825, 723082962, 723120346, 722967072, 722594070, 722670670, 722215424, 721728592, 721620255, 721564484, 721493835, 721562195, 721797104, 721750793, 721574631, 721090012, 720650024, 720532227, 720565567, 720670242, 720844116, 720875168, 720621643, 720701981, 720789490, 720756912, 720419846, 719998779, 719833984, 719494324, 719350281, 719362488, 719693375, 719652405, 719332275, 719303894, 718997192, 719110641, 719030609, 718504181, 718174057, 718270493, 718840179, 718764267, 718096771, 717736893, 717633438, 717538986, 717749023, 717659531, 717464523, 717555008, 717422333, 717804642, 717891235, 717467346, 717313309, 717215652, 717182770, 716928940, 716748352]
2539.2G16748352k31323l27759L1128K72140j82647m66538O2638L7155j37787j13602
2548.9G15691757k12097m70352J49002M79050n27420l65525j02081J00708Q5907l37448
2558.5G14491501j07041k40249p1945j76087m8218K42463o9886j3122k52762o8894
2568.1G13685760L5019l82080l22647J09406M8294l26462p3166j33209j63498l5477
2577.8G12441940q0795k35901k11182K32621q0643m35638m03824k39640q1024k15759
2587.4G10690155j92718R4223J51290l12881l00751j93481r7962N6229j83258k76642
2597.1G09434204j31225n036o01883m64325J53733J68304O5308n32380m22744k91443
2606.7G07372513j15509M04968l2730p79114p39746K52228L46908p9422r7961j94550
$$ y = [716748352, 716517029, 716189270, 716220398, 716492538, 716309891, 715843353, 715905991, 715943146, 715805359, 715691757, 715479660, 715009308, 715158310, 715637360, 715109940, 714744415, 714642334, 714743042, 714828949, 714491501, 714384460, 714144211, 714072266, 713896179, 713847961, 714090424, 714020538, 714007416, 713754654, 713685760, 713720779, 713338699, 713016052, 713125458, 713173752, 712847290, 712774124, 712640915, 712477417, 712441940, 712361145, 712125244, 711914062, 712146683, 712066040, 711630402, 711226578, 710986938, 710905914, 710690155, 710497437, 710591660, 710742950, 710430069, 710129318, 709935837, 709837875, 709894104, 709710846, 709434204, 709302979, 709297943, 708696060, 708231735, 708385468, 708553772, 708619080, 708086700, 707663956, 707372513, 707257004, 707661972, 707629242, 706850128, 706110382, 706362610, 706709518, 706630096, 706532135, 706337585]
2616.4G06337585l47671n38483k51922R842j6175m38766m79126j70517J26343L59954
2626G04591064m35562m58984n5542k57416l09601k43759j62353l13034j59378k25449
2635.6G01969986j40305j50528l40118l7231k91596l21579l33404k31705J8082m08936
2645.3F99732666k70081N7297l03955l27148p9956m67301j67465R1858k26593j08109
2654.9F97931213j87988K6779j33972j22528j30844n45502j82648m80651m16184R9487
2664.6F95857162k8915j62430k39944k37198k85111j09787j42669j26572j42898p9117
2674.2F94302521r2774l50570L52783K46429m34036n50995n43823p7057l1204m13819
2683.9F92407455n45425j03989R8954n9586k41013n36346K365M33808p1640n47181
$$ y = [706337585, 705989914, 705451431, 705199509, 705209351, 705193176, 704754410, 704275284, 704104767, 704231110, 704591064, 704155502, 703696518, 703640976, 703383560, 703073959, 702830200, 702667847, 702354813, 702195435, 701969986, 701829681, 701679153, 701339035, 701301804, 701010208, 700688629, 700355225, 700123520, 700141602, 699732666, 699462585, 699519882, 699215927, 698888779, 698808823, 698341522, 698174057, 698265915, 698039322, 697931213, 697743225, 697770004, 697636032, 697513504, 697382660, 696837158, 696654510, 696173859, 695757675, 695857162, 695828247, 695665817, 695425873, 695188675, 694903564, 694793777, 694651108, 694524536, 694381638, 694302521, 694209747, 693859177, 694211960, 694458389, 694024353, 693473358, 692929535, 692852478, 692821274, 692407455, 691862030, 691758041, 691856995, 691797409, 691556396, 691020050, 691022415, 691456223, 691384583, 690837402]
2693.5F90837402n58853k87552J68610J00555k32925l37296n64727j62430j65558k55432
2703.1F88541794J5716k76184J38245K49786l16162l73077k08283l68728n75257m29382
2712.8F86398468j04828K76642l65448o20041r2392r3002M4708m7378k03171p41501
2722.4F84452057o04706K33154k06451l82004k13470k12784j30463k34909j58691k46430
2732.1F82295303k04925J831k01035k47497N5389j98212m88204j12381r2850l11966
2741.7F80495453k90833l77426l01742j54648r5291k747p6980n3635l17154n36652
2751.4F78288345q3999L8910j15815m19387m59290j31226k61077n54429m75692J2512
2761F75838852j54800l62473q3847m2343j35956m15802k74506k17361j07727j6022
$$ y = [690837402, 690278549, 689990997, 690159607, 690260162, 690027237, 689689941, 689125214, 688962784, 688797226, 688541794, 688557510, 688281326, 688419571, 688669357, 688353195, 687980118, 687771835, 687403107, 686827850, 686398468, 686293640, 686570282, 686204834, 685584793, 685492401, 685399399, 685444107, 685396729, 685193558, 684452057, 683847351, 684080505, 683874054, 683492050, 683278580, 683065796, 682935333, 682700424, 682541733, 682295303, 682090378, 682092209, 681891174, 681643677, 681699066, 681500854, 681012650, 680900269, 680807419, 680495453, 680204620, 679827194, 679525452, 679370804, 679275513, 679272766, 679195786, 679142151, 678824997, 678288345, 678204346, 678243256, 678127441, 677708054, 677248764, 677117538, 676856461, 676302032, 675826340, 675838852, 675684052, 675321579, 675237732, 675195389, 675059433, 674643631, 674369125, 674151764, 674044037, 674028015]
2770.7F74028015j73721q1406k85950p0495n76477r57642l27911n50995l35541j15967
2780.3F70551910l33557l65905k41166k8534l48510l83149q4686Q3008n15900r73129
2789.9F67360382j76926M5472l48969l77197l60565m54789k41851j26191n95245p00149
2799.6F64023972m75541n35888m72260j30005r2010m89731o11038m08478n36346l25852
2809.2F59946823m04434j058807k98615L4714n33371m47769n47181l80172j79749l74679
2818.9F55756760q16346q18634k60467l98712n97153n11703n03617n71594n91049n01328
2828.5F50186157m71420n55039n94787n04837p74689p63397p48367p93152m64401n82352
2838.2F43933716q45871j382446j340180r65271j250229j462898j713638j454850j439857
$$ y = [674028015, 673854294, 673772888, 673486938, 673416443, 672839966, 671882324, 671554413, 671003418, 670667877, 670551910, 670218353, 669852448, 669611282, 669582748, 669234238, 668851089, 668766403, 668849411, 668333511, 667360382, 667183456, 667228928, 666879959, 666502762, 666142197, 665687408, 665445557, 665319366, 664724121, 664023972, 663548431, 663012543, 662540283, 662410278, 662318268, 661828537, 661217499, 660809021, 660272675, 659946823, 659542389, 658483582, 658184967, 658219681, 657686310, 657238541, 656691360, 656311188, 656131439, 655756760, 654940414, 654121780, 653861313, 653462601, 652865448, 652353745, 651850128, 651278534, 650687485, 650186157, 649714737, 649159698, 648564911, 648060074, 647285385, 646521988, 645773621, 644980469, 644516068, 643933716, 643087845, 641705399, 640365219, 639399948, 638149719, 636686821, 634973183, 633518333, 632078476]
2846.8F32078476j589928j456184j741486j318397j018982o35071J99471k93007p82814
2855.5F23442078n16053M9820O28319O4850m16985M4022K2316n01442p42989p31773
2865.2F21342163o72302n11551q68988j067696m09279l37753n13420n45540m85458
2873.8F15930176o53649p59544P7629k41890p75223m92515n23186l12500n07202n83153
2883.5F11158943n70221o57692k96974n13954r63402q37898n50308p30133p25289m20151
2893.1F04892921k30751k30712q13523j021309p30629n27267m55284n58892m61311
2901.8E99863243j24626k53258o46591n47638o90956n73578k56538n94330q26264o71348
2911.4E94678116l96538p21016p80945j009063j433678p44629p89795q72726p12357
$$ y = [632078476, 630488548, 629032364, 627290878, 625972481, 624953499, 624318428, 624517899, 624224892, 623442078, 622926025, 622975845, 623604164, 623669014, 623252029, 623296051, 623318367, 622816925, 622073936, 621342163, 620669861, 620158310, 619289322, 618221626, 617812347, 617474594, 616961174, 616415634, 615930176, 615276527, 614516983, 614594612, 614352722, 613577499, 613084984, 612561798, 612249298, 611742096, 611158943, 610588722, 609931030, 609634056, 609120102, 608156700, 607318802, 606768494, 606038361, 605313072, 604892921, 604662170, 604431458, 603617935, 602596626, 601865997, 601338730, 600883446, 600324554, 599863243, 599738617, 599485359, 598838768, 598291130, 597600174, 597026596, 596770058, 596175728, 595349464, 594678116, 594281578, 593560562, 592779617, 591770554, 590336876, 589592247, 588802452, 587929726, 587217369]
2920.1E87217369r87854n83687k75154k72827m63982l46107P9002J87569M06761M22440
2929.8E85383530K20794J81809J43623L12157K83775k22435K88963N92881l6431K35939
2939.4E87384605P25747Q97483K77329L4981M94346K20566M85458J72196m66843J6251
2949.1E90242119q8196m01611m5433L0365m48990p01599n73120j44768R5215r4796
2958.7E87869186o4468K23465K28538q6441K90490L05748k24114K80419O76078N41611
2968.3E90040512N35774N64919M30603N18379R51691R35974N79834N22613N74608M42353
2978E96097260J004791J144752L61786M82559N00260P9613M57153J009178P44133N54199
2987.6F02435684M64745J10817M32396L36914J53274L18680L17993O45943K99225k48566
$$ y = [587217369, 586229515, 585645828, 585370674, 585097847, 584633865, 584287758, 584366760, 584554329, 584961090, 585383530, 585604324, 585786133, 585929756, 586241913, 586525688, 586303253, 586592216, 587185097, 587148666, 587384605, 588110352, 589007835, 589285164, 589320145, 589814491, 590035057, 590520515, 590692711, 590225868, 590242119, 590153923, 589752312, 589706879, 589737244, 589288254, 588586655, 588013535, 587868767, 587963982, 587869186, 587804718, 588028183, 588256721, 588170280, 588460770, 588766518, 588542404, 588822823, 589498901, 590040512, 590576286, 591141205, 591571808, 592090187, 593041878, 593977852, 594557686, 595080299, 595654907, 596097260, 597102051, 598246803, 598608589, 599091148, 599591408, 599671021, 600128174, 601137352, 601881485, 602435684, 602900429, 603011246, 603443642, 603780556, 603933830, 604252510, 604570503, 605216446, 605515671, 605267105]
2997.3F05267105k02179J54839L12805J06659K95257R5292l94440k14806r6168k6322
3006.9F05298042K28081J25427N7755J34582j08337p65801q42094q6746J5259N8174
3016.6F04114342k00386o33354m81644p03659l23754k75955m19578K20642M883n61943
3026.2F00739594p70379j28593J4458n63927m54598n81359j87035K4681n81322o15005
3035.9E96896515k86903q7967n12810n73845o7215m39415n02396o6337o97365j023865
3045.5E92638397l12652J19629j38169m70238j81579k25983q74901j259651j086578
3054.2E88208275m20380J33133j8883o12373p11594n81626n46341p01676m13437J27373
3063.8E84462471l65944j55678m9400p92885m41246k02522m66461o12984l23372k98805
$$ y = [605267105, 605064926, 605219765, 605532570, 605639229, 605934486, 606029778, 605635338, 605420532, 605324364, 605298042, 605526123, 605651550, 605709305, 605843887, 605735550, 604969749, 604127655, 604040909, 604056168, 604114342, 603913956, 603280602, 602798958, 602095299, 601771545, 601495590, 601076012, 601296654, 601301537, 600739594, 599969215, 599840622, 599855080, 599291153, 598836555, 598255196, 598068161, 598092842, 597511520, 596896515, 596609612, 596521645, 596008835, 595434990, 595367775, 594928360, 594425964, 594359627, 593662262, 592638397, 592325745, 592445374, 592307205, 591836967, 591655388, 591429405, 590554504, 589294853, 588208275, 587787895, 587921028, 587902145, 587289772, 586578178, 585996552, 585450211, 584748535, 584335098, 584462471, 584096527, 583940849, 583891449, 583098564, 582657318, 582454796, 581988335, 581375351, 581051979, 580753174]
3073.5E80753174m70848J24016O10p27425q57467m81339l39126n21698l72620k16179
3083.1E76891098m17480l76130l9596m37317n02319k84958q03185p81250k65121n5580
3092.7E72928162m14849m04892l53470l69911J75858l96042p50198n69115q36525m42581
3102.4E68566437k17514k74811m96712o93130m51584o61202m75235Q1368n58357r01642
3112E63917618o74935m91485O5117n96161r49593n44128p30629l45078l52401m48838
3121.7E58849487o61621q30765n43785r25369n79491k51045m54445l58352n70031o29158
3131.3E53045425n59082m63829n42526q71963p39212q8463l43552j092529o05011l07236
3141E47432022p94639j021767q44422o14624n50766n12123l38440m23431j021118n17235
$$ y = [580753174, 580282326, 580406342, 580406952, 579679527, 578822060, 578340721, 578001595, 577479897, 577107277, 576891098, 576473618, 576097488, 576057892, 575620575, 575118256, 574833298, 574030113, 573248863, 572983742, 572928162, 572513313, 572108421, 571754951, 571385040, 571560898, 571164856, 570414658, 569845543, 569009018, 568566437, 568348923, 568074112, 567577400, 566884270, 566432686, 565771484, 565296249, 565377617, 564819260, 563917618, 563242683, 562751198, 562816315, 562220154, 561270561, 560726433, 559995804, 559650726, 559298325, 558849487, 558187866, 557357101, 556813316, 555887947, 555308456, 555057411, 554602966, 554244614, 553674583, 553045425, 552486343, 552022514, 551479988, 550608025, 549868813, 549780350, 549436798, 548344269, 547739258, 547432022, 546637383, 545615616, 544771194, 544156570, 543605804, 543093681, 542755241, 542331810, 541310692, 540793457]
3150.6E40793457n1613p03621q42018o21147j08681o92558j590309q61054m51622p45773
3160.3E34125061r10301o76193n29099m54216j47819o02227r17854o79169p68013r00039
3169.9E27540131r43184q15201m17748l21502o32477r16443r83925m42810k56882p47070
3179.5E21062889o26755p93647r59626l74984l79982o95267p92999q62427o74095m42963
3189.2E14460144m23279p59048o94885l01362o30798r02748q80699o92558m56505q88825
3198.8E07829437q12835k90490m78897n07316n84679r59396o00510n85136j033974
3207.5E01976204p80487o09512p06025p40356k59285J66969m94232r39979p64924o57615
3217.2D96190758o65627n87997o49147r05991m20837k07901p96852q62465m44336k89955
$$ y = [540793457, 540741844, 540038223, 539196205, 538575058, 538466377, 537773819, 536183510, 535322456, 534870834, 534125061, 533214760, 532538567, 532009468, 531555252, 531407433, 530805206, 529887352, 529208183, 528440170, 527540131, 526596947, 525781746, 525363998, 525042496, 524410019, 523493576, 522509651, 522066841, 521809959, 521062889, 520436134, 519642487, 518682861, 518307877, 517927895, 517232628, 516439629, 515577202, 514903107, 514460144, 514036865, 513277817, 512582932, 512281570, 511650772, 510748024, 509867325, 509174767, 508718262, 507829437, 507016602, 506726112, 506247215, 505739899, 505155220, 504195824, 503595314, 503010178, 501976204, 501195717, 500586205, 499880180, 499139824, 498880539, 499047508, 498553276, 497613297, 496848373, 496190758, 495525131, 494937134, 494287987, 493381996, 492961159, 492753258, 491956406, 491093941, 490649605, 490359650]
3226.8D90359650l98331m00734m64592m96712l81965n29557p93609q16765n88493m36440
3236.4D85052452r98306j184883n05753m46129m58107m86564m77066j49651m98199
3245.1D79847794m76571m11529p49855q97751q37517m57992l55912j57623k85492l76816
3254.8D74840736j57585l61137n00527p81440o62766q16955p84874L8528l46603p56455
3264.4D69710922m21142n75867o80351j65139j37062m27436m12903n90630m00429n10864
3274D65389099p33757l86467m63142o77986m01650j47285n14298n33295k01034k81792
3283.7D61048393k37350k24228r80530r50546L38135K70958l70217p51114p99446m37736
3293.3D56906319o08712j29089j69296o11878o86264o66771j80397p54661q08602O7368
$$ y = [490359650, 489961319, 489560585, 489095993, 488599281, 488217316, 487687759, 486894150, 486077385, 485488892, 485052452, 484054146, 482869263, 482363510, 481917381, 481459274, 480972710, 480495644, 480345993, 479847794, 479371223, 478959694, 478209839, 477312088, 476474571, 476016579, 475660667, 475503044, 475217552, 474840736, 474683151, 474322014, 473821487, 473040047, 472377281, 471560326, 470775452, 470813980, 470467377, 469710922, 469289780, 468713913, 468033562, 467868423, 467731361, 467303925, 466891022, 466300392, 465899963, 465389099, 464655342, 464268875, 463805733, 463127747, 462726097, 462578812, 462064514, 461531219, 461330185, 461048393, 460811043, 460586815, 459606285, 458655739, 458993874, 459264832, 458894615, 458143501, 457344055, 456906319, 456297607, 456168518, 455999222, 455387344, 454701080, 454034309, 453853912, 453099251, 452290649, 452358017]
3303D52358017J03455n54505q21991k50778m57916o26412m14734q80050q79479m54673
3312.6D47120934n78270n19638l86658m14658j56021q16002q43963n77698r55963k43874
3322.3D41628189K4757j42211q30155j210289r74808r67445K56958M3640j216583j266213
3331.9D35345840q01620m37737o86798k38418O6376n79072j174392j005249n59540
3340.6D29929390p96471q04290n62020n71098p66792r00155r52606n24330l75671q33473
3350.2D22842484n32723n59959n91431l72963p56340j237831r99870m29993o37779
3358.9D16723595l73116p45544j223069n49583o61278p25593p46765r02367r97696
3367.6D09798584q58192n84336m53224k79465o14052n45425p27882l67699n4016r66454
$$ y = [452358017, 452461472, 451906967, 451084976, 450834198, 450376282, 449749870, 449335136, 448455086, 447575607, 447120934, 446542664, 446023026, 445636368, 445221710, 445065689, 444249687, 443405724, 442828026, 441872063, 441628189, 441652946, 441510735, 440680580, 439470291, 438495483, 437528038, 437784996, 437828636, 436612053, 435345840, 434544220, 434106483, 433419685, 433181267, 433247643, 432668571, 431494179, 430488930, 429929390, 429132919, 428328629, 427766609, 427195511, 426428719, 425528564, 424575958, 424051628, 423675957, 422842484, 422309761, 421749802, 421158371, 420785408, 420029068, 418791237, 417791367, 417361374, 416723595, 416350479, 415604935, 414381866, 413832283, 413171005, 412445412, 411698647, 410796280, 409798584, 408940392, 408356056, 407902832, 407623367, 407009315, 406463890, 405736008, 405368309, 405314293, 404347839]
3377.2D04347839o68563o79131p20406l17459o15005m25301l74336q80508p87201k2889
3386.9C98857040l97453n45120k39449j048202o90689k74887n22499k0142j02730o12564
3396.5C94403305q09517l76243k09160m69895O0463j39312o83938k44598n455M2000
3406.2C91567650m18282l12195q9111o94580l91083k72751j81121q736k04582l83377
3415.8C88611832o16646j73454O1950q5716o15311j13105N18608l64418m46053N8098
3425.5C86835785Q72841J78909q25043J7319K33231L42178J14632k88735k79274J60866
3435.1C87362709K37045m32243J18027P10640M91905K98424L77082l83186m65927N05104
3444.7C88819580Q31795R84154j050225q34350R87968O72646O05774M94690M50630
$$ y = [404347839, 403679276, 403000145, 402279739, 401962280, 401347275, 400921974, 400547638, 399667130, 398879929, 398857040, 398459587, 397914467, 397675018, 396626816, 395936127, 395661240, 395138741, 395118599, 395015869, 394403305, 393593788, 393217545, 393008385, 392538490, 392598953, 392459641, 391775703, 391531105, 391525650, 391567650, 391149368, 390837173, 390748062, 390053482, 389662399, 389389648, 389208527, 389199791, 388995209, 388611832, 387995186, 387821732, 387883682, 387797966, 387182655, 387069550, 387588158, 387223740, 386777687, 386835785, 387708626, 387887535, 387062492, 387079811, 387313042, 387655220, 387769852, 387481117, 387201843, 387362709, 387599754, 387167511, 387285538, 387996178, 388488083, 388786507, 389163589, 388780403, 388314476, 388819580, 389651375, 390635529, 389585304, 388750954, 389738922, 390411568, 391017342, 391512032, 391962662]
3453.4C91962662J67999M90799N55725J88522Q67196N61027J48850o0502L48816N37682
3463.1C95768776M84390P56149M17595N90630M8332N63317J105918L56331K38877J94473
3472.7D00524788P86514L77426k4681O45027Q37098L67584J45149Q72345P33337N21660
3482.3D05786247K81639N30129Q71925Q08525J343346N67703j32446J74560Q19893
3491D11051521J273766R14001M42772J27793Q00285R23042M86565J84860k7885M31480
3500.7D16608200J503487J968841N90630k65541Q1405J017456P41349R14955J207619
3509.4D24368401m13742R59320J367149O49223O16913N13191J388321J174088P38945
3518D31361809J46141J1558N21241J307029J284142O8893Q99430N98106R81636J452026
$$ y = [391962662, 392130661, 392621460, 393177185, 393365707, 394232903, 394793930, 394942780, 394882278, 395231094, 395768776, 396253166, 397009315, 397426910, 398017540, 398065872, 398629189, 399735107, 400091438, 400330315, 400524788, 401311302, 401688728, 401664047, 402309074, 403146172, 403513756, 403658905, 404531250, 405264587, 405786247, 406067886, 406598015, 407469940, 408278465, 409621811, 410189514, 410057068, 410231628, 411051521, 412325287, 413239288, 413682060, 413809853, 414610138, 415533180, 416019745, 416204605, 416176720, 416608200, 418111687, 420080528, 420671158, 420405617, 420487022, 421504478, 422245827, 423160782, 424368401, 423954659, 424913979, 426281128, 426930351, 427547264, 428060455, 429448776, 430622864, 431361809, 431507950, 431519508, 432040749, 433347778, 434631920, 434700813, 435600243, 436198349, 437179985, 438632011]
3527.7D38632011M06723K47002L91121J005630J161881J347580L80020R11026J476402
3536.4D45959396K45438J218796Q14743Q11500P56111J044808J746368J548615J270294
3545D55416069p78007R63897P14226K55013R90638P75490K350349P19071Q78181P90482
3554.7D63075409R01146K150459O94771J524849Q85887L62930M32015J330070K011032
3563.4D73368568N11856L398667J751060k96630N18074r95636K690315J632309J056595
3572D83635178J665115J466713J324692J261177J890335K06451J130295J431999M37737
3580.7D94449692J643371K002983J469079O13136L240127L424034J51368J383781j413498
3589.4E06964073J083260K729225K682609J829186P15523L264999m17480K26516L411141
$$ y = [438632011, 439038734, 439285736, 439676857, 440682487, 441844368, 443191948, 443571968, 444482994, 445959396, 446204834, 447423630, 448238373, 449049873, 449805984, 450850792, 452597160, 454145775, 455416069, 454638062, 455601959, 456316185, 456571198, 457561836, 458337326, 460687675, 461406746, 462284927, 463075409, 463976555, 466127014, 466821785, 468346634, 469232521, 469595451, 470027466, 471357536, 473368568, 473880424, 477279091, 479030151, 478733521, 479251595, 478255959, 480946274, 482578583, 483635178, 485300293, 486767006, 488091698, 489352875, 491243210, 491449661, 492579956, 494011955, 494449692, 496093063, 498096046, 499565125, 500178261, 503418388, 506842422, 506993790, 508377571, 506964073, 508047333, 510776558, 513459167, 515288353, 516003876, 519268875, 518851395, 519077911, 522489052]
3598.1E22489052J175232K466850J266785j30844J966896J701431J813583K950287
3605.8E35699272L258705n40733J765747R78432j257515O150245M065209k187653K595597
3614.5E50527306n41764K347107M286347J072120K255631r2430j93672L046035K955551
3623.1E65662231J734467K355309K340660K023697P130661N410652j0118294K050514
3630.9E78589897L274155M556885K762374j330909K099266K958374K344665J064110
3638.6E96318817J195603K437629K762947J877480N44739K022171K807655M217644
3646.3F14184685P48176j774482N935096J696511r25827j049233L172302L496743L453445
3655F28937416O652565n108414r70306M375343J571579J164780P58972K315369R93767
$$ y = [522489052, 523664284, 526131134, 527397919, 527267075, 529233971, 530935402, 532748985, 535699272, 538957977, 538417244, 540182991, 541161423, 539903908, 546054153, 550119362, 547931709, 550527306, 549985542, 552332649, 556618996, 557691116, 559946747, 559854317, 559660645, 562706680, 565662231, 567396698, 569752007, 572092667, 574116364, 581247025, 586657677, 576539383, 578589897, 581864052, 586420937, 589183311, 587852402, 589951668, 592910042, 595254707, 596318817, 597514420, 599952049, 602714996, 604592476, 605137215, 607159386, 609967041, 614184685, 614932861, 613158379, 619093475, 620789986, 619864159, 618814926, 621987228, 625483971, 628937416, 635589981, 630481567, 629511261, 633886604, 635458183, 636622963, 637381935, 639697304, 640691071]
3663.6F40691071J214752K302246L76282L008194K926864m25262m17481l925628J141662
3672.3F46892700N517578Q231964O229248j3239669k746277N058136M827728j125183
3680F59646225q16116J805343K435913K162934m43497q93173L382492O901398n256043
3688.7F68925476m650040P462769m056397k625656L546830P25860J832733O18592j028977
3697.4F70751190L13111j64567K125702L207703l418503k547760L454590J705399J23596
3706.1F75550461Q74405K122726L932724m998245K145386P445297j0630493J337280
3713.8F77779541L667908m4861k1134J528397K027283k302170l16772N015258j620559
3722.5F85712891n018845L696671J431503P64160k180634k300567K750473J183700
$$ y = [640691071, 641905823, 644208069, 644584351, 647592545, 650519409, 650094147, 649676666, 645751038, 646892700, 652410278, 660642242, 666871490, 653631821, 650885544, 655943680, 660771408, 659646225, 658830109, 660635452, 663071365, 665234299, 664790802, 663897629, 667280121, 674181519, 668925476, 664275436, 671738205, 667681808, 665056152, 668602982, 669328842, 671161575, 671780167, 670751190, 671064301, 670899734, 673025436, 676233139, 672814636, 670266876, 673721466, 675426865, 675550461, 676424866, 678547592, 682480316, 677482071, 679627457, 687072754, 676442261, 677779541, 681447449, 681402588, 681381454, 682909851, 684937134, 682634964, 682318192, 687333450, 685712891, 680694046, 684390717, 685822220, 686586380, 684405746, 682105179, 684855652, 686039352]
3730.2F86039352M667130k50855p443771N718384J907730n685196p95670J997681L41034
3738.9F86495819J388321L176498m198684Q27484J1201477q84399j9056321N318375
3746.6F84268570L627853M661026N06592r971695R364090p69272q888015L938293M184036
3755.3F90921478L486786n215759N11169O917496m892960l755722K533341R35974J06125
3763.9F91547928L220367j257782m418945J639557L811798J433945p487412O74133
3771.7F89163589K935410M30222P64007l83301j41525P3547L411561J965255p497558
3780.3F90721207L7079J345977Q35190K543945j876449j630325J291046J264419O25000
3789F95157089l97186k92893l93676L03421n32913M07486L740386k281265n250702
$$ y = [686039352, 690706482, 690455627, 683011856, 688730240, 690637970, 684952774, 684157104, 686154785, 686495819, 687884140, 691060638, 686861954, 687689438, 698890915, 698006516, 678950195, 684268570, 687896423, 692557449, 693064041, 683092346, 692456436, 691687164, 682799149, 686737442, 690921478, 694408264, 689192505, 689703674, 696621170, 691728210, 687972488, 690505829, 691441803, 691547928, 694768295, 693510513, 689091568, 690731125, 694542923, 695976868, 688489456, 689163589, 692098999, 692529221, 693293228, 692909927, 692768402, 692841949, 696253510, 698218765, 690721207, 690758286, 692104263, 692939453, 695483398, 693606949, 691976624, 693267670, 694532089, 695157089, 694759903, 694467010, 694073334, 694376755, 693843842, 694251328, 697991714, 695710449, 690459747]
3797.7F90459747N57328L241043O079788j665268q770447L47519J220856L627395N919724
3806.4G01017685n601196n574036L139648J570511L68500J22223m65851N44281M351654
3815.1F99473419L209152j2335739Q74253M058609L184356L353119j3117904M7607
3822.8F88746872L785553J439056K801133J624755m222793r78699J931915K140580
3830.5F97268372J555862p866364J076432O908035m958572j024475P418441n710373
3838.2F94667358n577545O893540j864090j899262N119629j361236m264603J635589
3845.9F93349380J419526r2926J024932j426544K51923O483765j632386L871613j2143326
3854.6F91105957m966202Q906479j69525l135223J016006K113037L723602l753433
$$ y = [690459747, 691017075, 694258118, 700337906, 698672638, 689902191, 690249710, 691470566, 695097961, 701017685, 695416489, 689842453, 692982101, 694552612, 694921112, 695043335, 694577484, 695121765, 699473419, 702682571, 690346832, 691221085, 695279694, 698464050, 701817169, 688699265, 688746872, 692532425, 693971481, 696772614, 698397369, 694174576, 693195877, 695127792, 697268372, 698824234, 690957870, 692034302, 698942337, 693983765, 692959290, 700377731, 694667358, 689089813, 695983353, 694119263, 692220001, 697339630, 695978394, 691713791, 693349380, 694768906, 694675980, 695700912, 694274368, 694526291, 701010056, 699377670, 703249283, 691105957, 686139755, 695046234, 694876709, 691741486, 692757492, 694870529, 698594131, 694840698]
3862.3F94840698j972961N251999k865448o207199K206802M407349O177902l457260
3870F98381882r523316J330185N211945O212845r034958k233658L463058o79397J649246
3878.7F94777832M765549k887802p389374M068985J860733Q56247O330642r614334
3886.4F92768478j992645K264328l80249M158173J816711o924286K94266L375473j652756
3895.1F93727493p51342O02569J771393K621155q292313L072357L894196m504090M059525
3903.8F96200943q17032k162933l03955K10190J457977q72574j60065J56479m22439
3912.5F93286591k68784j53580Q73795K465134j463318m344864L219375J856537l801956
3921.1F91668930M39377J215896J063157m10843k502365O46743J557465Q07114j372834
$$ y = [694840698, 692867737, 698119736, 695254288, 689047089, 691253891, 695661240, 701839142, 698381882, 688858566, 690188751, 695400696, 701613541, 692578583, 690344925, 693807983, 693128586, 694777832, 699543381, 696655579, 689266205, 693335190, 695195923, 696052170, 702382812, 692768478, 690775833, 693040161, 692659912, 696818085, 698634796, 691710510, 692004776, 695380249, 693727493, 692976151, 693578720, 695350113, 697971268, 689678955, 692751312, 696645508, 692141418, 696200943, 695383911, 693220978, 692917023, 693127213, 694585190, 693712616, 693552551, 693709030, 693286591, 693017807, 692864227, 693738022, 696203156, 694739838, 690394974, 693614349, 695470886, 691668930, 692108307, 693324203, 694387360, 693976517, 691474152, 692120895, 693678360, 694485474, 693112640]
3929.8F93112640j08261L513794k376327l360596J706467K34604p4616K59399l56521
3938.5F92550583m730p12967J016769K088394k085571j051941O02570M36706J216889
3947.2F94056702j684189j74027J089173k067490P59506J301422l04184n18264m67301
3955.8F91991348L84751j65406N8899k78244K45667J006164r72824o01730M34036K67029
3965.5F92369690J3962q0796J71128m10080l79105J082916M85154j014023k0371N72205
3975.1F92790680j44959n06439K56958N29785o3705m03137m50440L98636J38855k85644
3984.8F92260590l85590m20837j76926K6550J212082k79312j110535J71280K86560
3993.5F91583862O08139m03213J94168Q68759m4937j68839m59518
$$ y = [693112640, 693004379, 696518173, 694141846, 690781250, 692487717, 692722321, 692647705, 692907104, 692550583, 692545853, 691832886, 692849655, 694938049, 692852478, 691800537, 692403107, 692839813, 694056702, 692372513, 692198486, 693287659, 691220169, 691979675, 693281097, 692976913, 692458649, 691991348, 692376099, 692210693, 692269592, 691991348, 692237015, 693243179, 692270355, 691668625, 692102661, 692369690, 692383652, 692302856, 692473984, 692063904, 691684799, 692767715, 693252869, 692238846, 692218475, 692790680, 692645721, 692139282, 692396240, 692926025, 692862320, 692459183, 692008743, 692407379, 692546234, 692260590, 691875000, 691454163, 691277237, 691303787, 692515869, 692236557, 691126022, 691297302, 691583862, 692192001, 691788788, 691982956, 692851715, 692806778, 692637939, 692178421]
4000.2F92178421
$$ y = [692178421]
##END=$$ End of the data block
