##TITLE=$$ Begin of the data block
##JCAMP-DX=5.00 $$ ACD/SpecManager v 10.08
##SPECTROMETER/DATA SYSTEM=Varian
##DATE=18 Dec 2012 14:02:36
##DATA TYPE=INFRARED SPECTRUM
##DATA CLASS=XYDATA
##ORIGIN=
##OWNER=
##NPOINTS=3735
##FIRSTX=399.26403809
##LASTX=4000.35498047
##MAXX=4000.35498047
##MINX=399.26403809
##MAXY=85.40670013
##MINY=37.59661865
##XFACTOR=1.0000000000
##YFACTOR=0.000000100000000
##FIRSTY=70.51177216
##DELTAX=0.96440572
##XUNITS=1/CM
##YUNITS=TRANSMITTANCE
##XYDATA=(X++(Y..Y))
399.3G05117722Q771362N523147J0896683L219757j3020172o505279P780609Q158722
407G29942551K691955N370255n267716n668335M26178N46570n040436j0635681L978043
415.7G16343384k09198r221497p367325M95453J6508103O477585R093780j385117o301422
424.3G24433746j785659p286301K49100M781875M528885j283340o176606l04946M144668
433G21301422k04391j539612k168503o957550M876938N642624l479843k203751M484558
441.7G19751892N031357l373718k965393l442765K353211M867248l651428m952240
449.4G13618164j844711N395889O22101k436829J443405M50592O46439l085937j766663
458.1G13042450k634125r29413K509003r5596L48282J378021k412338l582535M218902
$$ plain form
399.3 705117722 713889084 719412231 730308914 733528671 720508499 714003220 721783829 729942551
407 729942551 732634506 738004761 732737045 727068710 727494888 728041458 723001022 712365341 716343384
415.7 716343384 716134186 706912689 699545364 700040817 716548920 723026505 732120285 730735168 724433746
424.3 724433746 722648087 715361786 715610886 720392761 724921646 723638306 717461700 717156754 721301422
433 721301422 721097031 719557419 717388916 710431366 715308304 720950928 717471085 715267334 719751892
441.7 719751892 724783249 721409531 718444138 715001373 717354584 722221832 718570404 713618164
449.4 713618164 711773453 717169342 717791443 715354614 716798019 717248611 717895050 714809113 713042450
458.1 713042450 710408325 709478912 711987915 711892319 712240601 713618622 711206284 707623749 711842651
466.8G11842651K453919n83725j002121j313553M955750n72205n225906n773011n288315
475.5F99493484J83182K699890N352631M325256N796585J89820p02744n41229q127975
484.1G08668900k466431J81503L803101L339081j881867J447678K699661j366577k06986
492.8G14218063M215165j453782l395843J21841P14875J269455n61982r99527j344070
501.5G12784195k090912J468124L240128j689224n34210K226104m311218j028290p29294
510.2G09335403j379776K74353k136459o08215n35584R76410j191864j623764L069229
518.9G06179733k413940k305756J529694k83127k658157j463623J131897N66940k14920
527.5G00068741l33023M68521M87137Q9645L49579m0131j616592j878662O12717L05023
$$ plain form
466.8 711842651 714296570 713712845 712710724 711397171 716352921 715780716 710554810 704781799 699493484
475.5 699493484 699676666 702376556 707729187 712054443 717851028 718040848 717338104 716796875 708668900
484.1 708668900 706202469 706383972 710187073 713526154 711644287 713091965 715791626 714425049 714218063
492.8 714218063 718433228 716979446 713583603 713705444 714420319 715689774 715127792 714128265 712784195
501.5 712784195 710693283 712161407 715401535 713712311 713178101 715404205 711092987 710064697 709335403
510.2 709335403 707955627 708229980 706093521 705485306 704949722 705926132 704734268 703110504 706179733
518.9 706179733 703765793 701460037 702989731 702706604 700048447 698584824 699716721 700283661 700068741
527.5 700068741 699735718 700204239 700691376 700781021 701130600 701090469 699473877 697595215 698207932 698512955
537.2F98512955n93643k47345P31811J380158K96936J240234J722641J482468N3405
545.9G04579620p86438n64193j780548p51877J157379J487579O34613J82724l32412
554.5G03826447O28128K231140K9144j262512n62287l77960o64673J066590K205200
563.2G07119217k72675l99017k7008O20880Q80432j024399j017685j89819p45010k220612
572.9G02724304p84759R49173k91443j54953k78092q53653M83170J760178m58l80936
582.5G03172531O37589k74659p81173j440964k48642K38800l74222J391983L85742
591.2G02706985K73896J764755P24487l95431j047592j278687k198563j103439k27280
599.9F99219131k163238j745682j156921j679001k174683l056411l467179l484192
$$ plain form
537.2 698512955 697919312 697671967 698403778 699783936 700080872 701321106 703043747 704526215 704579620
545.9 704579620 703793182 703228989 701448441 700696564 701853943 703341522 703976135 704158859 703826447
554.5 703826447 704454575 706685715 706714859 705452347 704890060 704512100 703847427 704914017 707119217
563.2 707119217 706846542 706447525 706420517 707041397 707921829 706897430 705879745 705689926 704944916 702724304
572.9 702724304 701939545 702888718 702597275 702442322 702164230 701310577 701793747 703553925 703553467 703172531
582.5 703172531 703810120 703535461 702754288 701313324 701064682 701303482 700929260 702321243 702706985
591.2 702706985 702980881 704745636 705470123 705074692 704027100 702748413 700549850 699446411 699219131
599.9 699219131 697055893 695310211 694153290 692474289 690299606 687243195 683776016 680291824
607.6F80291824m814758p275085q444977r329910j0263978j0546455o990738m871025
615.3F17754898l178444R02672l13797r36356j914253m819641p462959o983795l106385
624E89941940K37351P104568J2231369J3621369J1681595R876480Q911819N570755
631.7F59177246R11713k009125l581543n978775n711136n307770m716911k046509K014580
640.4F32751770Q251572J1299591J3018341J1691131J0317994R265441P238160O055832
648.1G09889832L713760J294556J737823J801148J191101J338272R53521J114884R17740
656.8G23952637L35464N29404J782455J037979q11615j01699J445160K038726P95975
665.4G31004486J762314k81525j2738189O529464N162964K166214N57022p019J625366
$$ plain form
607.6 680291824 675477066 668201981 659757004 650427094 640163116 629616661 622625923 617754898
615.3 617754898 614576454 615479126 615165329 614228973 612314720 607495079 600032120 593048325 589941940
624 589941940 590179291 597283859 609515228 623136597 634818192 644694672 653606491 659177246
631.7 659177246 660088959 658079834 654498291 648519516 642808380 637500610 632783699 630737190 632751770
640.4 632751770 641003342 652302933 665321274 677012405 687330399 696595840 703834000 709889832
648.1 709889832 713603592 714898148 716635971 718437119 719628220 720966492 721920013 723034897 723952637
656.8 723952637 724288101 724817505 726599960 727637939 726826324 726724625 728169785 730208511 731004486
665.4 731004486 732766800 732485275 719747086 726276550 731439514 733605728 734162750 734155731 735781097
674.1G35781097O46286o1721j143876J74561N45883j444702J452332K667770J078491
682.8G39696121r10339r62372J8539q64563n19332j089859j197968p14874j454621
691.5G32000732q86688q4686M50516L34243o41708j680450j481171n09949o98547o63986
701.1G26138306K13699J60446r89075k78930J503982J655197J358643J262817J312714
709.8G32337799J257782J488876J032105P3318J88141L58582R83352J510849J643296
718.5G40874100J867904R46732J149216J661148M89044N52521M99801p21893j197205
727.2G46121368o52008k32849j131363j349029j1749P31277l06778n35965J9150J39465
736.8G42791519N35278l70483q31833q24508j025849J23367J83106l09525J344605
$$ plain form
674.1 735781097 736427383 736365662 735221786 735396347 735942230 734497528 735949860 738617630 739696121
682.8 739696121 738785782 737823410 737841949 736977386 736458054 735368195 734170227 733455353 732000732
691.5 732000732 731114044 731029358 731479874 731814117 731172409 729491959 728010788 727500839 726802292 726138306
701.1 726138306 726352005 726512451 725523376 725244446 726748428 728403625 729762268 731025085 732337799
709.8 732337799 733595581 735084457 736116562 736189880 736378021 736736603 737719955 739230804 740874100
718.5 740874100 742742004 743688736 744837952 746499100 746988144 747540665 748040466 747318573 746121368
727.2 746121368 745469360 745236511 744105148 742756119 742744370 743475647 743168869 742632904 742652054 742791519
736.8 742791519 743326797 742956314 742124481 741299973 740274124 740397491 740580597 740271072 741615677
745.5G41615677L363266K975311J826477K328720K660294J119766N1651J766815K326737
754.2G60034714Q88214O28738K103043L138962K554168K948380J981811J02082n42679
762.8G73837433r73511j161957j399307l39737l19748o30493R6130R07975R71603k52533
772.5G70735855o6070Q26416J648864P58286k95334M58679J083756J613235J184082
781.2G77947769K375260K593917J431809J621246J418076J376571p03888o18286P00760
789.9G88143234m45328p84378k65579P22656M77982O43005J067582P50198J043625
798.5G91352997N58319q85239j424560L5858j26038j506653j097183p095O48346J476135
808.2G89024887J255798Q95997J615982P7972k61765M19693j31301j233597k126618
$$ plain form
745.5 741615677 744978943 747954254 749780731 752109451 754769745 755889511 755941162 757707977 760034714
754.2 760034714 760922928 761551666 763654709 766793671 769347839 772296219 774278030 774380112 773837433
762.8 773837433 772863922 771701965 770302658 769962921 769643173 769012680 769108810 770016785 770988388 770735855
772.5 770735855 770669785 771496201 773145065 773903351 773608017 774066696 775150452 776763687 777947769
781.2 777947769 780323029 782916946 784348755 785970001 787388077 788764648 788060760 787442474 788143234
789.9 788143234 787697906 786913528 786647949 787370605 787848587 788491592 789559174 790309372 791352997
798.5 791352997 791911316 791026077 789601517 789637375 789511337 788004684 786907501 786900406 787548752 789024887
808.2 789024887 790280685 791176682 792792664 792870636 792608871 793028564 792897263 791663666 789537048
816.9G89537048J98288N23453M9820Q09631O14243N06439M57840P51495j176757j890259
826.5G90381241j404801j897811k054825k208710j989670k826385k146759q93784q49457
835.2G74109039j692886k550812k194366l064423l101272k067032k257004l058701
842.9G54122543k476349q91113N29938J335907L32794K18430J360244J963959K095184
851.6G58591537J450577Q58689Q93249J796265K031097K002869J888733J896591K755432
860.3G74165039K380371K060089J419068Q45031N62210j89209j52435M41742Q70133
868.9G82402039m25492j05743J785889K161941P30896L18832J417771M25339L69110
877.6G89080582r47800k024078j216126k003860j695710j799163j356430q67844j331940
$$ plain form
816.9 789537048 789735336 790258789 790308609 791118240 791732483 792238922 792696762 793448257 792271500 790381241
826.5 790381241 788976440 787078629 785023804 782815094 780825424 777999039 775852280 774958496 774109039
835.2 774109039 772416153 769865341 767670975 764606552 761505280 759438248 757181244 754122543
842.9 754122543 751646194 750755081 751285019 752620926 752953720 753172150 754532394 756496353 758591537
851.6 758591537 760042114 760900803 761794052 763590317 765621414 767624283 769513016 771409607 774165039
860.3 774165039 776545410 778605499 780024567 780869598 781431808 781242599 781090164 781531906 782402039
868.9 782402039 781976547 781870804 783656693 785818634 786549530 786868362 788286133 788711472 789080582
877.6 789080582 788132782 786108704 784892578 782888718 781193008 779393845 778037415 777169571 775837631
886.3G75837631j103973p22504n49316k28348M60434j092453j706696j28860Q10089
895G71576004J019135R30023P50885k49253J98288K27051r1705K63138p94602q25805
904.6G73003159q06122j856003k313614j061859o41785j655731k604065k233658j046142
913.3G58784180k711182k550735j143647j706466k117691k582550j537171n94177j144791
922G42695770j865387j811447j547394j519012j094513r21249o78635k36511r3842
930.7G32927780l52707P61414J369400L47442P26777J487274K065353J988526K368545
939.3G43689804K538986J815796K932511K827606K519531K338333J504898J373825
947.1G61541290R12552J748123J239701O17675J028824R29489K12861r65882j88904
$$ plain form
886.3 775837631 774733658 774011154 773461838 773233490 773693924 772601471 770894775 770765915 771576004
895 771576004 772595139 773525162 774276047 774026794 774225082 774452133 774360428 774623566 773828964 773003159
904.6 773003159 772197037 770341034 768027420 766965561 766323776 764668045 762063980 759830322 758784180
913.3 758784180 756072998 753522263 752378616 750672150 748554459 745971909 744434738 743840561 742695770
922 742695770 740830383 739018936 737471542 735952530 734858017 733936768 733258133 733021622 732927780
930.7 732927780 732575073 733336487 734705887 735053329 735780106 737267380 739332733 741321259 743689804
939.3 743689804 746228790 748044586 750977097 753804703 756324234 758662567 760167465 761541290
947.1 761541290 762453842 764201965 765441666 766059341 767088165 768017654 768230515 767264633 767075729
955.7G67075729l54080p18536j037369j440277j545029k358703j574173k036057k528915
964.4G53482590j972046j989823j290588j025238r56497j045532j084137o56510q05588
973.1G42656631p93380l09677q63343j189193k64893n9662m77142j306992j114349
981.8G36278000k99530j131745j604614j414871j905136k324906j817932j889801k831649
990.5G21057816k843399l015366n541763r039231j0884170q123932O57196P925415
998.2F90192566Q440781M632034J705551P41119L04337k24381j474533j238174J50528
1006.8G03229828k97470r73664o43386q09403j210861r63059j147995j411056j642990
1015.5F94129944j692734j149292j232834j912765k594223j660614p91626j904831
$$ plain form
955.7 767075729 766721649 766003113 764965744 763525467 761980438 759621735 758047562 756011505 753482590
964.4 753482590 751510544 749520721 748230133 747204895 746248398 745202866 744118729 743462219 742656631
973.1 742656631 741863251 741553574 740690231 739501038 739236145 739176483 738699341 737392349 736278000
981.8 736278000 735978470 734846725 733242111 731827240 729922104 727597198 725779266 723889465 721057816
990.5 721057816 718214417 715199051 709657288 700618057 689733887 681609955 682267151 690192566
998.2 690192566 698633347 703265381 704970932 705712051 706016388 705792007 704317474 703079300 703229828
1006.8 703229828 702932358 701958694 701315308 700505905 699295044 698331985 697183990 695772934 694129944
1015.5 694129944 692437210 691287918 690055084 688142319 685548096 683887482 683095856 681191025
1023.2F81191025k561417j425171m31366r84726j853866k644730j916580j758347k553329
1031.9F65061493j603088j214753j181945j134263j537933j236877n23529j427918
1039.6F55201187j122665J78299o67725k74658m52957j118622l66821Q65020J112595
1048.3F53353653O83975J275482Q28247Q51899M34951Q21762J205292l66287l7842
1057F59051132M30069M75311m69894o88858l16162o10962j39236l06702L93143m85077
1066.6F57332764j172867n59235m3258L4790j888199j231308q09174j456451j433563
1075.3F48773499l69187Q48007m40673p83310j047974l00751m69284j156311k43759
1084F44810257q43887j093979j448746j852074k727508k459908k699318m249649m583168
$$ plain form
1023.2 681191025 678629608 677204437 676773071 675788345 673934479 671289749 669373169 667614822 665061493
1031.9 665061493 663458405 662243652 661061707 659927444 658389511 657152634 656629105 655201187
1039.6 655201187 654078522 654256821 653589096 653314438 652861481 651742859 651376038 652241058 653353653
1048.3 653353653 654037628 655313110 656141357 656993256 657428207 658249969 659455261 659088974 659051132
1057 659051132 659481201 659956512 659486618 658797760 658481598 657870636 657731400 657424698 657817841 657332764
1066.6 657332764 656159897 655600662 655557404 655592194 653703995 652472687 651663513 650207062 648773499
1075.3 648773499 648404312 649252319 648811646 648028336 646980362 646679611 646210327 645054016 644810257
1084 644810257 643966370 642872391 641423645 639571571 636844063 634384155 631684837 627435188 622852020
1092.7F22852020o249199o242637o810532p523422q266869r012947q088646q656425
1100.4E62001343q625260j0973968j0290718r885483j0120964r237671j0747681r180488
1108.1D82939110j0554199r373932r286194p759323o294060p170258l270835l983193
1115.8D25247116r20715j204758k80151J784439N75180K434769J035499L321915J654968
1124.5D33648262J383667J566505M5739M25605j145134R04236j330948j168556k446899
1133.2D31882477l291817j644668m077759l069229l942528k538834m223556l746338
1140.9D05347748l178444m795647k296638m576950k219849l670273k968597j323014
1148.6C80318336k410049k42081j700019J412735Q6479J016006J434670R81254L187676
$$ plain form
1092.7 622852020 616602821 610360184 603549652 596026230 587759361 578746414 570657768 562001343
1100.4 562001343 553376083 542402115 532111397 522225914 512104950 502867279 492119598 482939110
1108.1 482939110 472384911 463010979 453724785 445965462 439671402 432501144 429230309 425247116
1115.8 425247116 424326401 423121643 422841492 424625931 425201111 427635880 428671379 431993294 433648262
1124.5 433648262 435031929 436598434 436644173 437069778 435924644 436828880 435497932 434329376 431882477
1133.2 431882477 428590660 426945992 422868233 419799004 415856476 413317642 409094086 405347748
1140.9 405347748 402169304 397373657 395077019 390500069 388280220 384609947 381641350 380318336
1148.6 380318336 377908287 377666206 375966187 377378922 377465401 378481407 379916077 380897331 384085007
1157.3C84085007J939621M256057J848717L309593M123116M370880N009728L241577
1165D12184296N652313M301376O030274N748787O884765P694931O343346Q192902O934280
1173.7D69967270Q545685P868576Q271522P804489P190171Q200798O803512P993737
1181.4E32645760O597595P106933O194077M998932N720749N016556N679321M632721
1189.1E78592644N335846M180107L886680M095078L132934L990593L026696M415207
1196.8F10655785M497566M685173M699097L635101M429092M046746M014434K702713
1204.5F43365707K818604K964020K330017K643280K097473K253952J595917K104187
1212.3F62173157K141571J922531K059402J304932J306458K53143O85882J023789R59549
$$ plain form
1157.3 384085007 386024628 390280685 392129402 395438995 399562111 403932991 408942719 412184296
1165 412184296 417836609 422137985 428168259 433917046 440801811 448496742 454840088 463032990 469967270
1173.7 469967270 478512955 486381531 494653053 502457542 509647713 517848511 524652023 532645760
1181.4 532645760 539243355 546350288 552544365 557543297 563264046 568280602 573959923 578592644
1189.1 578592644 583928490 588108597 591995277 596090355 599223289 603213882 606240578 610655785
1196.8 610655785 615153351 619838524 624537621 628172722 632601814 636648560 640662994 643365707
1204.5 643365707 646184311 649148331 651478348 654121628 656219101 658473053 660068970 662173157
1212.3 662173157 664314728 666237259 668296661 669601593 670908051 671161194 671847076 672870865 673830414
1220.9F73830414J062622O20804J046905M75922P77359R56650J154251P66067o8741
1229.6F80622253P54242O56739K42996k46124L76663R24072P94678O18973N95855J244736
1239.3F86585083L92532O91300N64804J63422L03039j75781M66842L7690K16674K28501
1248.9F89474106N85403J074600L52021N81436m1275L28369P23038N54428J27945k72751
1258.5F93487320N75561M52652Q13294M83932L44086N46036L07541R93728J043396
1267.2F99047546R46885M28161P70340R89227P08237J059418P96127Q37326J237793
1275.9G06821060J903534J384659J056747J257553J048966J227112J121750J496887
1283.6G17318268J219635J330261J312256O15311J654434K119980J382293P05796J260681
$$ plain form
1220.9 673830414 674893036 675513840 676560745 677036667 677814026 678770676 679924927 680690994 680622253
1229.6 680622253 681376495 682033234 682276230 682030106 682406769 683330841 684125519 684744492 685340347 686585083
1239.3 686585083 686977615 687668915 688233719 688397141 688700180 688524399 688991241 689028931 689245605 689474106
1248.9 689474106 690059509 691134109 691486130 692067566 692026291 692354660 693077698 693632126 693760071 693487320
1258.5 693487320 694062881 694515533 695328827 695812759 696156845 696702881 697010422 698004150 699047546
1267.2 699047546 699994431 700422592 701192932 702182159 702890396 703949814 704745941 705583267 706821060
1275.9 706821060 708724594 710109253 711166000 712423553 713472519 714699631 715821381 717318268
1283.6 717318268 718537903 719868164 721180420 721795731 723450165 725570145 726952438 727658234 728918915
1292.3G28918915J624374J082611J011048Q24737J231842J108856P17774R66949R60465
1301G38447571J177444J120682R09882M65545J39237P9651K03933O41556J49765M99725
1310.6G43834991Q75245N75866R65348L16619k4261O34994P18232L21350k29264m6157
1320.3G47942963R44214Q12835M26483O48270L13034N64041O67114P76444J086121
1328.9G54181519M89120J41144n34210k95792o5308k12173K83050j75018L44620O03561
1338.6G54760513j028289j594773P47986J475983L42636N951l49808l92990m08325
1347.3G53558884l91922k71378j58691L76205l08456J53351K54821o79474l06396j13754
1356.9G52113190o14395p51725M51126m17556o71921o25305k248230J391830J061478
$$ plain form
1292.3 728918915 730543289 731625900 732636948 733461685 734693527 735802383 736520157 737487106 738447571
1301 738447571 739625015 740745697 741655579 742121124 742260361 742340012 742543945 743185501 743335266 743834991
1310.6 743834991 744710236 745286102 746251450 746568069 746543808 747178802 747897034 748218384 747989120 747942963
1320.3 747942963 748887177 749700012 750126495 750774765 751087799 751651840 752318954 753095398 754181519
1328.9 754181519 754670639 754811783 754277573 753981781 753916473 753704300 753987350 753812332 754156952 754760513
1338.6 754760513 753732224 752137451 752885437 754361420 754704056 754710007 754360199 753967209 753558884
1347.3 753558884 753166962 752895584 752736893 753113098 752804642 752957993 753212814 752533340 752226944 752113190
1356.9 752113190 751498795 750747070 751198196 750780640 750108719 749483414 747235184 748627014 749688492
1365.6G49688492m44184J67695j100235j600800m90723l25012K44064m32968k909622
1374.3G42796707k255859L76205J313553J2665k33841M5471p98797m37699r95560q72955
1383.9G38949890k11105J324539J165161k455521J336823K079086M69513J17264O61163
1392.6G43436813J803971j567612l502197O68716R50852m46244l889312p67060J711045
1401.3G38398972J77383K18430P29827k455596r24378J380234K40936j8387q45413
1409.9G36902008p95288o73294n51148K23847l2425J061401N66254Q52661K072373
1418.6G39626389o190644r4375L330459J327362K21482k768402L59954K143860K73743
1427.3G38229828J250763P83996j193161P98111J797562P48291K31934K963104K382660
$$ plain form
1365.6 749688492 749244308 749412003 748311768 746710968 746220245 745895233 746139297 745706329 742796707
1374.3 742796707 740540848 740917053 742230606 742243271 742009430 742054901 741256104 740818405 739822845 738949890
1383.9 738949890 738738785 740063324 741228485 738772964 740109787 742188873 742658386 742775650 743436813
1392.6 743436813 745240784 743673172 740170975 740839691 741790543 741344299 737454987 736687927 738398972
1401.3 738398972 738576355 738794785 739524612 737069016 736144638 737524872 737765808 737747421 736902008
1409.9 736902008 736106720 735433426 734882278 735106125 735073700 736135101 736701355 737554016 739626389
1418.6 739626389 733435745 733341370 736671829 737999191 738220673 735452271 735812225 737956085 738229828
1427.3 738229828 739480591 740264587 739071426 739869537 741667099 742415390 742647324 745610428 747993088
1436G47993088q714752m85230M228897J659012L88336Q69827N12467J376953J113510
1444.7G48942108M74167J899109k518l332977R77783K034607j30386r48944P17468
1453.3G50630417K513351L053131J660157m092408l618164J940232J894226K966308
1461.1G56947250R38187N45273K666244m376373j955032L130798J883316J431885K146149
1469.7G63357697M432296K788086k348404l330612K456589M265976k719040O77795
1477.5G69580383L236161J335983J742096m9362J60446J586532J146164J135941K043533
1486.1G81917877q44421k127075K638473l709335n527497K164536K187576J306992
1493.8G78007126K671509J442337r235688L459702K19345n310821K527008J18103j117325
$$ plain form
1436 747993088 739278336 738793106 743022003 744681015 745069351 745939178 746451645 747828598 748942108
1444.7 748942108 749416275 751315384 751312866 747979889 748957672 750992279 750861893 749912949 750630417
1453.3 750630417 753143768 756196899 757857056 753764648 750146484 752086716 753980942 756947250
1461.1 756947250 757885437 758430710 761096954 756720581 754765549 757896347 759779663 761211548 763357697
1469.7 763357697 767789993 770578079 768229675 764899063 767355652 771621628 768902588 769580383
1477.5 769580383 772816544 774152527 775894623 775845261 776005707 777592239 778738403 779874344 781917877
1486.1 781917877 781073456 778946381 781584854 777875519 772348022 774512558 776700134 778007126
1493.8 778007126 780678635 782120972 772885284 776344986 776564331 771253510 773780518 773898621 772781296
1502.5G72781296K2430K779007L697128o839218j3323669O84128M287872n31616K319870
1511.2G65877228j212616m405899J487579k59170k01950n295258n457993O930161N736771
1519.9G63198853l153992q966065j101913M238052M153519m423142j242904P48443
1527.6G53450851l013153Q6441J420365R13162L48282k958603p195892K528000K417373
1536.3G47996826K723923M885788m366379j2342224L127823N42450j554032K762909
1544G43777084j218719l582611L865204K034683K337875j763839m780732L329087L009338
1552.7G47007370K536011n981522Q49838P276001M799958j458664j7537003m08935
1560.4G37083054Q208465M933777K617416J238556k638931r44138K539292K760773
$$ plain form
1502.5 772781296 772803726 775582733 779279861 772440643 759116974 759801102 764088974 763557358 765877228
1511.2 765877228 764664612 760258713 761746292 761487122 761285172 755989914 750531921 757462082 763198853
1519.9 763198853 760044861 751078796 749976883 754214935 758368454 753945312 752702408 753450851
1527.6 753450851 750437698 750524139 751944504 752857666 753205948 750247345 743051453 745579453 747996826
1536.3 747996826 750720749 755606537 751240158 738897934 742025757 742568207 741014175 743777084
1544 743777084 742558365 738975754 742840958 744875641 747213516 745449677 740668945 743998032 747007370
1552.7 747007370 749543381 743561859 744411697 751687698 756487656 755028992 737491989 737083054
1560.4 737083054 745291519 750225296 752842712 754081268 751442337 750498199 753037491 755798264
1568.1G55798264P69653j0129089K627792L193436Q1863J134567K396164J187821j4079895
1576.8G42980576K597656K678222o56204o11801j484527k80076j177139o26373j608429
1585.5G41811905j698532p02820j483994r73358k305603j127014k158127j404037j870041
1594.1G28088379k703018m51584k475052j344986k065811j233597j866913k328720
1601.9G13618698r76944l308792j262741j256943j106262k884521j833649j882858
1609.6F99105988k973786j51520k135391j86539j093292J248017p1869j5550309L159562
1618.2F81350861O12793k6932j290207J253052o74515q684540J642838N24292J632690
1626.9F76340332m028168l701095Q61587r57412k26899j047592K527771K719498q895416
$$ plain form
1568.1 755798264 756567917 746438828 749066620 752260056 752341919 753476486 755872650 757060471 742980576
1576.8 742980576 745578232 748256454 747600250 746988449 745503922 745223846 744046707 743420334 741811905
1585.5 741811905 740113373 739410553 737926559 736953201 734647598 733520584 731362457 729958420 728088379
1594.1 728088379 725385361 724933777 722458725 721113739 719047928 717814331 715947418 713618698
1601.9 713618698 712641754 709332962 708070221 706813278 705707016 702822495 700988846 699105988
1609.6 699105988 696132202 695980682 693845291 693658752 692565460 693813477 693741608 678191299 681350861
1618.2 681350861 681963654 681936722 680646515 681899567 681225052 672540512 674183350 674707642 676340332
1626.9 676340332 672312164 668611069 669472656 668515244 668288345 667240753 669768524 672488022 663592606
1635.6F63592606l091507J731338R41696J368790J047668r92050J003952k74811K337571
1644.3F67665253L725280k173080k128296l713913L272629L149109M602966N978241
1652F80378189n008850j4851685N208664O597214K754822J500168J563034J664886
1659.7F79806442K089157K475434K0141k961731L896866L057633K335205L641281K929764
1668.4F97290192l887101m15878L992615p31583M374695O490555k93808m137192M313507
1677.1G06996002M282074K305985J986847q80509M276352O862946m04740j0553207
1684.8G14871750L152542Q036880M205399R53751K181244P04422L281173L214798L425980
1693.5G44027939N447769K770767r580536M853592Q484116P570724n248642r853210
$$ plain form
1635.6 663592606 660501099 662232437 663174133 664542923 665590591 664598541 665602493 665327682 667665253
1644.3 667665253 671390533 669217453 667089157 663375244 666647873 669796982 674399948 680378189
1652 680378189 675369339 660517654 665726318 672323532 675078354 676578522 678141556 679806442
1659.7 679806442 681895599 684371033 684391174 681429443 685326309 688383942 690719147 694360428 697290192
1668.4 697290192 693403091 692987213 696979828 696248245 700622940 707113495 706819687 702682495 706996002
1677.1 706996002 711278076 713584061 715570908 714690399 718966751 725829697 725424957 714871750
1684.8 714871750 718024292 726061172 730266571 731220322 733401566 734105988 737387161 740601959 744027939
1693.5 744027939 749475708 752246475 742665939 747519531 756003647 763574371 758325729 748472519
1701.2G48472519J2592392P765274L274918Q47244J177826q97599K368927M737931
1708.9G80339432J403045j6937K367401L067932L484574j228791j157455O273499K251663
1717.6G96784363j3775788M013520N523681K550125J748887k54898j199418J378861
1725.3G96769333J360474N33981J512985K713547k323151j100921N773773M912262
1733H10152283n661621j2965470P009506N273972J776047L462448l332138m711533
1740.7H01003494O290970L830261k279434J46561L620453K363052J485977m30603n17120
1749.4H15513611M790344j806869l087388M895173K658081K687912K531738l411789
1757.1H24770813O65588K284241K590332L699494n669861k031098L957291J104050
$$ plain form
1701.2 748472519 761064911 768830185 772105103 772952347 774130173 773232574 775601501 780339432
1708.9 780339432 781742477 781725540 784092941 787160873 790645447 789416656 788259201 794532700 796784363
1717.6 796784363 783008575 787022095 792545776 795095901 796844788 796589890 795390472 796769333
1725.3 796769333 798129807 798663788 800176773 802890320 800567169 799466248 805240021 810152283
1733 810152283 804490662 791525192 798534698 803808670 805584717 809047165 805715027 801003494
1740.7 801003494 807294464 811124725 808845291 808991852 812612305 814975357 816461334 816030731 815513611
1749.4 815513611 820303955 818497086 815409698 820304871 822962952 825650864 828182602 824770813
1757.1 824770813 825436401 827720642 830310974 834010468 828340607 826309509 830266800 831370850
1764.8H31370850Q38470K672730R97085m747925L536988N943527m94003q240433k723236
1773.5H29154053O527557J555100k761383K106552J141433J472321k33612k743836
1781.2H36218185J267472K334594J155472k254944r69772K052231O26907Q98667K047271
1789.9H43376083K75269m30145o067200m90036N469589P94831j573868J616668K470093
1798.6H45441284j246338k498855J782226j293258P3471J796417j0376P12280R4452
1807.3H44851303p07779J222458J302872k207794m69819P48139Q1406M33731j86768
1815.9H45067749P87277l76663K79160J230926k57568M41589m45862J813202K207413
1824.6H50747223m895706p80945L087387K750320j430282p592926K335968L370437
$$ plain form
1764.8 831370850 832209320 834882050 835879135 831131210 834668198 840611725 840117722 831877289 829154053
1773.5 829154053 835681610 837236710 834475327 836581879 837723312 839195633 838962021 836218185
1781.2 836218185 837485657 839820251 840975723 838720779 837751007 839803238 840430145 841328812 843376083
1789.9 843376083 843651352 843221207 837154007 836663971 842133560 842928391 841354523 842971191 845441284
1798.6 845441284 844194946 841696091 843478317 842185059 842258530 844054947 844044571 844756851 844851303
1807.3 844851303 844143524 845365982 846668854 844461060 843991241 844739380 844820786 845254517 845067749
1815.9 845067749 845855026 845478363 845757523 846988449 846730881 847172470 846726608 848539810 850747223
1824.6 850747223 845851517 845070572 848157959 850908279 849477997 841885071 844221039 847591476
1832.3H47591476K84424N25894N04303O55060p04880j037139R12933M5471L27683M28314
1842H49533539K634964K8610r403686L366088M285584k46506j434860M47616J180039
1850.7H50391388j29623o1188m40827k9754N2185r003M75464m1580L59878J43891J85623
1861.3H50896454j34735o8436J21307N68772J236038l21579M7302k901611l419418
1869.9H46024094K124099K184983R13009Q9722K18277N6686n5618l52249n50842k66037
1879.6H50386124j31150O17829r156K93198J79749k61994M34494L06702J763000n94024
1889.2H52984772m025116Q12912J237259J36947J056366p44247j403275J119614N57709
1897.9H51732941J7929R5367m3030J40458j99967L0289o47659n02167L50952O4239
$$ plain form
1832.3 847591476 847875900 848401794 848906097 849561157 848856277 847819138 848732071 848777542 849105225 849533539
1842 849533539 852168503 852197113 842793427 846159515 850445099 850198593 848763733 849211349 850391388
1850.7 850391388 850261765 850200577 849759750 849729996 849782181 849773178 850248642 850207062 850566940 850710831 850896454
1861.3 850896454 850761719 850693283 850814590 851383362 852619400 852297821 852345123 849443512 846024094
1869.9 846024094 848148193 850333176 851246185 851335907 851554184 851610870 851555252 851203003 850652161 850386124
1879.6 850386124 850254974 850872803 850863647 851156845 851336594 851074600 851509094 851815796 853578796 852984772
1889.2 852984772 848959656 849772568 851009827 851146774 852203140 851458893 850055618 851175232 851732941
1897.9 851732941 851750870 851846237 851803207 851943665 851743698 851773987 851126328 850624161 850975113 851039352
1907.6H51039352K83966L09906p56759j23673J068955K59476L62854n18265L75442
1916.2H52301254J765747m004593j986770J849747J324920J419754j998901j294632
1923.9H49376526J510620N59921R0637J76468k52304k77176l11889n76401k11411k37121
1933.6H49847870O0425M34570N91049J18180l99552K9068K65274J494599j274643l713837
1943.2H47453003J617355J205445r14460l86352N66177N54962j78070J30997M4174
1951.9H50093231j12991J00174r5215o16760m65927k8534o4926L80172J31607l08075
1961.6H49012756K7848O37283O30341K02560K10190j168289j274720K07901P4845j24436
1971.2H48436279j98593k00882J88904M95911N74646K14615j45798k43607m82178l85131
$$ plain form
1907.6 851039352 851323318 851633224 850876465 850752792 851821747 852081223 852444077 851925812 852301254
1916.2 852301254 854067001 850062408 848075638 849925385 851250305 852670059 850671158 849376526
1923.9 849376526 850887146 851447067 851537704 851714172 851461868 851184692 850872803 850296402 850084991 849847870
1933.6 849847870 849908295 850342865 850933914 851052094 850652542 850681610 850946884 852441483 851166840 847453003
1943.2 847453003 849070358 850275803 849361343 848974991 849541168 850096130 849918060 850049057 850093231
1951.9 850093231 849980240 850080414 849985199 849368439 848902512 848873978 848809052 849189224 849320831 849012756
1961.6 849012756 849040604 849677887 850308228 850510788 850720978 849552689 848277969 848485870 848560715 848436279
1971.2 848436279 848237686 848036804 848225708 848721619 849296265 849510880 849365082 849121475 848639297 848254166
1980.8H48254166k08588p47757o53992L0136L54310O12869M07944l72391k45819J349182
1990.5H48780060M11300k530059o80924Q46100K38266l22800n64422J77917J0147j13067
2000.1H46252518L55682M9667R4376L12271P553o89010m58832j65177k94799K03323
2009.8H45667572n0201j58081J38320l3111m2877M28924L61710n86777m41894l80326
2019.4H44903259j44577J18180m57154n27725l67203M36707P38525K70233N7297p8354
2029.1H44949188K6703l49426o69937o23093j27258n8975m07792O3935L66821L19443
2038.7H43489609L30429K78778m02222l42254J0299k52914J20315k53982m10385k12097
2048.4H42355576j13526J28861j91803j29547l586L33023O4697l2196J14288o67648
$$ plain form
1980.8 848254166 848045578 847297821 846643829 846673965 847028275 847641144 848049088 847676697 847430878 848780060
1990.5 848780060 849191360 846661301 845980377 846826477 847064743 846741943 846177521 846355438 846365585 846252518
2000.1 846252518 846608200 846657867 846752243 847064514 847072067 846383057 845924225 845759048 845464249 845667572
2009.8 845667572 845617371 845459290 845597610 845564499 845521622 845950546 846312256 845725479 845283585 844903259
2019.4 844903259 844758682 844876862 844419708 843891983 843524780 843961487 844700012 844970245 845027542 844949188
2029.1 844949188 844975891 844626465 843956528 843333435 843206177 843147202 842739410 842803345 843170166 843489609
2038.7 843489609 843820038 844098816 843696594 843354340 843364639 843111725 843232040 842978058 842567673 842355576
2048.4 842355576 842242050 842370911 842179108 842049561 842045975 842378998 842443695 842411499 842525787 841858139
2058H41858139o24313n99671j58539K27128J17187L70483j17111k88772p7057j1597
2067.6H40695877j02005j22833j36872m64172p26395r23309l31344J01242P3165K0981
2077.3H38084335j90506N3940L75595J60752m68140m11835k65045n54810l69110m0893
2086.9H36374283k2431K45667J32980o08215O7444L33252j14517R231j50299L22495
2096.6H36589890J99661k09351m883k5863M7989M44183P24335q9875l12881K10113
2106.2H37573318L37906J22147o1111j43815p64846k05002N22232M07715K46353J89743
2115.9H38224640N32303P1487k66647J10245K68097l75138n89371j65329l61022j84632
2125.5H37264633l14178j9913M71268J97677J36872o5689J68609K64893p8354m62570
$$ plain form
2058 841858139 841233826 840634155 840475616 840702744 840819931 841190414 841073303 840784531 840707474 840695877
2067.6 840695877 840593872 840471039 840334167 839869995 839143600 838220291 837888947 837990189 838063354 838084335
2077.3 838084335 837893829 837947769 838323364 838484116 838015976 837604141 837339096 836784286 836415176 836374283
2086.9 836374283 836351852 836597519 836730499 836122284 836189728 836522980 836408463 836417694 836267395 836589890
2096.6 836589890 836789551 836580200 836575317 836549454 836597443 837041626 837765961 837676086 837363205 837573318
2106.2 837573318 837911224 838033371 837972260 837828445 837063599 836858597 837380829 837788544 838034897 838224640
2115.9 838224640 838756943 838828430 838561783 838672028 838940125 838564987 837975616 837810287 837449265 837264633
2125.5 837264633 836950455 836930542 837401810 837599487 837736359 837670670 837839279 838104172 838025818 837563248
2135.1H37563248n12925M2038L93219l204k62985L97186K69547K59933L60870K80686
2144.8H38787613M05044m31289m18015l0365J73035p1259l56445M2496l6698N18113
2154.4H38582230M99191M5166j31149r3766L60260J70899O6299m36020m61425k04621
2164.1H38397064J984K66571K1896M44718N3405k05001J10092o638q2702k82135j52665
2174.7H38566589l37219l80020m03366O3248N20401J17874K96859L63541K66495k64130
2184.3H38810272n02624j27030L7155J10550k60696J18256N16128K73209J22299J59454
2194H39256973L79715N48554L54309k19422j52587k65961j37634J64032j41297q774
2203.6H39777908K29187M49372J93481J76468J58005Q3694K39868l45459j64260J03988
$$ plain form
2135.1 837563248 837050323 837092361 837485580 837482376 837219391 837616577 837886124 838146057 838506927 838787613
2144.8 838787613 839192657 838761368 838343353 838312988 838486023 838414764 838058319 838100815 838064117 838582230
2154.4 838582230 839081421 839126587 838995438 838901672 839261932 839432831 839499130 839063110 838601685 838397064
2164.1 838397064 838399048 838665619 838687515 839132233 839185638 838980637 839090729 839084091 839001389 838719254 838566589
2174.7 838566589 838229370 837849350 837445984 837509232 838029633 838147507 838444366 838807907 839074402 838810272
2184.3 838810272 838307648 838180618 838217773 838328323 838067627 838185883 838702011 838975220 839097519 839256973
2194 839256973 839636688 840185242 840539551 840320129 840167542 839901581 839763947 839927979 839786682 839777908
2203.6 839777908 840007095 840456467 840649948 840826416 840984421 841068115 841307983 840962524 840798264 840902252
2213.3H40902252m7531o2332K53372L63007k11182k09885q2092L39356Q8272m16184
2222.9H40917053l1280K64663n6381o86722R0332K79923n7221J56784r5825j88217
2232.5H40593109j10626M33044J29929r232n2795o58646k27890M9210J92871p9041
2242.2H40259933M3564J65482l79944r4223K37579K24533j77307L2502m8218l91464
2251.8H39872437J0147j87226M7684N33447J14212l51333J87454J73721k39563N493
2261.5H40166473M3412K81219J24359J60904l14178n70832K03171J61896o4774l99017
2271.1H39792633J56784J56403j36948K9526j12534M67835q5526l22571k21939J48392
2280.8H39872055N13001r385L51792j72653l02277l42484k94494J83716J40533O06384
$$ plain form
2213.3 840902252 840854721 840792389 841045761 841408768 841197586 840987701 840905609 841244965 841333237 840917053
2222.9 840917053 840885773 841150436 841094055 840407333 840497665 840777588 840720367 840877151 840781326 840593109
2232.5 840593109 840482483 840915527 841045456 841036224 840983429 840324783 840096893 840146103 840338974 840259933
2242.2 840259933 840303497 840468979 840089035 839994812 840232391 840456924 840279617 840312119 840263901 839872437
2251.8 839872437 839882584 839695358 839743042 840276489 840390701 840039368 840226822 840400543 840160980 840166473
2261.5 840166473 840209885 840491104 840615463 840776367 840462189 839891357 840094528 840256424 840191650 839792633
2271.1 839792633 839949417 840105820 839968872 839998398 839885864 840353699 840268173 839945602 839723663 839872055
2280.8 839872055 840385056 840375671 840727463 840554810 840252533 839910049 839615555 839799271 839939804 840546188
2290.4H40546188j78222k05231j25046k36435Q3542n0888L38364k8992M01688k33002
2300H40311966l86276M00695l23257K24228j20544l9521j46942m19998J92718l88412
2309.7H39304657k05612l74069M49295J47705q20008l72314n59769M48990J0376k4414
2319.3H38004837J01395n60303K72140o6680m17939m02145J07880N722R7808j93100
2329H36949615o99005P29370k01644r58634o39725j525J082077N39856j49460Q9492
2338.6H36740417n56106j407089N62744J058731J128158L16620j364059N40619l54614
2347.3H36665421M99649K680816J010208o37970o98471q39157o85119j329880o22711
2356H36042786J6250p23877l01056n39856n93566O57501K4109n01404N4474P80410
$$ plain form
2290.4 840546188 840367966 840162735 840037689 839801254 839884796 839833908 840172272 840143280 840544968 840311966
2300 840311966 839925690 840326385 840003128 840227356 840106812 840067291 839920349 839500351 839693069 839304657
2309.7 839304657 839099045 838724976 839174271 839321976 838501968 838129654 837569885 838018875 838029251 838004837
2319.3 838004837 838106232 837545929 837818069 837751389 837333450 836931305 837039185 837044907 837142715 836949615
2329 836949615 836250610 836979980 836778336 835819702 835179977 835178452 836260529 836800385 836650925 836740417
2338.6 836740417 836184311 834777222 835339966 836398697 837526855 837843475 836479416 837020035 836665421
2347.3 836665421 837165070 839845886 840856094 840218124 839519653 838680496 837995377 836665497 836042786
2356 836042786 836059036 835335159 835034103 834494247 833900681 834558182 834582291 834080887 834135361 834915771
2365.6H34915771J566926P42416k55737O7291J95465k77634m02298N59082J248398
2374.3H38359680K11868p2174L86658N81360N05829m8828L88183N41687K77558J31759
2383.9H41263580k57492P4311K17437J32141R1629J069n7679r6283K13852L3646n29251
2394.6H41086960n25818J26343K72827M41360K48490q09937l75213J68151K62604J89591
2404.2H41085358k55432q3008j0224J45951K8228M1886j66092o09970k07215k21405
2413.8H39748077K11182N15289j78756m23966r1400L75061L08228j46561j35880J96610
2423.5H40377884j87378m30985k99301o7291K51846j39389J1750P1334j99813j05210
2433.1H39283447l13720n0431K85340r8343o32019l22419Q6060K02789J53656l05633
$$ plain form
2365.6 834915771 836482697 837225113 836969376 837036667 837232132 836954498 836552200 837111282 838359680
2374.3 838359680 838571548 838499374 838886032 839467392 839973221 839924393 840312576 840854263 841131821 841263580
2383.9 841263580 841006088 841080399 841297836 841429977 841521606 841522675 841464996 841368713 841582565 841616211 841086960
2394.6 841086960 840561142 840687485 840960312 841401672 841650162 840840225 840465012 840633163 840895767 841085358
2404.2 841085358 840829926 840746918 840736694 840882645 840910873 840952759 840786667 840176697 839969482 839748077
2413.8 839748077 839959259 840474548 840295792 839871826 839780426 840155487 840463715 840317154 840181274 840377884
2423.5 840377884 840190506 839759521 839460220 839392929 839644775 839505386 839517136 839588470 839388657 839283447
2433.1 839283447 838969727 838919296 839204636 839106293 838474274 838151855 838237915 838440704 838594360 838288727
2442.8H38288727r9030k7771J7319n4169l94516K46048N3940q18176m46778J91956
2452.4H36957550J06659K86407L73993l03878j57624K88925k9373j11007o028l13720
2462.1H37091904k65656k78244m32434O0196L8452k20337j35193J53656M00391K50244
2471.7H36662979j18179q18634p54471k66419M120J62125k23084j33209L69492K44522
2481.3H35129242j9836K82287m58n68924l21807j74942k78626m36783k57644M653J53
2492H33357315K8076K70539K09655l99017p6675L15780K6245m30069m53949N7526j00479
2502.6H32804947q0795j46027k22092R308L5172K16827K1057r2621l16314l13111j92108
2513.2H31724243k31170N1116q0795j49536n55878r9563N86166o4926P8812J97143
$$ plain form
2442.8 838288727 838189697 838161926 838179245 838125076 837730560 837976608 838030548 837212372 836765594 836957550
2452.4 836957550 837064209 837350616 837724609 837420731 837263107 837552032 837522659 837411652 837405624 837091904
2462.1 837091904 836826248 836548004 836115570 836175766 836214218 835993881 835858688 836012344 836412735 836662979
2471.7 836662979 836544800 835726166 834971695 834705276 834709396 834871521 834648437 834515228 834884720 835129242
2481.3 835129242 835109406 835391693 835391235 834822311 834500504 834325562 834046936 833610153 833352509 833357162 833357315
2492 833357315 833385391 833655930 833865585 833466568 833389893 833705673 833731918 833301849 832847900 832905426 832804947
2502.6 832804947 832724152 832578125 832356033 832365341 832400513 832617340 832638397 832545776 832229462 831916351 831724243
2513.2 831724243 831493073 831544189 831463394 831313858 830757980 830658417 831244583 831179657 831258469 831455612
2522.8H31455612r994j92185m57687k96860j20697m9972k7924K45743J11389j41449
2532.5H30515976j74027R0638J76468m06876p5760O10k11563j10016l77426k31476
2542.1H29196548k92358o1035K63061J76926K52380L129l7385j48925k66953j39541
2551.7H28945847m97895m11911J59836O7825k42691k3346K27890R4834r5673k00500
2561.4H28024216m5777J52512n1956l52249n29786k87246K3117j48697j04294R6893
2571H26776733O9199J00098K20260J00022m7684k58713o86493n08346r2392J88522
2580.7H25861206j08871m31900J69372K04468J59378O5002k47497M8675L9978k94113
2590.3H25465698o98395j14822K75498o21186m81415R8420K07901J77841N4550j63193
$$ plain form
2522.8 831455612 831445618 831253433 830795746 830498886 830378189 830328217 830300293 830546036 830657425 830515976
2532.5 830515976 830341949 830432587 830609055 830202179 830126419 830127029 829915466 829805450 829428024 829196548
2542.1 829196548 828904190 828843155 829106216 829283142 829535522 829538651 829501266 829352341 829085388 828945847
2551.7 828945847 828447952 828036041 828195877 828263702 828021011 827997665 828225555 828320389 828224716 828024216
2561.4 828024216 827978439 828130951 828078995 827726746 827196960 826909714 826932831 826784134 826679840 826776733
2571 826776733 826845932 826946030 827166290 827266312 827218628 826959915 826273422 825765076 825672684 825861206
2580.7 825861206 825752335 825320435 825489807 825694275 825853653 825918655 825671158 825719833 825759811 825465698
2590.3 825465698 824767303 824652481 824927979 824306793 823825378 823923798 824131699 824309540 824364090 824200897
2600H24200897l62167Q774J39846j12686k94952n59311n33295j19552J9378k53906
2609.6H22133026n9738J53732l2348J72958o4697k98844M3793n80368o98242r9182
2619.3H20670090j41068j907Q9798L62396K57568l32489l99475j89743K0218l32794
2628.9H20002594m04129k83127l54309k46277j84402j0605j35040K56042O17294J61972
2638.5H19420013m73251p57370q6212L3417l78342n54504l93753j06736m9667K06451
2648.2H16860046m5166j42135L7689K2736j68381m20380k67105k85950r7503n32837
2657.8H14961014p78733M1886K68402L19977m4708j20697J78146k31094k68326n8976
2667.5H14266891l04870l68271r2392l28979l40500J89895L81546j526k17132K45437
$$ plain form
2600 824200897 823838730 823847504 823987350 823874664 823579712 823020401 822487106 822367554 822386932 822133026
2609.6 822133026 822073288 822227020 822194672 822367630 822302933 822004089 822047882 821467514 820769272 820670090
2619.3 820670090 820529022 820527115 820616913 820979309 821236877 820904388 820504913 820315170 820335388 820002594
2628.9 820002594 819598465 819315338 818961029 818714752 818530350 818519745 818384705 818640747 819258041 819420013
2638.5 819420013 818946762 818189392 818103180 818136597 817758255 817203751 816809998 816703262 816653595 816860046
2648.2 816860046 816814880 816672745 816710434 816733170 816564789 816144409 815877304 815591354 815493851 814961014
2657.8 814961014 814182281 814224167 814492569 814812546 814767838 814647141 814825287 814594193 814325867 814266891
2667.5 814266891 813962021 813593750 813501358 813172379 812831879 813021774 813403320 813401794 813184662 813430099
2677.1H13430099k6855j48239l9368p59048p50885m59824l89023L7232J73950Q3618
2686.8H11151657K03858j7014j35574L0059n7144o4239m46167n49545l38212l50112
2696.4H09427567j29471K8686K29569m1199j15967K85492O6223m10690n26047k0981
2706H08793182M3946m03443n92880m06723j74484j36643K47116J49460k56958k13852
2715.7H07048721p0953o7291k36283k53524l97721m68216m44030l38440K5940K16598
2725.3H05014801K54211M7379k02560j87302P7209j11389p45697p70645l81393O027
2735H03000641K5940r9335N0202P4310o1417j37329M9973P5073j63574j02616k79846
2745.6H02432022p19528m77982J41297R8114m44794P0343L80173n72052k83203J49307
$$ plain form
2677.1 813430099 813403244 813255005 813215637 812456589 811705704 811245880 810856857 810894089 811068039 811151657
2686.8 811151657 811355515 811338501 811202927 811232986 811175842 811111603 810665436 810115891 809777679 809427567
2696.4 809427567 809298096 809326782 809556351 809515152 809399185 809684677 809750900 809340210 808814163 808793182
2706 808793182 808837128 808433685 807840805 807434082 807259598 807122955 807370071 807519531 807262573 807048721
2715.7 807048721 806977768 806910477 806674194 806420670 806022949 805554733 805110703 804772263 804798203 805014801
2725.3 805014801 805269012 805316391 805113831 804926529 805003738 804892349 804146652 803376007 802994614 803000641
2735 803000641 803026581 802927246 802977448 803051758 802990341 802853012 802902985 802978058 802814484 802711868 802432022
2745.6 802432022 801712494 801234512 801375809 801473923 801029129 801099472 801479645 800907593 800624390 800773697
2755.2H00773697j63651l04718n56717l13644l00522k52075l88260p20673j18255L75824
2764.9G98031006N84411J24512l36380r3002k89917o01730k96326j6022l11432l09982
2774.5G96485138m21448k54745N7449k72675l8299N9204p3700k46735j80816k87171
2784.2G94826202r50241o13174l75900j46714O8741j96380j4801K36587J87454l60412
2793.8G92661362k99759n59082r04999k76108n15899n24598j1367J2283l20053m19693
2803.4G88842087K8991O2943m1046k63443p26547n57633p7591n41153p24106l59878
2813.1G85642624o81992k80304J05667j23367o6910K16599M6158j140595j246490n13306
2822.7G81958084j40915l63464r80377l52402j3809l50647k72064k59705o7520l40576
$$ plain form
2755.2 800773697 800610046 800305328 799748611 799434967 799134445 798882370 798494110 797773437 797655182 798031006
2764.9 798031006 798615417 798739929 798403549 798310547 798020630 797418900 797122574 797106552 796795120 796485138
2774.5 796485138 796063690 795808945 795866394 795593719 795555420 795614624 795540924 795294189 795113373 794826202
2784.2 794826202 793875961 793262787 792886887 792740173 792808914 792612534 792597733 792834320 793021774 792661362
2793.8 792661362 792361603 791802521 790897522 790621414 790105515 789580917 789569550 789581833 789261780 788842087
2803.4 788842087 788871078 788934021 788892975 788629532 787902985 787345352 787267761 786726608 786002502 785642624
2813.1 785642624 784960632 784680328 784785995 784662628 784595718 784812317 784858475 783717880 782471390 781958084
2822.7 781958084 781817169 781453705 780473328 780120926 780107117 779756470 779484406 779224701 779157181 778816605
2832.4G78816605p04880m19846m20990p32269q51822o47736o91680j072159r29489
2841.1G72345734j003800j237488r43222o31561n95779j253891j522446j446228j763001
2849.7G61948318j567916j063538n32455n59235k48718N68771L68576O7139L9902K99224
2859.4G59320068p8277j070557r40094l50571m6539k86407p15180o39724l56598m03672
2869G54432449m94003l57361m07715j78756k12326o98929q10013m67835O0959o1111
2878.7G50805359k50321k56423m35257l59040j33056M1809l18680o33164o20269q14667
2888.3G47026291q00629p96203n86777k69394m08707m23355n04532m11224l56751n48324
2897.9G41920395J89972J03073r61838j096496q63038j85470j63422r77554o13022
$$ plain form
2832.4 778816605 778111725 777691879 777270889 776538620 775686798 775039062 774347382 773275223 772345734
2841.1 772345734 771341934 770104446 769161224 768529663 767933884 766679993 765157547 763711319 761948318
2849.7 761948318 760380402 759316864 758784409 758225174 757976456 758545227 758913803 758980942 759020844 759320068
2859.4 759320068 759241791 758171234 757231140 756880569 756834030 756547623 755832443 755192719 754836121 754432449
2869 754432449 753938446 753581085 753173370 752994614 752782288 752083359 751273346 750805511 750866470 750805359
2878.7 750805359 750555038 750298615 749863358 749504318 749371262 749413071 749094391 748461227 747840958 747026291
2888.3 747026291 746225662 745429459 744842682 744573288 744164581 743741226 743236694 742825470 742468719 741920395
2897.9 741920395 742110367 742213440 741251602 740155106 739292068 739106598 738943176 737965622 737352600
2906.6G37352600L56217J79138r05533q85010j48392k09884q36869j036071m92783
2915.3G33373413o28738r27887q08335j140899r11560l57209p5378J56708l85971l74375
2925G27919769K63291k29340l52173L75443P49588J99051n05448j15432j6709K63138
2934.6G28551178P22809J4801J42975Q60824L09983k65732K84576M68216J97678K78778
2944.2G31566086J85699M80576K80762n03083j88980J73035P9269O7673n67703j024704
2953.9G30548630o66123l74298j44653j34888J8769o6453k96096J00555M7836O32706
2963.5G29665985R38263M044q7510L78571O83136J36642K05155J181183R97543M63562
2973.2G34566574O07147R12781K98004K47421O77109L53241P43332P53098J44348J33285
$$ plain form
2906.6 737352600 737708817 737887955 736982422 736097412 735949020 735739136 734902267 733866196 733373413
2915.3 733373413 732744675 731816788 731008453 729867554 728955994 728598785 728523407 728680115 728294144 727919769
2925 727919769 728183060 727953720 727601547 727976990 728726578 728925629 728420181 728304749 728288040 728551178
2934.6 728551178 729273987 729288788 729431763 730292587 730602570 730336838 730621414 731089630 731287308 731566086
2944.2 731566086 731751785 732232361 732513123 732010040 731821060 731994095 732073364 732141037 731573334 730548630
2953.9 730548630 729882507 729508209 729363556 729228668 729247437 729180984 728884888 728985443 729033279 729665985
2963.5 729665985 730604248 730608292 730520782 730899353 731582489 731719131 731924286 733105469 734103012 734566574
2973.2 734566574 735173721 736086502 736384506 736631927 737309036 737662277 738405609 739158707 739303055 739436340
2982.8G39436340N06211Q62579O94427M56086K97241J86081L99628O25305M95376N01404
2992.5G44460678O65817L4638m77143L8224M98428M40827r2164l03344K79617K18201
3002.1G45763779k98157k33612J20926n188m74320k45819K39640L25698k94418m72641
3011.7G44425888m2496k09732M1275j1520k51923k51236m17404j04599j17340j50375
3021.4G42910538l98407m09394K1134j88599j56708l43170n17273j29547m6234m99802
3031G40242538m44870K96708K1667m87900k69012k03629n68542n14374j53427m39453
3040.7G37479706o34613j07193J33362k02256l13797p34176o73294m62036n47486K04010
3050.3G34142227j66626l32947k34527o11572k4033l82996o76040k44980k35596n38025
$$ plain form
2982.8 739436340 739942551 740805130 741499557 741955643 742252884 742438965 742838593 743463898 743959274 744460678
2992.5 744460678 745126495 745161133 744683990 744722214 745220642 745661469 745569305 745265961 745545578 745763779
3002.1 745763779 745465622 745232010 745352936 745347748 744873428 744627609 744867249 745192947 744898529 744425888
3011.7 744425888 744383392 744173660 744214935 744203415 743951492 743700256 743282852 743178253 743060913 742910538
3021.4 742910538 742512131 742102737 742123871 741935272 741778564 741435394 740918121 740788574 740742340 740242538
3031 740242538 739797668 740094376 740116043 739628143 739359131 739155502 738586960 738072586 737919159 737479706
3040.7 737479706 736845093 736737900 736871262 736669006 736355209 735621033 734947739 734485703 733938217 734142227
3050.3 734142227 733975601 733642654 733408127 732796555 732772522 732389526 731713486 731468506 731232910 730694885
3060G30694885m86450k63290l15323P5760n02243l61939J18408p18612p96128m37240
3069.6G27007828K1972l53469n09873j77994k05536k3651l18451k17285k54898l78418
3079.2G24590225l73611k01111O9275o77490q50830m70276r2926l00599k51617K96860
3088.9G21737900k62985l71247l82767n24749k96555k72369p02896o64978K09045M3793
3098.5G18512192j90430p31811j089097m80728l61251m8600k00653j41601P8964l64075
3108.2G14982910l43857m52957p53708q54034m45023J78299j53885r25293n08422K29568
3117.8G10953598k94418r37348l29208R7275j033860j531066o15006K36969K8153p45469
3127.5G05829620n13687l70636n50308n48935r3307m69056j380081n43899l22113m32434
$$ plain form
3060 730694885 730208435 729945145 729629822 729705582 729203339 728841400 728959808 728241196 727445068 727007828
3069.6 727007828 727029800 726676331 726166458 725988464 725782928 725759277 725440826 725223541 724968643 724590225
3079.2 724590225 724216614 724015503 724084778 723407288 722556458 722086182 721993256 721692657 721441040 721737900
3088.9 721737900 721474915 721103668 720720901 720196152 719899597 719627228 718924332 718259354 718468399 718512192
3098.5 718512192 718321762 717589951 716500854 716020126 715658875 715610275 715409622 715268021 715346985 714982910
3108.2 714982910 714639053 714186096 713432388 712578354 712133331 712311630 712157745 711232452 710724030 710953598
3117.8 710953598 710659180 709721832 709392624 709489899 708456039 706924973 706309967 706546936 706575089 705829620
3127.5 705829620 705315933 704945297 704394989 703846054 703752747 703283691 701903610 701359711 701037598 700605164
3137.1G00605164p7744o8970o15844j560822q67310j74179k91137j58768k6245j62277
3146.8F96601868p51953q39997q26034p52564n35278o25229n99442m47845n38101m56391
3156.4F90229034j70211m58374o02265o95190n46265m60358j022338r08585l24631
3165.1F85040817j69067p66678q57162p12052l19519J19782p62177p63092m86603p23800
3174.7F79600449p05491R92k42843j730652o07834j19782n21469l35464n12238p7438
3184.4F74748230p28683j169892r29870o41861n70679o14319r3994n87158q38623m37546
3194F68135605n5390l87496o56052m36325r60236r93118j068497n51529l75519q20465
3203.6F61830978l42559j54267o103j85166o33774j261138r96018l78723k77863J5336
$$ plain form
3137.1 700605164 700527420 700458450 699842606 698281784 697414474 697240295 696949158 696790390 696764145 696601868
3146.8 696601868 695849915 695009918 694183884 693431320 692896042 692270813 691671371 691223526 690685425 690229034
3156.4 690229034 690058823 689600449 688998184 688302994 687756729 687296371 686274033 685365448 685040817
3165.1 685040817 684871750 684105072 683247910 682535858 682216339 682336121 681573944 680810852 680324249 679600449
3174.7 679600449 678894958 678895950 678653107 676922455 676314621 676194839 675673370 675337906 674825668 674748230
3184.4 674748230 674019547 672849655 671919785 671277924 670707245 670092926 669998932 669411774 668573151 668135605
3194 668135605 668080215 667692719 667036667 666600342 665640106 664646988 663578491 663026962 662651443 661830978
3203.6 661830978 661488419 661334152 661328049 661142883 660509109 659247971 658251953 657873230 657595367 657610703
3213.3F57610703j210328j192627j61972l95889l87192o06079q54111m66232L9520
3222F52375793k23770l87649n61447n59311l55225r45892q13599p72476p53098j01394
3231.6F46901932J66549m11529q50678m86068o78864p13501q55942o57730k02636m80576
3241.3F41730957o01578j90429L07922p46689p63779n59768q62351k7466m88166j74713
3250.9F37623940k4109m91333p42607j326867l55644m78096q35457j21803n7220n15709
3260.5F32675095p89986j42212K24342j27716n93414o97937p85294p55539m11338L9138
3270.2F28635139L82n35545q49457j155358J53122K43493q70820m35028n44700j85814
3279.8F24455414l40500o38352l31192m44908m01191n48668Q7013j16234q92219p91779
$$ plain form
3213.3 657610703 656400375 655207748 655045776 654649887 654262695 653656616 652802505 652336273 652375793
3222 652375793 652152023 651764374 651202927 650643616 650288391 649342499 648528900 647756424 647003326 646901932
3231.6 646901932 647068481 646656952 645806274 645320206 644641342 643927841 643071899 642414169 642211533 641730957
3241.3 641730957 641129379 640938950 641246872 640500183 639736404 639176636 638314285 638286819 637798653 637623940
3250.9 637623940 637599831 637108498 636365891 635039024 634683380 634205284 633369827 633248024 633190804 632675095
3260.5 632675095 631885109 631742897 631967239 631839523 631246109 630548172 629762878 629007339 628596001 628635139
3270.2 628635139 628635521 628099976 627250519 626095161 626248283 626491776 625620956 625185928 624641228 624455414
3279.8 624455414 624114914 623476562 623145370 622700462 622299271 621750603 621837616 621721382 620829163 620037384
3289.5F20037384K27814O93283q44650j368065j115113j32866M71764p07474j116371
3298.2F16145706j85318L24402o06842o56891o45866p53212j25504j08566m3488o29539
3307.8F12714882r25751p98187n21431l2196l61939n88646n22766n48553q98056l94211
3317.4F07123146l56636q28018m35753m98886k74048p14951p70530l01323p64313q38356
3327.1F01340332q37440m11530k85683o91375j257248r98879r8839m35714m80728o58112
3336.7E95184784r86748m16755j55678o97785r95903n73463o10085q73336j115723
3345.4E88759308o38008O256j33820n42335j198960q93478j37520n7602p88231j358909
3355.1E83016701j084328n43938k58331r81941r52568m49219p92122r07554l48130
$$ plain form
3289.5 620037384 620265198 620958481 620113831 618745766 617630653 617497787 617969551 617262077 616145706
3298.2 616145706 615960388 616284790 615677948 615021057 614375191 613621979 613496475 613387909 613344421 612714882
3307.8 612714882 611789131 610990944 610469513 610437317 610075378 609486732 608963966 608415413 607517357 607123146
3317.4 607123146 606766510 605938492 605502739 605003853 604729805 604014854 603244324 602943001 602178688 601340332
3327.1 601340332 600502892 600091362 599805679 599114304 597857056 596858177 596759338 596323624 595842896 595184784
3336.7 595184784 594198036 593781281 593625603 592927818 591931915 591358452 590748367 589875031 588759308
3345.4 588759308 588121300 588127556 587993736 587451401 586252441 585358963 585221443 585163841 584375610 583016701
3355.1 583016701 581932373 581388435 581130104 580148163 579195595 578746376 577954254 577046700 576698570
3363.7E76698570n2566j041107j187973n20478m90265q38432j086655n37262l63693
3372.4E70580139p29713m35105j03798q87527j294785j069984n56946J42250n04837
3381.1E65139694m52156j61514o31523q15048r50661k54898m84429q72879k85759j49154
3390.7E60081673k19536q92182j047821j79634K05574N4360l76053q41103o43272k38113
3400.4E55903893l47596m38652l26042K3842j13983n83306j20697o8893p86858n49926
3410E52591782l79715m27781K71225K40975l90778q51898m53148J30539J17684K38914
3419.7E51087799o17752o19926P514k68249k63863m31785p2289K42043j06735j64032
3429.3E48792725L78875R8229l60985J35269j60408j8692L58162N16167N0125l74985
$$ plain form
3363.7 576698570 576646004 575604897 574416924 573896446 573406181 572567749 571481094 570943832 570580139
3372.4 570580139 569850426 569415321 569311523 568423996 567129211 566059227 565502281 565644531 565139694
3381.1 565139694 564687538 564526024 563894501 563079453 562128792 561873894 561389465 560516586 560230827 560081673
3390.7 560081673 559862137 558969955 557922134 557742500 557948074 558002434 557626381 556785278 556142006 555903893
3400.4 555903893 555556297 555117645 554791603 554815445 554701462 554118156 553997459 553928566 553141708 552591782
3410 552591782 552212067 551784286 552055511 552296486 551905708 551053810 550600662 550731201 550848885 551087799
3419.7 551087799 550470047 549850121 549857635 549589386 549325523 548893738 548821449 549063492 548956757 548792725
3429.3 548792725 549171600 549269829 548908844 549044113 548883705 548865013 549223175 549739342 549789467 549414482
3439E49414482K63062J82991R0789p42454j59035O20232O79283Q37288j648636q0910
3448.6E49457092J345825L61863O47392j78261Q9035O07338N68543L84063K49520O01883
3458.2E54134293J32446l7956J33133N73310L49007J20277N44892J092949P17468j31035
3467.9E57628784P86171N86357l0899k26097L16429J139107O6414P9346O53762P03469
3477.5E61702843M33273O88858J156921M80538q08792j001778J819115J963997P08809
3486.2E67143784N50117r32274m72069Q71926J283455J131515J437340O73637K92015
3494.9E71979446J107064p30706j42288J294136O93512M97666J054001R46388p28226
3503.6E75970993K37923J148185Q80661J436768J549950q77953j316643J553727O08177
$$ plain form
3439 549414482 549677544 549860535 549951324 549208870 549049835 549670067 550349350 551186638 549538002 549457092
3448.6 549457092 550802917 551164780 551812172 551633911 551722946 552330284 552898827 553282890 553532410 554134293
3458.2 554134293 554266739 554228783 554361916 554935226 555284233 555404510 555949402 557042351 557759819 557628784
3467.9 557628784 558414955 559001312 558970413 558744316 559060745 560199852 560266266 560345612 560999374 561702843
3477.5 561702843 562136116 562824974 563981895 564462433 563653641 562651863 564470978 566434975 567143784
3486.2 567143784 567693901 566761627 566289558 567161484 568444939 569576454 571013794 571687431 571979446
3494.9 571979446 573086510 572355804 572213516 573507652 574201164 574698830 575752831 576699219 575970993
3503.6 575970993 576208916 577357101 578237762 579674530 581224480 580346527 579029884 580583611 581191788
3512.2E81191788M18968J001854P34100J104126Q60062P33414L62014Q00247J221467
3520.9E88428040J873741L56903j387444J083412R81942M44069N56716P02324L66516
3529.6E93406219P15104J135559P39174J140327M05655J913452N77164j261749J333580
3538.3F00104485P57713J209755J389732J385079J133957J040344N42907p94754N12200
3547F07281418j052323J661606K095604J982918J849632k794342J385002J507416J484718
3555.6F15401649J800576n3215K206611Q46787L31230L94249K325859R95483K79198
3564.3F24528427N304299j689263k363014j100502k52800N305977J579399J264725
3572F32577248K211151J243858o26945M19731J688041J30959K612762P95060M83703
$$ plain form
3512.2 581191788 581610756 582612610 583346710 584450836 585310898 586044312 586406326 587206573 588428040
3520.9 588428040 590301781 590658684 589271240 590354652 591336594 591780663 592337379 593039703 593406219
3529.6 593406219 594121323 595256882 595996056 597136383 597542038 599455490 600032654 598770905 600104485
3538.3 600104485 600862198 602071953 603461685 604846764 605980721 607021065 607563972 606769218 607281418
3547 607281418 606229095 607890701 609986305 611969223 613818855 611024513 612409515 613916931 615401649
3555.6 615401649 617202225 617149010 619355621 620202408 620533638 620927887 623253746 624249229 624528427
3564.3 624528427 629832726 628143463 625780449 624679947 624427147 629733124 631312523 632577248
3572 632577248 634788399 636032257 635405312 635825043 637513084 637644043 640256805 641051865 641535568
3580.7F41535568K263031K021637J041031J280365O363220O81076n099640p96737j678238
3589.4F47611313M558945L561401K968750L17383J012573L925095l906403K630463
3597.1F62679520L537140n23148L163986p68814j72577K129212J422958K847748M026871
3605.8F78342896J729660j808701L883209l032532N69077J0236053j472320m314804
3613.5F84132538L140259k048188O340638N126724j832886O59638l229752O14700M201889
3622.2F97105560K812958K254105L564682K851562K803116P641373q120423j7755508
3629.9F93157425R702301R083404P279206j152878l759155L959961M762420K168045
3637.6G25200729r20639J335297K802887K406464K37121J81122L685532N151367O080398
$$ plain form
3580.7 641535568 643798599 645820236 646861267 648141632 654504852 655185928 650086288 649289551 647611313
3589.4 647611313 652170258 655731659 658700409 659017792 660030365 663955460 660049057 662679520
3597.1 662679520 666216660 665693512 668857498 668088684 667916107 670045319 671468277 674316025 678342896
3605.8 678342896 680072556 678263855 682147064 679114532 679683609 689919662 688447342 684132538
3613.5 684132538 687272797 685224609 691565247 696691971 694859085 695518723 692288971 692903671 697105560
3622.2 697105560 699918518 702172623 705737305 708588867 711391983 719033356 710912933 693157425
3629.9 693157425 702859726 711943130 719222336 718069458 714310303 718270264 723032684 725200729
3637.6 725200729 724280090 725615387 728418274 730824738 731061859 731242981 734928513 740079880 746160278
3646.3G46160278m294586l694687N230255n909576n683212J595001P860641N106049
3654G46370163N561142L397522j4641190M321900O760635J089401J664429L48053J878586
3662.7G56750641M52118J317978J124649J035156O239319K393646k140274m300842
3670.4G62872391j0658646P258072J3107681J1446762q560257k7197036R673309J1482849
3678.1G69425125M144058o092224K76337M166794K156143R72290o96945Q59833N811996
3686.8G81023407O274109j5217438j384048Q207702j3659210L112488P967224p8506
3694.5G76245728J119613j38092K4643J577683Q59222L703461K500152r739456j968231
3703.2G74184723O735992J571732k25449J58158M451217L584519j0999222O772461
$$ plain form
3646.3 746160278 741865692 738171005 743401260 737491684 731808472 733403473 741264114 746370163
3654 746370163 751931305 755328827 740687637 745009537 751770172 752859573 754524002 754872055 756750641
3662.7 756750641 757202759 758520737 759645386 760680542 766919861 769313507 767173233 762872391
3670.4 762872391 752213745 759471817 772579498 784026260 775466003 748268967 757942276 769425125
3678.1 769425125 773569183 767476959 767753296 771920090 774076233 775048523 774351578 775211411 781023407
3686.8 781023407 787297516 772080078 770696030 778903732 765244522 768357010 776324234 776245728
3694.5 776245728 777365341 777227249 777251892 778829575 779688797 783392258 785892410 776152954 774184723
3703.2 774184723 780920715 782492447 782266998 782425156 786876373 790460892 779461670 786234131
3710.9G86234131O48804j7542038R710388N054321m17404J752701L621216L88107n475388
3719.6G83974838L136750P644729q398514n454788P882996J97143j993560l973160
3727.3G83016434J450729N051346K162933P277832q057708o953660J3555832m941101
3735G92562637j4460983K741699L403931J338272M423447K854843n445252O649094
3742.7G94067688J3033752k7004547j1583709J7144470P996902P519608q119049j0230408
3750.4G82824707J3873749j6686173n818786J1137161P413864K851410p460480M669419
3758.2G92804871L846511j4277267J383209O726761J761704J673660L884353o208724
3765.9G91595078n320969O175461O750030k806930j3610611L880462M082566q8578
$$ plain form
3710.9 786234131 786882935 769340897 779051285 784105606 783688202 785440903 789062119 789450226 783974838
3719.6 783974838 787111588 794756317 786357803 780903015 788786011 788983154 786989594 783016434
3727.3 783016434 784467163 789518509 791681442 798959274 790901566 783947906 797503738 792562637
3735 792562637 778101654 780843353 784247284 785585556 790009003 792863846 787418594 794067688
3742.7 794067688 807101440 780096893 768513184 785657654 793654556 801174164 793055115 782824707
3750.4 782824707 796698456 780012283 774193497 785330658 792744522 795595932 788135452 792804871
3758.2 792804871 796651382 782374115 783757324 790484085 792245789 793919449 797803802 791595078
3765.9 791595078 786274109 792449570 799199600 796392670 782782059 786662521 790745087 790656509
3773.6G90656509J123124P0877J317443J220093L752365l874206j1219940N614090
3781.3G88660355L840713K414856K032776o128769j534576J639938J077805K27661
3789G92230759l45459R15069R3613O14929L45764K800064K888871p898026l994903
3797.7G87650681M841003P064056N723038j6665878j2679672P970352O246414Q180008
3805.4G98330002M329986j8881225j155930Q197022J983566K41394N48477N46036L616333
3814.1G97755661P680969j1050949j6913223J3491516Q819962O104507l000870k7826156
3821.8G75061417N818634Q059768M117508L860245j560211p354050J742172M833527
3829.5G94579010M796295k015838j3048249P736206Q276215j0120010L048400R487229
$$ plain form
3773.6 790656509 791779633 791850510 793167953 794388046 798140411 794266205 783046265 788660355
3781.3 788660355 792501068 794915924 796948700 790819931 789285355 790925293 792003098 792230759
3789 792230759 791885300 792800369 792893982 793508911 793854675 796654739 799543610 791645584 787650681
3797.7 787650681 792491684 799555740 805278778 788612900 775933228 783903580 790149994 798330002
3805.4 798330002 802659988 783778763 782622833 790819855 792803421 793044815 793593292 794139328 797755661
3814.1 797755661 805436630 794385681 777472458 790963974 799783936 805888443 802887573 775061417
3821.8 775061417 780880051 788939819 793057327 796917572 795357361 788003311 789745483 794579010
3829.5 794579010 799375305 797359467 784311218 792047424 800323639 790203629 793252029 802739258
3837.2H02739258j6322708j007614J0729064j0535888K545395Q881225o573333l310776
3844.9G87144623N563507J308670j90888K186890j735458M698257Q457947r135056
3852.7G98298492n067215k8869628J2791366J5060425l665390j068573L565445L985901
3860.4G95030823K656402p458725L210831P414093j4627685m981156Q970947Q607254
3868.1G98822784O031800j8786316r361801J0503845J0021667j35040j6157532N317765
3875.8G86257172N939712N66406M247818M841233j2693177p934188J0338287K054138
3883.5G93617401M021225K967987k0998154N014725O728897K733078N684357m816055
3891.2G94953461j2257691M597855L973541k040710K654648K028808L900452j638870
$$ plain form
3837.2 802739258 786416550 785408936 796138000 785602112 788147507 797028732 790455399 787144623
3844.9 787144623 792708130 794016800 793825912 796012802 794277344 798975601 807433548 798298492
3852.7 798298492 793231277 764361649 777153015 792213440 788548050 787479477 791044922 795030823
3860.4 795030823 797687225 790228500 793439331 800853424 786225739 781244583 790215530 798822784
3868.1 798822784 804854584 786068268 776706467 787210312 797231979 797096939 780939407 786257172
3875.8 786257172 792196884 792763290 797011108 801852341 789159164 781224976 791563263 793617401
3883.5 793617401 797638626 800606613 779608459 784623184 791352081 794085159 799769516 794953461
3891.2 794953461 782695770 787293625 791267166 789226456 791881104 793909912 797810364 796171494
3898.9G96171494j2998810R910507M77753o050187P061539n922546l205490M32434
3906.7G85876694K343368L041382p70187p1793q6441K41089K72446O85196K491531
3915.3G94023285J086807p234878k761231P053147j820298m544754M527130K730332
3923.1G93059540j908n753021k647095M277421K428360J533966r25751N9128J077499
3931.7G93108139m976425j010056K462235r7122j66550K82288j20087k29K46887K400208
3941.4G92129288l29666p197037M15268L415451K795257Q58536m405823J684113j57471
3950.1G89207916k936477K733154q7738r59549L77273R57261j7624j130905J020507
3958.7G89163818K54441J072387n63812k615967J123581J108933o89316o51093J156311
$$ plain form
3898.9 796171494 783172684 793083191 793560944 787510757 794572296 788649750 785444260 785876694
3906.7 785876694 788220062 791261444 790491257 790419464 790333023 790574112 790846558 791531754 794023285
3915.3 794023285 795110092 787875214 785113983 792167130 790346832 785802078 790329208 793059540
3923.1 793059540 793057632 787304611 784657516 788934937 791363297 792897263 791971512 792030640 793108139
3931.7 793108139 788131714 787121658 789583893 789486771 789320221 789602509 789482422 789482193 789729080 792129288
3941.4 792129288 791799622 784602585 785017853 788433304 791228561 792087097 787681274 789365387 789207916
3950.1 789207916 786271439 789004593 788916855 787957306 788334579 789291840 789274216 788143311 789163818
3958.7 789163818 789418259 790490646 789926834 787310867 788434448 789543381 788854065 788202972 789359283
3967.4G89359283Q37632j778412l84522J437836k36359r74044K43454o638j24130l62931
3977.1G88011169p33795l128L72544Q49304O15768k91443L84598M10385r17892l13950
3986.7G88383560K69318L59497O85348p29446j362000n44281J177521J038971r28726
3995.4G88349762J08414N51147k90756m81644n73044
4000.2G87663879
$$ plain form
3967.4 789359283 790196915 788418503 788033981 789471817 789235458 788261414 788504868 788498230 788374100 788011169
3977.1 788011169 787277374 787274246 787646790 788496094 789111862 788820419 789205017 789615402 788697510 788383560
3986.7 788383560 788652878 789012375 789697723 788968277 787606277 787061996 788239517 789278488 788349762
3995.4 788349762 788458176 789009323 788718567 788236923 787663879
4000.2 787663879
##END=$$ End of the data block
