##TITLE=$$ Begin of the data block
##JCAMP-DX=5.00 $$ ACD/SpecManager v 10.08
##SPECTROMETER/DATA SYSTEM=Varian
##DATE=18 Dec 2012 14:13:46
##DATA TYPE=INFRARED SPECTRUM
##DATA CLASS=XYDATA
##ORIGIN=
##OWNER=
##NPOINTS=3735
##FIRSTX=399.26403809
##LASTX=4000.35498047
##MAXX=4000.35498047
##MINX=399.26403809
##MAXY=81.38368225
##MINY=15.83641434
##XFACTOR=1.0000000000
##YFACTOR=0.000000100000000
##FIRSTY=70.88697052
##DELTAX=0.96440572
##XUNITS=1/CM
##YUNITS=TRANSMITTANCE
##XYDATA=(X++(Y..Y))
$$ plain form
399.3 708869705 719535141 714160080 710765381 713214874 716938019 718536530 716490097 716978378
407 716978378 713130951 704241714 699979095 700909729 707326660 714961929 720175247 723560715 720472641
415.7 720472641 714919128 713940430 701683807 698864288 706288605 704140015 708749084 713269501
423.4 713269501 710829468 711648483 713401031 714841461 712995987 710846786 711798172 709413223 704760895
432.1 704760895 701904449 703787308 707850647 706237640 711256714 719589310 720143738 719099960 716904678
440.7 716904678 711874924 707410736 708244553 702845535 696923752 703959198 708831100 708038635 707933731
449.4 707933731 706546097 708354797 709379654 705606537 699678650 696193924 694660721 689660110
457.1 689660110 688305588 703231506 710123062 705090485 705314178 706889877 706618729 708291550 703506393
$$ packed form
399.3G08869705J0665436n375061l394699K449493L723145J598511k046433M88281
407G16978378l847427q889237m262619R30634O416931P635269N213318L385468l088074
415.7G20472641n553513r78698j2256623k819519P424317k148590M609069M520417
423.4G13269501k440033Q19015J752548J440430j845474k149201R51386k384949m652328
432.1G04760895k856446J882859M063339j613007N019074Q332596N54428j043778k195282
440.7G16904678n029754m464188Q33817n399018n921783P035446M871902p92465j04904
449.4G07933731j387634J808700J024857l773117n927887l484726j533203n000611
457.1F89660110j354522J4925918O891556n032577K23693J575699k71148J672821m785157
$$ plain form
465.8 703506393 697173386 691459579 691886215 697022171 699325027 697521057 692712936 696341858 699734955
474.5 699734955 697473907 692117538 694729767 698061218 694028244 695841064 700490952 704696732
482.2 704696732 707959747 706691437 706636734 707844543 707292175 703489685 700075302 699085770 698528595
490.9 698528595 698587799 700737534 702333679 705182419 712559814 715765152 715652161 714520416 713216629
499.6 713216629 713132477 706520615 700091171 700793228 698199692 697248077 700145111 702085419 703293915
508.2 703293915 704942627 704797668 700958710 696523361 695043411 694484863 695398026 695061569 691837921
516.9 691837921 692049561 692973785 694984055 697974625 699487762 698438034 693852539 692051849 690145721
525.6 690145721 686206055 685697479 686618805 689020233 690757446 692443771 694356461 695597992 696080856
$$ packed form
465.8G03506393o333007n713807M26636N135956K302856j803970m808121L628922L393097
474.5F99734955k261048n356369K612229L331451m032974J812820M649888M205780
482.2G04696732L263015j268310n4703J207809n52368l802490l414383r89532n57175
490.9F98528595N9204K149735J596145K848740P377395L205338j12991j131745j303787
499.6G13216629q4152o611862o429444P02057k593536r51615K897034J940308J208496
508.2G03293915J648712j44959l838958m435349j479950n58548R13163l36457l223648
516.9F91837921K11640R24224K010270K990570J513137j049728m585495j800690j906128
525.6F90145721l939666n08576R21326K401428J737213J686325J912690J241531M82864
$$ plain form
534.3 696080856 695616837 693705063 689914322 687912064 686742706 686558380 688629227 691445770 696085815
543 696085815 698387909 698647156 698574600 697369232 696421432 695568085 694633331 692337875 691005020 691674805
552.6 691674805 693655167 696457672 698177719 701426239 703730240 702343826 700896988 698945999
560.3 698945999 695896606 693361053 691991501 692540436 695281754 696883087 698239212 702605667 705424194
569 705424194 703714752 700972290 698745346 696722336 695040665 693312225 691282120 691680450 693349075
577.7 693349075 695896072 698963776 700655441 701524734 700943985 698926086 695580750 692692566 691656876
586.4 691656876 691128845 692260742 693231659 694097595 695710831 697400818 698014984 695585022 693359985
595 693359985 691415253 687697525 684443054 682604065 681845169 680655975 680348434 680412979 678253555
$$ packed form
534.3F96080856m64019j911774l790741k002258j169358j84326K070847K816543M640045
543F96085815K302094K59247p2556j205368r47800q53347r34754k295456j332855O69785
552.6F91674805J980362K802505J720047L248520K304001j386414j446838j950989
560.3F98945999l049393k535553j369552N48935K741318J601333J356125M366455K818527
569G05424194j709442k742462k226944k023010j681671j728440k030105L98330J668625
577.7F93349075K546997L067704J691665Q69293n80749k017899l345336k888184j035690
586.4F91656876n28031J131897R70917Q65936J613236J689987O14166k429962k225037
595F93359985j944732l717728l254471j838989p58896j189194l07541O4545k159424
$$ plain form
603.7 678253555 673313370 665679398 657181549 647617798 635051651 620154228 604274254 585791550
611.4 585791550 567169456 549312668 537022476 531740494 529552422 528398132 525618820 524161072
619.2 524161072 517645760 503729210 486598587 469275627 456754837 452764664 462273216 479519081
626.9 479519081 503472481 529270439 552160683 567838326 575943260 577941666 571479416 562211189
634.6 562211189 549919243 539282227 531329994 524568329 524366493 529502525 543199005 564281082
642.3 564281082 589540176 612060127 630822067 646419525 659947968 672060547 680651932 688073349
650 688073349 694417114 698197556 701792603 705695648 706655884 705864410 705250626 705327835 705797806 705457382
659.7 705457382 706028595 709247131 713307724 716419220 718912964 720494461 720841064 717456818 704607925
$$ packed form
603.7F78253555m940185p633972q497849r563751j2566147j4897423j5879974j8482704
611.4E85791550j8622094j7856788j2290192n281982k188072j154290k779312j457748
619.2E24161072o515312j3916550j7130623j7322960j2520790l990173R508552J7245865
626.9D79519081K3953400K5797958K2890244J5677643Q104934J998406o462250r268227
634.6E62211189j2291946j0637016p952233o761665k01836N136032J3696480K1082077
642.3E64281082K5259094K2519951J8761940J5597458J3528443J2112579Q591385P421417
650F88073349O343765L780442L595047L903045R60236p91474o13784P7209M69971l40424
659.7G05457382N71213L218536M060593L111496K493744J581497L46603l384246j2848893
$$ plain form
668.3 704607925 709254227 712453766 712810364 713412094 715498581 718648987 721644897 723918381 724857483
677 724857483 725031357 723933716 722158356 720812225 718931580 717429962 717977982 719353867 720075455
685.7 720075455 722280655 725110397 725318451 724492950 723808289 721935196 719054794 716267242 714302063
694.4 714302063 713762817 713846130 714320297 715558319 717381668 719168015 719608765 719746017 719394913
703.1 719394913 717638397 715762100 713864746 712978516 713878860 716011581 719197922 722553940 725329056
711.7 725329056 727660294 728569717 727503510 726687546 725879364 724943390 724723282 724707184 725321503 726997147
721.4 726997147 730171127 733305206 735100098 736022034 735721130 734264832 732051544 730681152 729630356
730.1 729630356 727700653 726126328 726561966 728570023 729862061 731013184 732830734 733619156 732288589
$$ packed form
668.3G04607925M646302L199539L56598O01730K086487L150406K995910K273484R39102
677G24857483J73874j097641j775360j346131j880645j501618N48020J375885P21588
685.7G20075455K205200K829742K08054q25501o84661j873093k880402k787552j965179
694.4G14302063n39246Q3313M74167J238022J823349J786347M40750J37252l51104
703.1G19394913j756516j876297j897354q86230R00344K132721L186341L356018K775116
711.7G25329056K331238R09423j066207q15964q08182r35974k20108j6098O14319J675644
721.4G26997147L173980L134079J794892R21936l00904j456298k213288j370392j050796
730.1G29630356j929703j574325M35638K008057J292038J151123J817550P88422j330567
$$ plain form
738.7 732288589 730030594 728443832 726671448 724779205 724987946 726273575 727801208 731112595 734121933
747.4 734121933 736433487 739513092 741033859 740460358 739008331 738433228 738965836 739445419 740442657
756.1 740442657 742626572 745581741 748129959 750457153 752410812 753827667 754124374 752586975 751131973
764.8 751131973 750081100 748488464 746624527 746631165 748814087 750820084 751343689 751919250 753324203
773.5 753324203 753629608 753741608 753489075 752705383 752017059 752045822 754078369 755636139 757717056
782.1 757717056 760427399 762383957 764839020 765864563 764740829 763353958 763589859 763057632 762044449
790.8 762044449 762432556 763113098 764846878 766469498 767811050 768289948 768084183 768357315 767813721
799.5 767813721 766749802 765614319 764591675 763954010 764809723 765856400 767235184 769473190 770214081
$$ packed form
738.7G32288589k257995j586762j772384j892243K08741J285629J527633L311387L009338
747.4G34121933K311554L079605J520767n73501j452027n75103N32608M79583R97238
756.1G40442657K183915K955169K548218K327194J953659J416855K96707j537399j455002
764.8G51131973j050873j592636j863937O638K182922K005997N23605N75561J404953
773.5G53324203L05405J12000k52533p83692o88324K8763K032547J557770K080917
782.1G57717056K710343J956558K455063J025543j123734j386871K35901n32227j013183
790.8G62044449L88107O80542J733780J622620J341552M78898k05765K73132n43594
799.5G67813721j063919j135483j022644o37665Q55713J046677J378784K238006P40891
$$ plain form
808.2 770214081 770791931 771160431 771077271 770592422 769567184 768526688 768279800 769352341 769557419
816.9 769557419 770008392 770870590 772138748 773517075 773372192 773358002 772725143 771457825 769484177
825.5 769484177 768060303 768699341 769420395 769944458 770144653 769814453 768737564 767485733 766268997
834.2 766268997 764532623 761798401 758679657 756148911 754200287 753992538 753503342 752072754 751091232
842.9 751091232 750684357 751335678 750544739 748464813 747275543 747186813 747472916 747713547 748641586 749958038
852.5 749958038 752328186 755056534 756877441 758683548 760387039 761134415 761694260 762966995 763808060
861.2 763808060 764600830 764805145 765597076 767867050 768948822 770129852 771742477 772341461 771989288
869.9 771989288 771524811 771028442 770884476 771804352 772771378 773433838 773115921 774002686 776066589 776218567
$$ packed form
808.2G70214081N77850L68500q3160m84849j025238j040496k46888J072541K05078
816.9G69557419M50973Q62198J268158J378327j44883j4190o32859j267318j973648
825.5G69484177j423874O39038P21054N24063K00195l30200j076889j251831j216736
834.2G66268997j736374k734222l118744k530746j948624k07749m89196j430588r81522
842.9G51091232m06875O51321p90939k079926j189270q8730K86103K40631R28039J316452
852.5G49958038K370148K728348J820907J806107J703491P47376N59845J272735Q41065
861.2G63808060P92770K04315P91931K269974J081772J181030J612625N98984l52173
869.9G71989288m64477m96369j43966R19876R67026O62460l17917Q86765K063903J51978
$$ plain form
879.5 776218567 775419769 773452835 771056137 769585190 767319870 765206909 764868622 763931427 763452454
888.2 763452454 764366531 765086823 765643845 765118179 764997864 764747696 763555679 762854996 762779312 763486557
897.9 763486557 763284378 764149933 765792618 765782776 765891571 765666809 764214859 761868668 760444565
906.5 760444565 759190369 757308884 755889282 754786987 754160995 752983856 751626511 750464706 749773254
915.2 749773254 748987427 746566162 743883057 741312180 739152908 737831192 736745834 736323395 736402893
923.9 736402893 736064682 735793991 735399323 733875961 732306519 731097336 730435715 730138168 729584122
932.6 729584122 729638519 730709305 732892838 735035706 737230835 739810410 741080551 742089310 743351669
941.3 743351669 744809265 746239548 747115326 748502274 750269089 752007904 753657990 755779419 757858963
$$ packed form
879.5G76218567p98798j966934k396698j470947k265320k112961l38287r37195m78973
888.2G63452454R14077P20292N57022n25666j20315k50168j192017p00683p5684P07245
897.9G63486557k02179Q65555J642685r842J08795k24762j451950k346191j424103
906.5G60444565j254196j881485j419602j102295o25992j177139j357345j161805o91452
915.2G49773254p85827k421265k683105k570877k159272j321716j085358m22439P9498
923.9G36402893l38211k70691l94668j523362j569442j209183o61621k97547n54046
932.6G29584122N4397J070786K183533K142868K195129K579575J270141J008759J262359
941.3G43351669J457596J430283Q75778J386948J766815J738815J650086K121429K079544
$$ plain form
949.9 757858963 758499985 758032379 757315140 756358261 755120010 754173889 753492203 753451309 753267517 752130585
959.6 752130585 750799103 749569016 748448257 746866379 744319153 741262665 738828201 737089386
967.3 737089386 735874176 735050430 734252014 733610916 733081665 732420883 731399994 730312119 728859711
976 728859711 726556549 723982544 722121277 721098785 720247803 719671555 719006958 717989197 716720657
984.7 716720657 715563049 713549500 709192047 704467468 700141373 694790039 688358459 680613632
992.4 680613632 668847809 651154785 627228775 606507797 608052521 630161667 654099960 668145142
1000.1 668145142 673909225 675972443 676537018 677003098 677451248 677724457 678142776 679001465 679902267
1008.8 679902267 680288925 679729538 678032074 676022568 673890152 671764984 669493637 667486877 666688461
$$ packed form
949.9G57858963O41022m67606p17239r56879j238251r46121o81686m0894j83792j136932
959.6G52130585j331482j230087j120759j581878k547226l056488k434464j738815
967.3G37089386j215210q23746p98416o41098n29251o60782j020889j087875j452408
976G28859711k303162k574005j861267j022492q50982n76248o64597j017761j268540
984.7G16720657j157608k013549m357453m724579m326095n351334o431580p744827
992.4F80613632j1765823j7693024k3926010k0720978J544724K2109146K3938293J4045182
1000.1F68145142N764083K063218N64575M66080M48150K73209M18319Q58689R00802
1008.8F79902267L86658n59387j697464k009506k132416k125168k271347k006760p98416
$$ plain form
1017.5 666688461 666769943 666351547 664938965 663995972 662686920 660758057 658446274 655761795 652900620
1026.1 652900620 649788055 648183975 646248550 644727249 644536362 643362579 642455902 641957245 640840149
1034.8 640840149 638824615 636831093 634518929 631783524 629265785 627597580 627616844 628137970 628976631
1043.5 628976631 629012184 629705124 630805550 630678291 630255356 629854736 630250168 629779358 629694672 629845772
1053.1 629845772 630709572 633270378 634453888 635452690 635848579 636207657 636060867 634327660 632671165
1061.8 632671165 630503006 629172707 627965393 627069283 627043419 626727180 626252632 625924072 624729958
1070.5 624729958 621452522 618590393 615896950 613038025 610061111 607432938 605419960 602158546
1078.2 602158546 600889435 600511551 598737526 596237297 593173637 589449348 585796623 581735954
$$ packed form
1017.5F66688461Q1482m18396j412582r42993j309052j928863k311783k684479k861175
1026.1F52900620l112565j604080j935425j521301j90887j173783r06677m98657j117096
1034.8F40840149k015534j993522k312164k735405k517739j668205J9264N21126Q38661
1043.5F28976631L5553O92940J100426j27259m22935m00620L95432m70810q4686J51100
1053.1F29845772Q63800K560806J183510R98802L95889L59078j46790j733207j656495
1061.8F32671165k168159j330299j207314q96110k5864l16239m74548l28560j194114
1070.5F24729958l277436k862129k693443k858925k976914k628173k012978l261414
1078.2F02158546j269111l77884j774025k500229l063660l724289l652725m060669
$$ plain form
1085.9 581735954 575510292 570384331 564777527 558516388 551348381 542894516 534633408 523059883
1093.6 523059883 511536713 497559471 481518288 465722389 449674683 435167274 419389305
1100.4 419389305 405523148 390336914 376575813 362279816 347424316 335154114 320629654
1107.1 320629654 307827721 293255444 282554379 272430420 262251911 253611965 244501896 240317879
1114.9 240317879 234169178 231801701 228935547 228238544 229254742 228370419 231004429 231021709 234570808
1123.5 234570808 236825886 240380459 243346500 244441261 247445450 247423477 249522038 247525845 246344223
1132.2 246344223 242712231 236969090 233145733 226886063 224283905 219213448 216950474 213685932
1139.9 213685932 210447178 207456493 201591358 199319134 193369312 190072060 184711685 180147419
$$ packed form
1085.9E81735954o225662n125961n606804o261139p168007q453865q261108j1573525
1093.6E23059883j1523170j3977242j6041183j5795899j6047706j4507409j5777969
1100.4D19389305j3866157j5186234j3761101j4295997j4855500j2270202j4524460
1107.1C20629654j2801933j4572277j0701065j0123959j0178509q639946r110069m184017
1114.9B40317879o148701k367477k866154o97003J016198q84323K634010J7280L549099
1123.5B34570808K255078L554573K966041J094761L004189k1973K098561j996193j181622
1132.2B46344223l631992n743141l823357o259670k602158n070457k262974l264542
1139.9B13685932l238754k990685n865135k272224n949822l297252n360375m564266
$$ plain form
1147.6 180147419 175787220 169415760 167515049 163268509 162920113 160113010 158908463 158658533 158364143
1156.3 158364143 160599365 159829197 162924023 163078327 166425610 169238586 172099113 177728500 180989876
1165 180989876 188218384 193088951 201332035 208311520 216175861 226018162 234435043 246167278
1172.7 246167278 255233517 267204571 277654190 289316292 301614819 312544880 325157280
1179.5 325157280 335812492 348966980 359723358 371081886 381481476 391195793 402082748
1186.2 402082748 410538788 420314636 427862625 436587029 444561386 452227211 460779381 467446671
1193.9 467446671 474848480 481493416 489884911 497412605 505747452 514539948 522212296 530774765
1201.6 530774765 538145943 546410789 553724823 561280098 568037415 573741531 579570198 584146957
$$ packed form
1147.6A80147419m360199o371460j900711m246540l48396k807103j204547k49930k94390
1156.3A58364143K235222p70168L094826J54304L347283K812976K860527N629387L261376
1165A80989876P228508M870567Q243084O979485P864341R842301Q416881J1732235
1172.7B46167278R066239J1971054J0449619J1662102J2298527J0930061J2612400
1179.5C25157280J0655212J3154488J0756378J1358528J0399590R714317J0886955
1186.2D02082748Q456040R775848P547989Q724404P974357P665825Q552170O667290
1193.9D67446671P401809O644936Q391495P527694Q334847Q792496P672348Q562469
1201.6E30774765P371178Q264846P314034P555275O757317N704116N828667M576759
$$ plain form
1209.4 584146957 589788399 594570351 599841042 605286064 610552979 616289673 620863991 624840775
1217.1 624840775 627717438 630824203 633231735 635463333 637508430 638611717 639999161 641108780
1224.8 641108780 644002380 646589508 648328629 650600586 652294464 653882523 654501419 654660797 655158539
1233.5 655158539 655952225 656621475 657923584 659428864 660514603 662438278 663994217 665286102 665920486
1242.2 665920486 666456985 667279816 667268448 667205124 667324753 668100586 668571548 669442596 670667877 671542435
1251.8 671542435 672902679 673892593 674474716 674324188 674459534 674444580 674322968 674754639 674707184 675887680
1261.4 675887680 677373581 678807297 679943771 680864792 682359543 683118057 683442154 683506317 683940430
1270.1 683940430 684585114 685755005 687480164 689025497 690913544 692567673 694657288 696273499
$$ packed form
1209.4E84146957N641442M781952N270691N445022N266915N736694M574318L976784
1217.1F24840775K876663L106765K407532K231598K045097J103287J387444J109619
1224.8F41108780K893600K587128J739121K271957J693878J588059O18896J59378M97742
1233.5F55158539P93686O69250J302109J505280J085739J923675J555939J291885O34384
1242.2F65920486N36499Q22831j1368o3324J19629P75833M70962Q71048J225281Q74558
1251.8F71542435J360244R89914N82123j50528J35346j4954j21612M31671m7455J180496
1261.4F75887680J485901J433716J136474R21021J494751P58514L24097O4163M34113
1270.1F83940430O44684J169891J725159J545333J888047J654129K089615J616211
$$ plain form
1277.8 696273499 697183151 698398285 699301453 700113983 700910034 701818848 702979202 704705353 706455002
1286.5 706455002 708131714 709974060 711334305 712441864 713112106 714002914 715235291 715979919 716635056
1295.2 716635056 717435150 718344345 719417038 720971832 722378616 723070984 723746796 724347076 724643021
1303.9 724643021 725002823 725476379 725658875 725774460 726564102 727195816 727657318 728762512 729103165
1312.5 729103165 728721390 729298401 730189743 730506973 730490265 731125641 731164017 730135803 730865402 732475967
1322.2 732475967 733695450 734838257 735227585 735457916 736197281 737020874 736942368 736254044 736255646 736503296
1331.8 736503296 736698990 736623077 736701736 736678543 736628723 737252731 736473083 735580444 736069031 736580429
1341.5 736580429 736994858 736928177 736960983 736878815 737272644 737725677 737188187 736474686 736271439 736910095
$$ packed form
1277.8F96273499R09652J215134R03168Q12530P96051R08814J160354J726151J749649
1286.5G06455002J676712J842346J360245J107559O70242Q90808J232377P44628O55137
1295.2G16635056Q00094R09195J072693J554794J406784O92368O75812O00280K95945
1303.9G24643021L59802M73556J82496J15585P89642O31714M61502J105194L40653
1312.5G29103165l81775N77011Q91342L17230j6708O35376L8376j028214P29599J610565
1322.2G32475967J219483J142807L89328K30331P39365Q23593p8506o88324J602K47650
1331.8G36503296J95694p5913P8659k3193m9820O24008p79648q92639M88587N11398
1341.5G36580429M14429o6681L2806q2168L93829M53033n37490p13501k03247O38656
$$ plain form
1351.1 736910095 736730270 736097565 735907822 735429916 735079498 735296631 735825272 736068497 736375275 735657959
1360.8 735657959 734738464 734124680 732511444 733276825 733310471 732549667 732699280 732042999 731772690 732061005
1370.4 732061005 731604614 731017990 730053482 727958755 726856079 726950912 726823959 726124191 725668564
1379.1 725668564 725626221 725268707 724644623 723294449 722252197 722400589 723508072 724179230 723388367
1387.8 723388367 724597015 725896454 725931625 726098785 726940765 727523575 725662003 723904724 724740067
1396.4 724740067 725211182 724751129 722418671 721822281 722620316 722468262 722254868 722407761 721252747
1405.1 721252747 720979309 721745911 721779480 721144943 720242920 719920425 719287415 718747559 719172897 719394455
1414.8 719394455 719806595 719844055 719593048 719298172 716388550 717870636 719844208 720313263 719699249
$$ packed form
1351.1G36910095j79825o32705j89743m77906l50418K17133N28641K43225L06778p17316
1360.8G35657959r19495o13784j613236P65381L3646p60804J49613o56281k70309K88315
1370.4G32061005m56391n86624r64508k094727j102676R4833j26953o99768m55627
1379.1G25668564m2343l57514o24084j350174j042252J48392J107483O71158p90863
1387.8G23388367J208648J299439L5171J67160Q41980N82810j861572j757279Q35343
1396.4G24740067M71115m60053k332458n96390P98035j52054k13394J52893j155014
1405.1G21252747k73438P66602L3569o34537r02023l22495o33010n39856M25338K21558
1414.8G19394455M12140L7460k51007k94876k909622J482086J973572M69055o14014
$$ plain form
1423.4 719699249 718773727 720419693 721903763 722106857 723245010 724007111 723330231 724228363 725539856
1432.1 725539856 726055145 726358490 727065735 727073669 723839340 725272675 728141785 729615173 730506592
1440.8 730506592 731483841 732062073 732411194 732353516 732516403 732905426 732528305 731089630 731663895 733032303
1450.5 733032303 733261032 733969421 735389099 736396637 736762466 735871506 732335358 730240860 732769394
1459.1 732769394 734890289 736585159 737414627 738523788 740385361 739573517 740311356 742295990 743370590
1467.8 743370590 743889542 744077988 744819183 744181290 742909393 744611511 747176132 749291763 750339966
1476.5 750339966 752554703 754625549 755829010 756492462 756361847 756499252 756514130 756040421 755897141
1485.2 755897141 756223145 755801773 756438980 758550568 757033005 756213531 758111725 758894272 758313217
$$ packed form
1423.4G19699249r25522J645966J484070K03094J138153P62101o76880Q98132J311493
1432.1G25539856N15289L03345P07245P934l234329J433335K869110J473388Q91419
1440.8G30506592R77249N78232L49121n7678J62887L89023l77121j438675N74265J368408
1450.5G33032303K28729P08389J419678J007538L65829q90960l536148k094498K528534
1459.1G32769394K120895J694870Q29468J109161J861573q11844P37839J984634J074600
1467.8G43370590N18952J88446P41195o37893j271897J702118K564621K115631J048203
1476.5G50339966K214737K070846J203461O63452j30615J37405J4878m73709j43280
1485.2G55897141L26004m21372O37207K111588j517563q19474J898194P82547n81055
$$ plain form
1493.8 758313217 757676392 756889420 752472687 753962631 753722534 752464142 754385223 755037460 755441742
1502.5 755441742 755848770 756640930 755586624 743864288 738659134 740803146 743421707 744508743
1510.2 744508743 745850372 744790268 744322891 746022949 746526566 746137238 741212387 738272858 740803375
1518.9 740803375 741917877 738023224 732907715 734753265 737174606 738834076 737540054 738664322
1526.6 738664322 739759598 738267288 737675705 737300415 736138992 734550171 730964813 726950455 729930496
1535.3 729930496 731948624 732930832 734184570 727591629 721801300 725124588 726189651 725654984 726164703
1544 726164703 724553452 723198242 725642548 726638641 727776184 727069931 726668854 729604492 731050034
1552.7 731050034 731428833 727588196 727198639 728844376 729155121 728790970 717480469 723390808 728773346
$$ packed form
1493.8G58313217o36825p86972m416733J489944k40097j258392J921081O52237M04282
1502.5G55441742M07028P92160j054306j1722336n205154K144012K618561J087036
1510.2G44508743J341629j060104m67377J700058N03617l89328m924851k939529K530517
1518.9G40803375J114502l894653n115509J845550K421341J659470j294022J124268
1526.6G38664322J095276j492310n91583l75290j161423j588821l585358m014358K980041
1535.3G29930496K018128R82208J253738o592941n790329L323288J065063n34667N09719
1544G26164703j611251j355210K444306R96093J137543p06253m01077K935638J445542
1552.7G31050034L78799l840637l89557J645737L10745l64151j1310501N910339N382538
$$ plain form
1561.4 728773346 732263184 733999634 734466705 733461380 733325500 733911057 733416367 732598572 726889420
1570 726889420 728516617 730757523 731198883 731934433 732240143 731849670 726855164 728170013 728771210
1578.7 728771210 727811661 726421204 724169235 723270493 722307129 722185745 721795731 721337891 720907211
1587.4 720907211 719653091 718831024 716731262 715032196 712643433 710676956 708152313 705373917
1595.1 705373917 704794312 703848038 703930817 703272858 702911301 701169128 698818741 696909180 693196411
1603.8 693196411 691378479 689248276 687618790 685322037 684135513 683396301 682354584 682984085 681602325
1612.5 681602325 680913544 678662949 677235336 674469986 664305115 666963577 667006378 666830902 665471649
1621.1 665471649 665757446 665270920 661557999 662475815 661799240 661379929 657303543 654816284 654176483
$$ packed form
1561.4G28773346L489838J736450M67071j005325j35880N85557m94690q17795n709152
1570G26889420J627197K240906M41360P35550L05710l90473m994506J314849O01197
1578.7G28771210r59549j390457k251969q98742r63364j21384l90014m57840m30680
1587.4G20907211j254120q22067k099762j699066k388763j966477k524643k778396
1595.1G05373917n79605r46274Q2779o57959l61557j742173k350387j909561l712769
1603.8F93196411j817932k130203j629486k296753j186524p39212j041717O29501j381760
1612.5F81602325o88781k250595j427613k765350j0164871K658462M2801j75476j359253
1621.1F65471649K85797m86526l712921R17816o76575m19311m076386k487259o39801
$$ plain form
1629.8 654176483 652887039 652357559 651298523 652329941 651613922 648156357 647884445 649437637 649595261
1638.5 649595261 649210968 649522781 648104019 648126755 647331619 648460007 649252090 647323456 650126343
1647.2 650126343 649047012 651798096 653101425 654959183 656136475 647187195 644192123 648777084
1654.9 648777084 653884048 655624237 657722626 659822235 662027206 663740845 664620895 665472107 665013123
1663.6 665013123 667518921 668787994 670060959 671543579 672499008 673226089 674718628 678483429 680057373
1672.3 680057373 683419113 686464386 686076508 685292130 687744675 690282898 691172180 693005600 694490814
1680.9 694490814 697631378 701291885 700022812 699737549 704080734 708880539 711028519 711691132 712805176
1689.6 712805176 713677597 716320190 718647842 721061859 723646622 726443405 726762543 730317688 734803314
$$ packed form
1629.8F54176483j289444n29480j059036J031418p16019l457565k71912J553192J57624
1638.5F49595261l84293L11813j418762K2736p95136J128388P92083j928634K802887
1647.2F50126343j079331K751084J303329J857758J177292q949280k995072M584961
1654.9F48777084N106964J740189K098389K099609K204971J713639Q80050Q51212m58984
1663.6F65013123K505798J269073J272965J482620R55429P27081J492539L764801J573944
1672.3F80057373L361740L045273l87878p84378K452545K538223Q89282J833420J485214
1680.9F94490814L140564L660507j269073k85263M343185M799805K147980O62613J114044
1689.6G12805176Q72421K642593K327652K414017K584763K796783L19138L555145M485626
$$ plain form
1698.3 734803314 738596115 738450928 733528061 739259262 742776642 744740601 746133118 747645569
1706 747645569 749734421 752679214 755888290 757064362 757717972 759632797 761203461 762239075 760774765
1714.7 760774765 759793701 762326279 764375381 761196518 763428116 765955505 767487488 768922729
1722.4 768922729 768673630 767624893 767697983 767688675 767745438 768473053 769725037 769090576 769518738 772239685
1732 772239685 773857193 771554031 769453278 772845154 775176468 775728836 776405640 774608383 773157959
1740.7 773157959 776336517 778522263 778173523 779010162 781425476 783251877 784293976 784602966 784148483
1749.4 784148483 785581131 784294357 784130936 787729416 789850693 791550827 792987442 792454834 793740768
1758.1 793740768 795245972 796061325 796538162 793358383 793201294 795640030 796820221 797416916 798352051
$$ packed form
1698.3G34803314L792801j45187m922867N731201L517380J963959J392517J512451
1706G47645569K088852K944793L209076J176072O53610J914825J570664J035614j464310
1714.7G60774765r81064K532578K049102l178863K231598K527389J531983J435241
1722.4G68922729k49099j048737P3090r308N6763P27615J251984o34461M28162K720947
1732G72239685J617508k303162k100753L391876K331314N52368O76804j797257j450424
1740.7G73157959L178558K185746l48740Q36639K415314J826401J042099L08990m54483
1749.4G84148483J432648j286774j63421L598480K121277J700134J436615n32608J285934
1758.1G93740768J505204Q15353M76837l179779j57089K438736J180191N96695R35135
$$ plain form
1766.8 798352051 798651962 797438736 799595642 801568451 799511414 796218262 796794357 799947205 800430832
1775.4 800430832 799166183 800238647 801062012 802429276 802962723 802552643 803511963 804496841 804914932
1784.1 804914932 803484497 802754211 803457565 803472519 803497467 804190140 804699097 804981155 803720245 804244766
1793.8 804244766 806414719 806363297 805291061 805911865 806707153 805738907 804390640 805176315 805092316
1802.4 805092316 805935898 807380676 807954330 808481827 808225174 807643509 807680664 807460709 806279221
1811.1 806279221 806329422 807060852 807601776 808326721 808680801 809146652 809274597 809657822 809887772 809328308
1820.8 809328308 809291077 808805771 809092026 809065552 807098465 808367081 810242844 811184464 810243073
1829.4 810243073 807804947 809504242 810594559 810017776 809977798 809783554 809544449 809132919 809252701
$$ packed form
1766.8G98352051K99911j213226K156906J972809k057037l293152N76095L152848M83627
1775.4H00430832j264649J072464Q23365J367264N33447m10080R59320R84878M18091
1784.1H04914932j430435p30286P03354J4954K4948O92673N08957K82058j260910N24521
1793.8H04244766K169953n1422j072236O20804P95288r68246j348267P85675q3999
1802.4H05092316Q43582J444778N73654N27497k56653n81665L7155k19955j181488
1811.1H06279221N0201P31430N40924P24945L54080M65851J27945L83225K29950n59464
1820.8H09328308l7231m85306K86255k6474j967087J268616J875763R41620r41391
1829.4H10243073k438126J699295J090317n76783l9978j94244k39105m11530J19782
$$ plain form
1838.1 809252701 810412674 811208344 812356796 812654495 812681503 811808929 807763062 809133530 810389481
1846.8 810389481 810091019 810128403 810787811 811336823 811502457 812275314 812774506 812917252 812738342 812474365
1856.4 812474365 812216949 811361771 810896225 810604935 810603027 810936890 811654358 812325058 812702637 813121033
1866.1 813121033 812938614 812682190 811126175 810048370 810747833 811264801 811427383 811396027 811910858
1874.8 811910858 812546387 813411560 813836823 813692398 813664703 813388214 813122177 812251587 811585159 811167603
1884.4 811167603 811109238 811670685 812207565 813319931 813140259 812108383 812978058 813562546 813325500
1893.1 813325500 812933197 811847458 810720825 810962296 811441574 812016068 812607498 813169632 813664627
1901.8 813664627 813586807 813478851 812990494 812756195 812685699 812099838 811562347 811115570 811265945 811844788
$$ packed form
1838.1H09252701J159973P95670J148452K97699K7008q72574m045867J370468J255951
1846.8H10389481k98462L7384O59408N49012J65634P72857M99192J42746j78910k63977
1856.4H12474365k57416q55178m65546k91290j908L33863P17468O70700L77579M18396
1866.1H13121033j82419k56424j556015j077805O99463N16968J62582l1356N14831
1874.8H11910858O35529Q65173M25263j44425k7695k76489k66037q70590o66428m17556
1884.4H11167603n8365N61447N36880J112366j79672j031876Q69675N84488k37046
1893.1H13325500l92303j085739j126633K41471M79278N74494N91430N62134M94995
1901.8H13664627p7820j07956m88357k34299p0496n85861n37491m46777J50375N78843
$$ plain form
1911.4 811844788 812592392 813093796 813424530 813397598 812961197 812790756 811178589 810688324 811399384 811534805
1921.1 811534805 811803131 811249084 811246185 812459717 813001709 812964172 812901764 812597656 812226486 811738815
1930.7 811738815 811405487 811317673 811171722 811271210 811437683 811862946 812232285 812352829 812279129 812267990
1940.3 812267990 812882767 811530762 809284668 809788971 810284958 810202713 810399323 811262894 811903610
1949 811903610 812307129 812410889 811960373 811600647 811041183 810423965 810017548 810030899 810101624 810225983
1958.7 810225983 810744705 811135178 811450577 811550293 811757812 811387634 810655518 810362473 809286880 808936844
1968.3 808936844 809493942 809696274 809929657 810230026 810567245 811003418 811252289 810911484 810422821 809830017
1978 809830017 809300003 809010391 808569565 808546143 808882980 809257050 809396362 809469299 809755249 809432144
$$ packed form
1911.4H11844788P47604N01404L30734k6932m36401j70441j612167m90265P11060J35421
1921.1H11534805K68326n54047k899J213532N41992l7537o2408l04108l71170m87671
1930.7H11738815l33328q7814j45951R9488J66473M25263L69339J20544p3700j1139
1940.3H12267990O14777j352005k246094N04303M95987q2245J96610Q63571O40716
1949H11903610M03519J03760m50516l59726n59464o17218m06417J3351P0725J24359
1958.7H10225983N18722L90473L15399R9716K07519l70178p32116k93045j075593l50036
1968.3H08936844N57098K02332K33383L00369L37219M36173K48871l40805m88663n92804
1978H09830017n30014k89612m40826k3422L36837L74070J39312P2937K85950l23105
$$ plain form
1987.6 809432144 808717270 808252258 808114471 807875137 807095032 807012405 807653809 808497772 809320984 809556732
1997.2 809556732 809559479 809793777 809512482 808909531 808603363 808125687 807609558 807469940 807358932 807350464
2006.9 807350464 807552338 807886047 808361969 808791656 808807831 808071213 807364120 807242966 807101517 806471634
2016.5 806471634 805802383 805976868 806456757 806878281 807226181 807448959 807778931 807829437 807458954 806693268
2026.2 806693268 806102448 805934753 805736465 805688400 805768661 806078415 806614761 807051468 806955185 806804962
2035.8 806804962 807035446 806774445 805905075 804827271 804152527 803817215 804085083 804782791 804838257 805011749
2045.5 805011749 805544434 806047821 806026611 805536118 805212708 804688034 804151077 803302078 802951813 803539429
2055.1 803539429 803899765 804104843 804185791 804422760 804675293 804567795 804243774 803695679 802851334 801820755
$$ packed form
1987.6H09432144p14874m65012j37787k39334p80105q2627O41404Q43963Q23212K35748
1997.2H09556732K747K34298k81295o02951l06168m77676n16129j39618j11008q468
2006.9H07350464K01874L33709M75922M29687J6175p36618p07093j21154j41449o29883
2016.5H06471634o69251J74485M79889M21524L47900K22778L29972N0506l70483p65686
2026.2H06693268n90820j67695j98288m8065Q0261L09754N36346M36707r6283j50223
2035.8H06804962K30484k61001q69370j077804o74744l35312K67868O97708N5466J73492
2045.5H05011749N32685N03387k1210m90493l23410n24674n36957q48999l50265N87616
2055.1H03539429L60336K05078Q0948K36969K52533j07498l24021n48095q44345j030579
$$ plain form
2064.7 801820755 801365891 801182938 800931473 800933075 801147766 801448135 801752090 801667023 800826721 799855270
2074.4 799855270 798952408 798046188 797273483 796792908 796758652 796880646 797081299 797483673 797971268 798163834
2084 798163834 798048019 797609558 797192688 796936569 796325455 795728149 795421829 795648651 796087189 796783142
2093.7 796783142 797508469 797552567 797895889 798002777 797879410 797949829 797578583 797259216 796878204 796815109
2103.3 796815109 797297745 798111115 798767395 799064636 799606781 800036545 800171432 799850616 799550247 799099960
2113 799099960 798537598 798642960 798767166 799154434 799748383 800226364 800341187 800146790 799989548 799467773
2122.6 799467773 799080734 798659668 798081284 797370300 796985855 797514572 797941895 798024673 797901840 797884216
2132.3 797884216 797942352 797875290 797628021 797339554 797387085 796825485 796443863 796924133 797261353 797534790
$$ packed form
2064.7H01820755m54864j82953k51465J602K14691L00369L03955q5067q40302r71451
2074.4G99855270r02862r06220p72705m80575l4256J21994K00653M02374M87595J92566
2084G98163834j15815m38461m16870k56119o11114n97306l06320K26822M38538O95953
2093.7G96783142P25327M4098L43322J06888j23367P0419l71246l19367l81012o3095
2103.3G96815109M82636Q13370O56280K97241N42145M29764J34887l20816l00369m50287
2113G99099960n62362J05362J24206L87268N93949M77981J14823j94397j57242n21775
2122.6G99467773l87039m21066n78384p10984l84445N28717M27323Q2778j22833j7624
2132.3G97884216N8136o7062k47269k88467M7531n61600l81622M80270L37220K73437
$$ plain form
2141.9 797534790 798107071 798933029 799450684 799735184 799595032 799234695 798977966 798269806 797924423 798107758
2151.5 798107758 798327637 798543625 798906174 799832153 800492935 800276642 799856262 799752426 799593201 798973923
2161.2 798973923 798490601 798496399 798466568 798610840 799127808 799735718 800207672 800065002 799744797 799574585
2170.8 799574585 799323959 798693924 797496567 796705780 796589890 796700592 797005920 797446823 797754288
2179.5 797754288 797785263 797718048 797420044 797138596 797067490 796790466 796325912 796083298 796301117 796756363
2189.1 796756363 796971741 797278900 798201981 799031067 799272995 799214935 799194107 799038010 798696594 798835678
2198.8 798835678 799040909 799231644 799528427 799620590 800102310 800858917 801160583 800892181 800789642 800739822
2208.4 800739822 800086823 799600220 799685287 799753952 799827118 800330505 800905762 801479797 801630249 801266174
$$ packed form
2141.9G97534790N72281Q25958N17655K84500j40152l60337k56729p08160l45383J83335
2151.5G98107758K19879K15988L62549R25979O60782k16293m20380j03836j59225o19278
2161.2G98973923m83322N798k9831J44272N16968O07910M71954j42670l20205j70212
2170.8G99574585k50626o30035j197357p90787j15890J10702L05328M40903L07465
2179.5G97754288L0975o7215k98004k81448p1106k77024m64554k42614K17819M55246
2189.1G96756363K15378L07159R23081Q29086K41928n8060k0828j56097l41416J39084
2198.8G98835678K05231J90735K96783R2163M81720P56607L01666k68402j02539m9820
2208.4H00739822o52999m86603Q5067O8665P3166N03387N75257N74035J50452l64075
$$ plain form
2218.1 801266174 801414566 801501007 800995026 800443039 800431519 800412674 799850540 799715271 800113525 800651703
2227.7 800651703 801160507 801627045 801604919 801228714 801006699 800435410 800107727 799903717 799475403 799268951
2237.4 799268951 799387817 799858398 800183411 800509949 800868530 800979919 800604477 799831848 799137115 798588333
2247 798588333 798499908 798527679 798574982 798988571 799566727 799917145 800121460 800408096 800296936 800142136
2256.7 800142136 800065536 799721069 799259262 798899460 798760910 798797379 799330597 799786072 799908524 800029678
2266.3 800029678 800121078 800259094 799957123 799433594 799146500 798849258 798519592 798649445 798943481 799018784
2275.9 799018784 799217224 799637604 800324020 800403366 799837418 799447708 799121857 798669281 798305588 798428192
2285.6 798428192 798436356 798510818 798588104 798545074 798975601 799201050 799043808 798618393 798352814 798257065 798127975
$$ packed form
2218.1H01266174J48392Q6441n05981n51987j1520j8845n62134j35269L98254N38178
2227.7H00651703N08804M66538k2126l76205k22015n71289l27683k04010m28314k06452
2237.4G99268951J18866M70581L25013L26538L58581J11389l75442p72629o94733n48782
2247G98588333q8425K7771M7303M13589N78156L50418K04315K86636j11160j54800
2256.7H00142136p6600l44467m61807l59802j38550L6469N33218M55475J22452J21154
2266.3H00029678R1400J38016l01971n23529k87094k97242l29666J29853K94036P5303
2275.9G99018784J98440M20380O86416P9346n65948l89710l25851m52576l63693J22604
2285.6G98428192Q164P4462P7286m3030M30527K25449j57242m25415k65579r5749j29090
$$ plain form
2296.2 798127975 797932434 797863312 798585968 798762970 798771591 799030151 798965759 798976898 798321533 797771301
2305.8 797771301 797845383 798014374 797611313 797144165 797146835 796663437 796641541 796835709 797271805 797245331
2315.5 797245331 796258850 796231766 796309433 796135712 795970688 795973358 795629883 794591675 794217606 794543762
2325.1 794543762 795435562 795295029 794264221 793681107 793369446 792847900 792962494 794377136 794259872
2333.8 794259872 794186172 794851532 794145813 793654480 793903580 793871994 793125305 793001938 793859177 795387115
2343.4 795387115 795602875 793952866 793738327 794465561 795653763 797248154 797733078 796512451 795695190
2352.1 795695190 795803680 795529099 795035858 793984375 793628006 793648224 792374268 791611710 792423096
2360.8 792423096 793620987 793333206 793360672 794119034 794179764 793945312 794028244 794966812 795349045 795299149
$$ packed form
2296.2G98127975j95541o9122P22656J77002Q621K58560o4392J1139o55365n50232
2305.8G97771301P4082J68991m03061m67148K670m83398k1896J94168M36096k6474
2315.5G97245331r86481k7084P7667j73721j65024K670l43475j038208l74069L26156
2325.1G94543762Q91800j40533j030808n83114l11661n21546J14594J414642j17264
2333.8G94259872p3700O65360p05719m91333K49100l1586p46689j23367Q57239J527938
2343.4G95387115K15760j650009k14539P27234J188202J594391M84924j220627q17261
2352.1G95695190J08490k74581m93241j051483l56369K0218j273956p62558Q11386
2360.8G92423096J197891k87781K7466P58362O0730k34452Q2932R38568L82233m9896
$$ plain form
2370.4 795299149 795685959 796541290 796864090 796647263 797692184 798554535 798573761 798682251 798530579 798592682
2380.1 798592682 799116211 799589615 799396362 799064713 799487610 799900742 799989777 799946594 799718781 799595490
2389.7 799595490 799508743 799399490 799220200 799143906 799328842 799656677 800057220 799983292 799509048 799266281
2399.4 799266281 799417343 799408569 799119720 799243088 799341888 799315033 799476013 799520416 799377747 799275665
2409 799275665 799632034 799857101 799469833 798921661 798784332 799033661 799009094 798707809 798435745 798557968
2418.7 798557968 798679886 798630905 798788223 798942490 799183426 798942261 798617630 798748550 798474121 798051682
2428.3 798051682 797609940 797329178 797448273 797753372 798370895 798459702 798133850 798125381 797847137 797723312
2438 797723312 797790833 797700272 797913132 797694855 797105408 796679840 796564407 796958847 797160339 797047119
$$ packed form
2370.4G95299149L86810Q55331L22800k16827J044921Q62351J9226J08490j51672O2103
2380.1G98592682N23529M73404j93253l31649M22897M13132Q9035m3183k27813j23291
2389.7G99595490q6747j09253j79290p6294J84936L27835M00543p3928m74244k42767
2399.4G99266281J51062q774k88849J23368R8800k6855J60980M4403j42669j02082
2409G99275665L56369K25067l87268n48172j37329K49329k4567l01285k72064J22223
2418.7G98557968J21918m8981J57318J54267K40936k41165l24631J30920k74429m22439
2428.3G98051682m41742k80762J19095L05099O17523Q8807l25852q469k78244j23825
2438G97723312O7521r0561K12860k18277n89447m25568j15433L94440K01492j13220
$$ plain form
2447.6 797047119 796717072 796742783 796928253 796650772 796575317 796312637 796306152 796463928 796036453 796126404
2457.2 796126404 796525650 796810760 797066574 796912308 796652756 796496353 796023788 795416412 795399017 795700378
2466.9 795700378 795640564 795577164 795875473 795722809 795385284 795657349 795815048 795552597 795141983 794827423
2476.5 794827423 794831848 794968109 794793167 794617157 794910965 795123291 794923782 794487457 794414978 794645691
2486.2 794645691 794789200 794725952 794040298 793406906 793188782 793286667 793679428 793881836 793745575 793531723
2495.8 793531723 793652878 793657227 793366699 793150864 792984009 792909088 792996902 793056717 792903595 792911453 792825317
2506.4 792825317 792692719 792700806 792369461 792006683 791819153 791760025 791751862 791806870 791631775 791474686 791724625
2517 791724625 791593399 791335907 791148453 791162720 791390915 791374359 791434860 791317291 791269684 791273499 790785294
$$ packed form
2447.6G97047119l30047K5711J85470k77481p5455k62680o485J57776m27475Q9951
2457.2G96126404L99246K85110K55814j54266k59552j56403m72565o07376j7395L01361
2466.9G95700378n9814o3400K98309j52664l37525K72065J57699k62451m10614l14560
2476.5G94827423M425J36261j74942j76010K93808K12326j99509m36325p2479K30713
2486.2G94645691J43509o3248o85654o33392k18124R7885L92761K02408j36261k13852
2495.8G93531723J21155M349k90528k15835j66855p4921Q7814N9815j53122P858q6136
2506.4G92825317j32598Q087l31345l62778j87530n9128q163N5008j75095j57089K49939
2517G91724625j31226k57492j87454J4267K28195j6556O0501j17569m7607L815m88205
$$ plain form
2527.6 790785294 790469742 790754242 790945969 790829620 790919342 790805664 790680008 790798264 790683212 790388412
2537.3 790388412 790265503 790516052 790329666 789809341 789737015 789806366 789723434 789787979 789749451 789201813
2546.9 789201813 789195862 789502563 789416733 789323120 789185867 789250717 789183655 788901291 788851929 788881149 788890457
2557.5 788890457 788903732 788945389 788920975 788795624 788377686 787754593 787751389 788263397 788225555 787977676 787801895
2568.1 787801895 787495575 787541733 787580185 787818756 787919540 787413406 787192764 787073135 787152557 787236557
2577.8 787236557 786977081 786958923 787108231 787009583 786846619 786862717 786754608 786815338 786714172 786429901
2587.4 786429901 786326523 785991440 785846252 785655289 785694809 785909729 785598145 785295258 785160522 785350113
2597.1 785350113 785175858 784585648 784424362 784604111 784803619 784558258 784394226 784269562 783845749 783805237
$$ packed form
2527.6G90785294l15552K84500J91727j16349Q9722j13678j25656J18256j15052k94800
2537.3G90388412j22909K50549j86386n20325p2326O9351q2932O4545l8528n47638
2546.9G89201813n951L06701q5830r3613j37253O4850o7062k82364m9362K9220R308
2557.5G88890457J3275M1657k4414j25351m17938o23093l204N12008l7842k47879j75781
2568.1G87801895l06320M6158L8452K38571J00784n06134k20642j19629P9422Q4000
2577.8G87236557k59476j8158J49308r8648j62964J6098j08109O0730j01166k84271
2587.4G86429901j03378l35083j45188j90963L9520K14920l11584l02887j34736J89591
2597.1G85350113j74255n90210j61286J79749J99508k45361j64032j24664m23813m0512
$$ plain form
2606.7 783805237 783868408 783775482 783830109 783750305 783704834 783828812 783791504 783901596 783657227 783075027 782798996
2617.3 782798996 782618103 782862778 783113785 782839813 782250748 781982193 782155838 781958694 781715012 781544342
2627 781544342 781482239 781631470 781439590 781120529 781002655 780885696 780786819 780838928 780525055 780222931
2636.6 780222931 780459595 780432205 780000076 779734344 779743423 779734421 779790649 779665222 779221420 778983841 779072113
2647.2 779072113 779252777 779093857 778694077 778219910 778058777 778219299 778125839 777927094 777572098 777342911
2656.9 777342911 777367401 777539520 777713165 777521667 777153168 776735077 776560440 776490555 776591644 776509018
2666.5 776509018 776037445 776193466 776309509 775994110 775605927 775497665 776006393 776265259 776117935 775688400
2676.1 775688400 774967422 774500275 774741058 775286331 775393143 774960327 774196548 773772659 773930511 774129333
$$ packed form
2606.7G83805237O3171r2926N4627p9804m5471J23978l7308J10092k44369n82200k76031
2617.3G82798996j80893K44675K51007k73972n89065k68555J73645j97144k43682j70670
2627G81544342o2103J49231j91880l19061j17874j16959r8877N2109l13873l02124
2636.6G80222931K36664k7390m32129k65732R079r002N6228j25427m43802k37579Q8272
2647.2G79072113J80664j58920l99780m74167j61133J60522r3460j98745l54996k29187
2656.9G77342911K4490J72119J73645j91498l68499m18091j74637o9885J01089q2626
2666.5G76509018m71573J56021J16043l15399l88183j08262N08728K58866j47324m29535
2676.1G75688400p20978m67147K40783N45273J06812m32816p63779m23889J57852J98822
$$ plain form
2685.8 774129333 773958206 773751526 773774796 773697739 773473663 773195572 773167419 772977676 772497025 772497406 772658310
2696.4 772658310 772616577 772646713 772923050 773134079 772934570 772609634 772404175 771814041 771009903 771010513
2706 771010513 771262283 771199875 771087646 770861053 770492401 770186157 770413971 770411606 770024872 770070038 769643631
2716.6 769643631 768909836 769008713 769402466 769415970 769204559 769448090 769863434 769478683 768972931 768545609
2726.3 768545609 767920074 767867813 767994080 767773056 767434921 767212448 767183380 767196579 767329865 767352371
2735.9 767352371 767447968 767696228 767457581 767030029 766621704 765957642 765542145 765490723 765575562 765804138
2745.6 765804138 766024323 766371918 766305161 765880356 765850601 765561218 764913940 764465179 764328918 764228973
2755.2 764228973 764043732 764096756 764390106 764417267 763979950 763767166 763435898 763083801 762972260 762470093
$$ packed form
2685.8G74129333j71127k06680K3270p7057k24076k78091k8153j89743m80651L81J60904
2696.4G72658310m1733L0136K76337K11029j99509l24936k05459n90134q04138O10
2706G71010513K51770o2408j12229k26593l68652l06244K27814k365l86734M5166m26407
2716.6G69643631p33795R8877L93753J3504k11411K43531M15344l84751n05752m27322
2726.3G68545609o25535n2261J26267k21024l38135k22473k9068J3199J33286K2506
2735.9G67352371R5597K48260k38647m27552m08325o64062m15497n1422Q4839K28576
2745.6G65804138K20185L47595o6757m24805k9755k89383o47278m48761j36261r9945
2755.2G64228973j85241N3024K93350K7161m37317k12784l31268l52097j11541n02167
$$ plain form
2764.9 762470093 762195969 762200775 762232590 761770248 761220779 761378784 761408234 761468582 761464233 761435471 760949554
2775.5 760949554 760221634 760416946 760295181 759782791 759346619 759540787 759956894 759515686 759378204 759159164
2785.1 759159164 759016342 759207840 758772354 758251724 757897491 757439499 756841736 756746674 756884918 756850052
2794.8 756850052 756897736 756646423 756395798 755879440 755169754 754990005 754854889 754463806 754012680 753769226
2804.4 753769226 753500824 753101501 753129578 753220901 752903214 752537537 752208939 751975098 751826782 751503677
2814 751503677 751100159 750848160 750644455 750102463 749554138 749342728 749219131 749212646 749163208 748695145
2823.7 748695145 748101807 747971497 747760696 747102203 746312180 745804977 746090240 746325531 745907516 745191498
2833.3 745191498 744806595 744674759 744057922 743369598 742574539 741714706 740942459 740309753 739942322 739185410
$$ packed form
2764.9G62470093k74124M806L1815m62342n49469J58005K9450O0348m349k8762m85917
2775.5G60949554p27920J95312j21765n12390m36172J94168M16107m41208j37482k19040
2785.1G59159164j42822J91498m35486n20630l54233m57992n97763r5062J38244l4866
2794.8G56850052M7684k51313k50625n16358p09686j79749j35116l91083m51126k43454
2804.4G53769226k68402l99323K8077R1323l17687l65677l28598k33841j48316l23105
2814G51503677m03518k51999k03705n41992n48325k11410j23597o485m9438m68063
2823.7G48695145n93338j30310k10801o58493p90023n07203K85263K35291m18015p16018
2833.3G45191498l84903j31836o16837o88324p95059q59833p72247o32706l67431p56912
$$ plain form
2843 739185410 738306198 737149277 735864029 735038147 734222946 733297577 732041397 731179504 730804596
2851.7 730804596 730221634 729697189 729240189 729287109 729229202 728689346 728878403 729352798 729119263 728541870
2861.3 728541870 728296204 728058548 727535248 727447891 727542725 727195587 726254120 725114594 725032806 725403595
2870.9 725403595 725106277 724330063 723728561 723696136 723075333 722216339 721899185 721436081 721271210 721423340
2880.6 721423340 721174622 720614700 720411606 720428085 719935303 719073639 718424225 718066483 717745438 717447968
2890.2 717447968 716697464 716007156 715866165 715805588 715787964 715219574 714503708 713940506 713622513 713347855
2899.9 713347855 712382431 711731415 711385651 711296463 711111679 710413742 710161438 709843445 709494553 709017105
2909.5 709017105 708160477 707605972 707260132 706649170 705634842 704787369 704099960 703615265 702935791
$$ packed form
2843G39185410q79212j156921j285248q25882q15201r25369j256180q61893l74908
2851.7G30804596n82962n24445m57000M6920n7907n39856J89057M74395k33535n77393
2861.3G28541870k45666k37656n23300q7357R4834l47138r41467j139526q1788L70789
2870.9G25403595k97318p76214o01502l2425o20803q58994l17154m63104j64871J52130
2880.6G21423340k48718n59922k03094J6479m92782q61664o49414l57742l21045k97470
2890.2G17447968p50504o90308j40991o0577j7624n68390p15866n63202l17993k74658
2899.9G13347855r65424o51016l45764q9188j84784o97937k52304l17993l48892m77448
2909.5G09017105q56628n54505l45840o10962j014328q47473o87409m84695o79474
$$ plain form
2918.2 702935791 701736221 700905533 700567780 700451889 699887848 699365158 699553452 699432449 698945923
2926.9 698945923 698762817 698670654 698765869 699590073 700047989 699625778 699253311 699447632 699831238 699812317
2936.5 699812317 700213699 700712738 700529327 700666733 701340408 701652832 701753159 701903534 701869812 702357559
2946.2 702357559 702498474 701934738 701962738 702103195 701933746 701250381 700815277 701241074 701159515 700510788
2955.8 700510788 699965210 699526901 699614105 699972229 699628448 699459000 699904938 699955597 700106201 700597992
2965.5 700597992 700723648 700543365 701025467 701868820 701991425 702222824 702549744 702527695 703297043 704084320
2975.1 704084320 704121094 704436188 704858017 705361633 705801468 706081085 706389313 706312027 706864471 707715912
2984.7 707715912 708005829 708261337 708485184 708674088 708542252 708454437 708529739 708862381 709322586 709292603
$$ packed form
2918.2G02935791j199570q30688l37753j15891n64041n22690J88294j21003m86526
2926.9F98945923j83106r2163R5215Q24204M57916m22211l72467J94321L83606j8921
2936.5F99812317M01382M99039j83411J37406O73675L12424J00327J50375l3722M87747
2946.2G02357559J40915n63736K8000J40457j69449o83365m35104M25797q1559o48727
2955.8G00510788n45578m38309Q7204L58124l43781j69448M45938N0659J50604M91791
2965.5G00597992J25656j80283M82102Q43353J22605K31399L26920k2049P69348P87277
2975.1G04084320L6774L15094M21829N03616M39835K79617L08228p7286N52444Q51441
2984.7G07715912K89917K55508K23847J88904j31836q7815P5302L32642M60205k9983
$$ plain form
2994.4 709292603 709596329 710091400 710165405 709606018 709102936 709457397 709518127 709051514 708981247 709391708
3004 709391708 709365005 709084320 709020691 708776016 708655243 708412857 708082123 708091278 708101196 707560883 706725464
3014.6 706725464 706563263 706927567 707004852 706610336 706309967 706217575 706127548 705791779 705089874 704768448
3024.3 704768448 704605103 704370041 703985367 703136826 702795639 703069077 702729568 702299423 702861633 703133240
3033.9 703133240 702434311 701415787 700715103 700661087 700392456 699831924 699544296 699372711 698991776 698703232
3043.6 698703232 698537827 698073120 697740784 697388382 697157516 696944427 695861969 694914169 695064697
3052.2 695064697 695306320 694749374 694249802 693943405 693242035 692649002 692332611 692159882 691956253 691715622
3061.9 691715622 691682663 691511078 690844116 690464401 690311203 689557037 688850479 688575134 688596802 688586273
$$ packed form
2994.4G09292603L03726M95071P4005n59387n03082L54461O0730m66613p0267M10461
3004G09391708k6703k80685o3629k44675j20773k42386l30734R155R918n40313q35419
3014.6G06725464j62201L64304P7285l94516l00369r2392r0027l35769p01905l21426
3024.3G04768448j63345k35062l84674q48541l41187K73438l39509m30145N62210K71607
3033.9G03133240o98929j018524p00684n4016k68631n60532k87628j71585l80935k88544
3043.6F98703232j65405m64707l32336l52402k30866k13089j082458r47800J50528
3052.2F95064697K41623n56946m99572l06397p01370n93033l16391j72729k03629k40631
3061.9F91715622l2959j71585o66962l79715j53198p54166p06558k75345K1668j0529
$$ plain form
3071.5 688586273 688266983 687720718 687076111 686796188 686621246 686351471 686044922 685554428 685085526 684902039
3081.2 684902039 684680481 684372253 684566116 684217911 683226242 682761688 682562866 682278595 681794281 681458588
3090.8 681458588 681242294 681099777 680985565 680422745 679758224 679257584 679161758 679296799 679145050 678637772
3100.5 678637772 677921524 677269669 676872559 676560211 676063080 675673523 675410461 675416794 675304642 674670868
3110.1 674670868 674230194 673613892 672612839 671996460 672138367 672056580 671691284 671661758 670750732 669951324
3119.8 669951324 670135269 670114594 669232101 667873077 667344513 666938324 666330185 665967636 665638351 665558319
3129.4 665558319 665190735 664684677 664267883 663528671 663012009 662901917 662345047 661324005 660822754
3138.1 660822754 660539780 659993210 659524841 659190826 658913116 658184967 657361984 657068863 656469879 655711060
$$ packed form
3071.5F88586273l19290n46265o44607k79923j74942k69775l06549m90494m68902j83487
3081.2F84902039k21558l08228J93863l48205r91669m64554j98822k84271m84314l35693
3090.8F81458588k16294j42517j14212n62820o64521n00640r5826J35041j51749n07278
3100.5F78637772p16248o51855l97110l12348m97131l89557k63062O333j12152o33774
3110.1F74670868m40674o16302j001053o16379J41907q1787l65296k9526r11026p99408
3119.8F69951324J83945k0675q82493j359024n28564m06189o08139l62549l29285q0032
3129.4F65558319l67584n06058m16794p39212n16662j10092n56870j021042n01251
3138.1F60822754k82974n46570m68369l34015k77710p28149q22983k93121n98984p58819
$$ plain form
3147.7 655711060 655039825 654387894 654316483 653945541 653192978 652893372 652701111 651973877 651123047 650969238
3157.4 650969238 650465851 649435501 648715210 648160324 647587433 647104492 646640549 645855179 645677032
3166 645677032 645452194 644497375 643983994 643590698 643384933 642955933 642017899 641219482 640106277 638846207
3175.7 638846207 638571243 638892212 638061447 637164688 636975899 636326180 635817528 635525818 634843521 634010773
3185.3 634010773 633146591 632614594 632711678 632306175 631334686 630376320 629436455 629250336 629047012 628562851
3195 628562851 628028946 627354088 626684914 625654564 625250854 625163422 624721413 623833008 622742348 622650375
3204.6 622650375 622711983 621962395 620718803 619886589 619577026 619268303 618848648 618383026 618099289 617139473
3214.3 617139473 616181526 616047707 616042290 615922928 615465012 614738693 613683739 612607536 612063484 612181549
$$ packed form
3147.7F55711060o71235o51931p1411l70942p52563k99606j92261p27234q50830j53809
3157.4F50969238n03387j030350p20291n54886n72891m82941m63943p85370j78147
3166F45677032k24838r54819n13381l93296k05765m29000r38034p98417j113205j260070
3175.7F38846207k74964L20969q30765q96759j88789o49719n08652k91710o82297q32748
3185.3F34010773q64182n31997R7084m05503r71489r58366r39865j86119k03324m84161
3195F28562851n33905o74858o69174j030350m03710q7432m42009q88405j090660r1973
3204.6F22650375O1608p49588j243592q32214l09563l08723m19655m65622k83737r59816
3214.3F17139473r57947j33819n417j19362m57916p26319j054954j076203n44052J18065
$$ plain form
3223.9 612181549 611668587 610573273 610434761 610140724 609422073 608712997 608314056 608236732 607586555 606865578
3233.5 606865578 606335182 606149979 605816917 604953346 604475288 604481850 604006653 602869835 602470398 602230988
3243.2 602230988 601640663 601379318 600799026 600076485 599740486 599572182 599200211 598408203 597500877 597270164
3252.8 597270164 597066116 596371346 596190720 595974617 595215874 594289856 593488808 592872849 592710495 593047066
3262.5 593047066 592770424 591826630 591260872 591353951 590810089 589714622 589285088 589062500 588738213 588198776
3272.1 588198776 587661629 587243385 587297134 587399483 586641388 586295357 586028481 585462189 585109482 584288597
3281.8 584288597 583631859 583499794 582996902 582098122 581773300 581843338 581681671 581754379 581394653 580305710
3291.4 580305710 580028114 580195007 579824104 579299622 578492470 577944832 577702484 577014656 576182098 575801430
$$ packed form
3223.9F12181549n12962j095314j38512k94037p18651p09076l98941p7324o50177p20977
3233.5F06865578n30396j85203l33062q63571m78058O562m75197j136818l99437k39410
3243.2F02230988n90325k61345n80292p22541l35999j68304l71971p92008r07326k30713
3252.8E97270164k04048o94770j80626k16103p58743r26018q01048o15959j62354L36571
3262.5E93047066k76642r43794n65758R3079n43862j095467m29534k22588l24287n39437
3272.1E88198776n37147m18244N3749J02349p58095l46031k66876n66292l52707q20885
3281.8E84288597o56738j32065n02892q98780l24822P0038j61667P2708l59726j088943
3291.4E80305710k77596J66893l70903n24482q07152n47638k42348o87828q32558l80668
$$ plain form
3301 575801430 575885086 575643387 575204353 574613266 573898430 573674278 573855171 573632584 572489090 571852684
3310.7 571852684 571661568 571188507 570735435 570227394 569734650 569076271 568730278 568476410 568044777 567390175
3320.3 567390175 566849976 566740761 566041489 565616798 565390778 565032730 564463577 563211975 562561798
3329 562561798 562284088 562071800 561479683 561088142 561428566 561136742 560289307 558964996 558301086 558072739
3338.7 558072739 557280960 556834793 556512184 556061363 555458031 554861374 554257736 553860817 553695183 553189964
3348.3 553189964 552597504 552180023 551956139 551428185 550743065 550016403 549534798 549387703 548455353 547578430
3357.9 547578430 547040215 546286201 545795517 545549812 545432968 545187378 544682922 544082108 543465576 542915459
3367.6 542915459 542511940 541945572 541342812 541038094 540730171 540483360 540561371 540277748 539004440 538096199
$$ packed form
3301E75801430Q3656k41699m39034n91087p14836k24152J80893k22587j143494o36406
3310.7E71852684j91116m73061m53072n08041m92744o58379l45993k53868m31633o54602
3320.3E67390175n40199j09215o99272m24691k26020l58048n69153j251602o50177
3329E62561798k77710k12288n92117l91541L40424k91824q47435j324311o63910k28347
3338.7E58072739p91779m46167l22609m50821o03332n96657o03638l96919j65634n05219
3348.3E53189964n92460m17481k23884n27954o85120p26662m81605j47095r32350q76923
3357.9E47578430n38215p54014m90684k45705j16844k45590n04456o00814o16532n50117
3367.6E42915459m03519n66368o02760l04718l07923k46811P8011k83623j273308r08241
$$ plain form
3377.2 538096199 537975426 537694244 537501869 537607536 537039032 535759773 535462074 535280609 534754066
3385.9 534754066 534698524 534250221 533846169 533469696 533150024 532882538 532279205 532242699 532473526 531941833
3395.6 531941833 531053047 530914497 531148796 531619530 531522751 530411835 529734459 529502602 529346428 528827782
3405.2 528827782 528463135 528158646 527896271 528293343 528301430 527923012 527217064 527120857 527556915 527583046
3414.8 527583046 527454605 526669922 526287231 526865692 527305679 526238861 525408401 526275330 526832047
3423.5 526832047 526852646 526586800 526418991 526023712 525801010 525946541 525850563 525831909 525200958 525461159
3433.2 525461159 526178131 526212311 526408501 526395988 526433258 526417465 526176453 525746002 525986099 525949211
3442.8 525949211 525518341 525802917 525927353 526832504 527269897 527492180 528018417 527806854 527987480 528051300
$$ packed form
3377.2E38096199j20773k81182j92375J05667n68504j279259k97699j81465n26543
3385.9E34754066n5542m48303m04052l76473l19672k67486o03333l6506K30827n31693
3395.6E31941833q88786j38550K34299M70734r6779j110916o77376k31857j56174n18646
3405.2E28827782l64647l04489k62375L97072Q087l78418p05948r6207M36058K6131
3414.8E27583046j28441p84683l82691N78461M39987j066818q30460Q66929N56717
3423.5E26832047K0599k65846j67809l95279k22702J45531r5978j8654o30951K60201
3433.2E25461159P16972L4180J96190j2513L7270j5793k41012m30451K40097l6888
3442.8E25949211m30870K84576J24436R05151M37393K22283N26237k11563J80626O3820
$$ plain form
3452.5 528051300 528545914 528652115 528016968 528054581 528658905 529309578 529404259 529754829 529969482 530361748
3462.1 530361748 530638161 530515099 531216164 531651535 531619759 531579323 532065163 532319832 532386818 533186188
3471.7 533186188 533802223 534503365 534626503 534388924 534808731 535253868 535574226 536005630 536581726 537245979
3481.4 537245979 537613373 537295914 537720146 538133812 538668060 540035133 540012436 539612579 540058670 540875587
3491 540875587 541447487 541527100 541950111 542670975 543453407 543978958 544465637 544810524 545275726 545740891
3500.7 545740891 546322174 547177315 546935043 546704941 547197342 548491936 549668770 550283394 550551071
3509.4 550551071 550287971 551429253 552368965 552554207 553059273 553826332 554760437 554833755 554794922 555056648
3519 555056648 555577812 556296043 557477493 558196335 557725105 558669395 559640198 560214462 561130676 561608849
$$ packed form
3452.5E28051300M94614J06201o35147L7613O04324O50673R4681L50570K14653L92266
3462.1E30361748K76413j23062P01065M35371l1776m0436M85840K54669O6986P99370
3471.7E33186188O16035P01142J23138k37579M19807M45137L20358M31404N76096O64253
3481.4E37245979L67394l17459M24232M13666N34248J367073k2697l99857M46091Q16917
3491E40875587N71900P9613M23011P20864P82432N25551M86679L44887M65202M65165
3500.7E45740891N81283Q55141k42272k30102M92401J294594J176834O14624K67677
3509.4E50551071k63100J141282R39712J85242N05066P67059R34105P3318l8833K61726
3519E55056648N21164P18231J181450P18842m71230R44290R70803N74264R16214M78173
$$ plain form
3528.6 561608849 561609650 561924019 563087234 564301109 565178413 565573578 566706047 567220993 566075935
3537.3 566075935 566237717 567529869 568802032 569240532 569959564 570704575 571786880 572387199 571831779
3546 571831779 573151169 573853722 575102730 576173019 577067986 578977928 578350677 578516922 579244270
3554.7 579244270 580052643 580719528 580685120 582047043 582835846 583115082 583693771 586303177 587728615
3563.4 587728615 587528000 590260468 589634438 588552895 588466492 588020401 590502510 592478561 594557610
3572 594557610 595644913 595881233 596116333 597234612 598728371 599205894 600952568 601078758 601011200
3580.7 601011200 602792778 603983803 604394226 604763565 608273468 610171585 607710228 607855949 608056679
3589.4 608056679 610593719 612981453 615325012 615986328 615048447 616896820 616297035 617599792 619813004
$$ packed form
3528.6E61608849Q01L14369J163215J213875Q77304L95165J132469N14946j145058
3537.3E66075935J61782J292152J272163M38500P19032P45011J082305O00319n55420
3546E71831779J319390P02553J249008J070289Q94967J909942o27251J66245P27348
3554.7E79244270Q08373O66885l4408J361923P88803K79236N78689K609406J425438
3563.4E87728615k00615K732468o26030j081543q6403m46091K482109J976051K079049
3572E94557610J087303K36320K35100J118279J493759M77523J746674J26190o7558
3580.7F01011200J781578J191025M10423L69339L509903J898117k461357J45721K00730
3589.4F08056679K537040K387734K343559O61316r37881J848373n99785J302757K213212
$$ plain form
3598.1 619813004 619777565 621801605 623150444 624287071 625478935 625970192 627129936 629011230 630476227
3606.8 630476227 629038467 630749321 630307388 630655937 636826324 637836456 636059151 638160515 637077408
3615.4 637077408 639841995 642355881 641176453 641127396 640966110 643124237 646101990 648223267 649380112
3624.1 649380112 650635223 652131424 653820419 658283920 656775970 647178726 651997528 657088852
3631.8 657088852 661294022 662744217 661451416 662851486 665604782 667379761 667516632 668919830
3639.5 668919830 670817261 672523651 673532562 673525009 674819717 676684341 680540543 681849365 678605347
3648.2 678605347 681329727 680724564 678280029 679243317 682937012 685420456 687928162 691418457 685907745
3656.9 685907745 686488953 690290375 692271576 694129410 694839478 696061325 696118164 696612854 697781677
$$ packed form
3598.1F19813004l5439K024040J348839J136627J191864M91257J159744J881294J464997
3606.8F30476227j437760J710854m41933L48549O170387J010132j777305K101364j083107
3615.4F37077408K764587K513886j179428m9057j61286K158127K977753K121277J156845
3624.1F49380112J255111J496201J688995M463501j507950r597244M818802N091324
3631.8F57088852M205170J450195j292801J400070K753296J774979J36871J403198
3639.5F68919830J897431J706390J008911p553J294708J864624L856202J308822l244018
3648.2F78605347K724380o05163k444535R63288L693695K483444K507706L490295n510712
3656.9F85907745N81208L801422J981201J857834P10068J221847N6839M94690J168823
$$ plain form
3665.6 697781677 697861786 700334396 701276855 698892136 697869186 695685196 699078522 704679871 710919952
3674.3 710919952 712131195 699828796 700979691 705068283 708275375 707300949 706893005 708834381
3682 708834381 710285416 711317139 711328888 711494293 714109955 717557907 709949799 706774597 712786942
3690.6 712786942 709284363 709143295 711919479 711295242 712610016 713240585 713056335 713720322 713815918
3699.3 713815918 715682831 717885056 714125748 712039108 715715637 717318802 717020187 717085190 718831024
3708 718831024 722510757 717840118 718897171 722245865 714425507 717767944 720676270 720664825 721257782
3716.7 721257782 722631531 723189697 720989685 721664429 725237274 722389908 719507294 723369293 723648758
3725.4 723648758 723274384 722333908 722630310 725616531 726530304 729817352 728032227 722392426 726166153
$$ packed form
3665.6F97781677Q0109K472610R42459k384719j022950k183990L393326N601349O240081
3674.3G10919952J211243j2302399J150895M088592L207092r74426m07944J941376
3682G08834381J451035J031723J1749J65405K615662L447952p608108l175202O012345
3690.6G12786942l502579j41068K776184o24237J314774O30569j84250O63987R5596
3699.3G13815918J866913K202225l759308k086640L676529J603165k98615O5003J745834
3708G18831024L679733m670639J057053L348694p820358L342437K908326j1445N92957
3716.7G21257782J373749N58166k200012O74744L572845k847366k882614L861999K79465
3725.4G23648758l74374r40476K96402K986221R13773L287048j785125n639801L773727
$$ plain form
3734 726166153 724214783 718471603 720644531 723692169 723825684 725639114 727723389 724998398 727196350
3742.7 727196350 734742508 727781296 714232864 721238403 725664749 729500656 727797928 720273056
3750.4 720273056 726972275 721718979 718139114 723203888 726494141 728531036 725570374 727943954
3758.2 727943954 730951920 724355545 724046402 727809677 729000549 728536758 730554428 728769302 725478287
3766.8 725478287 727578430 730114594 729434357 723440552 724985046 727854767 728197632 727976303 727551270
3775.5 727551270 728041916 728161087 730194626 730341721 724787979 726379929 728352127 728997040 730447769
3784.2 730447769 728552475 727131424 727536392 728143387 729069366 728787918 728464661 728342133 728488235
3792.9 728488235 728600540 729414291 731376266 728924255 726648483 728389206 731084595 734729614 728755722
$$ packed form
3734G26166153j951370n743180K172928L047638J33515J813430K084275k724991K197952
3742.7G27196350P546158o961212j3548432P005539M426346L835907j702728p524872
3750.4G20273056O699219n253296l579865N064774L290253K036895k960662K373580
3758.2G27943954L007966o596375l09143L763275J190872m63791K017670j785126l291015
3766.8G25478287K100143K536164o80237n993805J544494K869721L42865k21329m25033
3775.5G27551270M90646J19171K033539J47095n553742J591950J972198O44913J450729
3784.2G30447769j895294j421051M04968O06995R25979k81448l23257j22528J46102
3792.9G28488235J12305Q13751J961975k452011k275772J740723K695389L645019n973892
$$ plain form
3801.5 728755722 720643768 723443069 726648178 730929413 734867096 727497025 724255066 728026199
3809.3 728026199 729115143 728978577 729365997 728687820 728912888 732676620 732662048 723461609 726268616
3817.9 726268616 729657745 732096252 733743591 723382950 724027405 726922150 728245621 730084229
3825.7 730084229 730018005 726880722 726842880 728431168 730865173 731747208 724921417 726330414 731696091
3834.3 731696091 728463593 727414856 731512146 725248871 722944794 728208313 725233231 725915375
3842.1 725915375 730375366 728053284 725727005 727666779 728038483 727779846 729250183 728745422 729776230
3850.7 729776230 733454285 728744431 731884766 722604904 720799713 727800217 727180557 726350174 728685455
3859.4 728685455 729792480 730540695 726187134 725925064 729902191 725374680 723103561 725761414 728399887
$$ packed form
3801.5G28755722q111954K799301L205109M281235L937683p370071l241959L771133
3809.3G28026199J088944j36566L87420o78177K25068L763732j4572r200439K807007
3817.9G26268616L389129K438507J647339j0360641O44455K894745J323471J838608
3825.7G30084229o6224l137283l7842J588288K434005Q82035o825791J408997N365677
3834.3G31696091l232498j048737M097290o263275k304077N263519k975082O82144
3842.1G25915375M459991k322082k326279J939774L71704k58637J470337n04761J030808
3850.7G29776230L678055m709854L140335r279862j805191P000504o19660q30383K335281
3859.4G28685455J107025P48215m353561k62070L977127m527511k271119K657853K638473
$$ plain form
3868.1 728399887 731731796 727627411 722674866 724710007 729438019 732237244 725135574 725472641
3875.8 725472641 727502441 727059860 727971344 731426697 729034576 722954407 726355286 726906891 727287750
3884.5 727287750 729043808 721455536 723987427 727221832 728019104 730941925 730793915 723818359 724251022
3893.2 724251022 726939545 726060028 726528015 726727295 728491135 730018311 723026199 726395035 727704468
3901.8 727704468 724012070 727620621 725589294 723650818 723830566 724813614 726572495 726311188 726300507
3910.5 726300507 726090546 726006775 726447754 726240768 726777802 727627106 725084991 723144989 726195526
3919.2 726195526 726405334 723398895 724832764 726088257 726234131 724889679 722894821 724022141 725562057
3927.9 725562057 726627350 725969009 725950241 727754211 725086975 722882309 724063873 724621735 724874573
$$ packed form
3868.1G28399887L331909m104385m952545K035141M728012K799225p101670L37067
3875.8G25472641K029800m42581R11484L455353k392121o080169L400879N51605L80859
3884.5G27287750J756058p588272K531891L234405P97272K922821j48010o975556M32663
3893.2G24251022K688523q79517M67987J99280J763840J527176o992112L368836J309433
3901.8G27704468l692398L608551k031327j938476J79748R83048J758881k61307j0681
3910.5G26300507k09961q3771M40979k06986N37034Q49304k542115j940002L050537
3919.2G26195526K09808l006439J433869J255493J45874j344452j994858J127320J539916
3927.9G25562057J065293o58341j8768J803970k667236k204666J181564N57862K52838
$$ plain form
3936.6 724874573 724803162 724139709 724167023 724654160 725632858 726393814 723631897 722834702 724385300 725170975
3946.2 725170975 725851440 724584045 724611893 724916153 723457947 723995972 723749161 723220978 723610077
3954.9 723610077 723920670 723934097 723713760 724278488 723760605 723537292 724044876 723424835 723235168 723176880
3964.5 723176880 723150330 723250580 723607864 723971634 723272476 723157043 723784409 723619232 723296585 723174896
3974.2 723174896 723269424 723488235 723263397 723591919 723862152 723575745 723715591 723691635 723514175 723176804
3983.8 723176804 723216400 723591003 723163757 722820358 723041534 723464737 723286591 722743759 722965088 723358917
3993.5 723358917 723369293 723128357 723184891 723264465 723015213 723139420 723461227
4000.2 723461227
$$ packed form
3936.6G24874573p1411o63453K7314M87137R78698P60956k761917p97195J550598P85675
3946.2G25170975O80465j267395K7848L04260j458206N38025k46811n28183L89099
3954.9G23610077L10593J3427k20337N64728n17883k23313N07584o20041j89667n8288
3964.5G23176880k6550J00250L57284L63770o99158j15433O27366j65177l22647j21689
3974.2G23174896R4528K18811k24838L28522K70233k86407J39846k3956j77460l37371
3983.8G23176804L9596L74603m27246l43399K21176M23203j78146n42832K21329L93829
3993.5G23358917J0376k40936N6534P9574k49252J24207L21807
4000.2G23461227
##END=$$ End of the data block
