##TITLE=$$ Begin of the data block
##JCAMP-DX=5.00 $$ ACD/SpecManager v 10.08
##SPECTROMETER/DATA SYSTEM=Varian
##DATE=18 Dec 2012 14:35:52
##DATA TYPE=INFRARED SPECTRUM
##DATA CLASS=XYDATA
##ORIGIN=
##OWNER=
##NPOINTS=3735
##FIRSTX=399.26403809
##LASTX=4000.35498047
##MAXX=4000.35498047
##MINX=399.26403809
##MAXY=80.34460449
##MINY=21.11758041
##XFACTOR=1.0000000000
##YFACTOR=0.000000100000000
##FIRSTY=59.74460983
##DELTAX=0.96440572
##XUNITS=1/CM
##YUNITS=TRANSMITTANCE
##XYDATA=(X++(Y..Y))
399.3E97446098j7458725K0372200P172623l369369L810195j754455p888031n049820
407E93280716O103630R029465K027664p042542o288871K758369n009842n172539J988640
415.7E91674690M37012k265739l908806j838532O391258J0487519M635009p835273
423.4E97777138q217240p53936L542747K288971M967918j483039n952225n51071J223869
432.1E92843132M18663k552376m206123O07376L728867p10831M3182r93499m496384
440.7E84682007m49410O198616M288178n570374l634109L033752J185570n44929j400643
449.4E87788658l070640k619362k35367j269798n61409J332855K973327O197510j488037
458.1E89047737o909599j235352M738541L328171o294632p264328j825142N32455m16221
$$ plain form
399.3 597446098 579987373 600359573 607532196 604162827 607973022 606218567 598330536 593280716
407 593280716 599384346 608413811 610441475 603398933 597110062 599868431 594858589 589686050 591674690
415.7 591674690 592111702 589845963 585937157 584098625 590489883 600977402 605612411 597777138
423.4 597777138 589559898 588805962 592348709 594637680 599605598 598122559 592170334 591619263 592843132
432.1 592843132 593261795 590709419 586503296 587110672 590839539 590128708 590171890 589178391 584682007
440.7 584682007 584232597 590431213 594719391 589149017 585514908 588548660 589734230 589189301 587788658
449.4 587788658 584718018 582098656 581863289 580593491 580032082 581364937 584338264 590535774 589047737
458.1 589047737 582138138 580902786 585641327 588969498 582674866 575410538 573585396 574117851 573701630
466.8E73701630L547554l17383j569748K983246k547913r16481P016525K162095l786126
475.5E80273399m755668l03994M98505p60651j678810P19986K673073L047142J623879
484.1E81336861J647453N97572j001739M522133J360244m823989j524811j28174q65479
492.8E81120071Q47283J086693k031098j160126L41645K770004K316780k949028k046471
501.5E80295753k48336O58188K3231p71828k804527l977318J763344K503510J624984
510.2E79067001j537285k827377k244797k843017k53563k892113n611305q71391L240394
518.9E63226547J315460k93960J844940J261253O2409k237435k855453j048050L67584
527.5E61643295K409210K87171k559815j07765O59027j997985L75976J958771L7918
$$ plain form
466.8 573701630 577249184 576931801 575362053 578345299 575797386 574880905 581897430 584059525 580273399
475.5 580273399 575517731 575213737 575712242 574951591 573272781 573992767 576665840 579712982 581336861
484.1 581336861 582984314 583581886 582580147 587102280 588462524 583638535 582113724 581985550 581120071
492.8 581120071 581967354 583054047 581022949 579862823 580204468 582974472 585291252 582342224 580295753
501.5 580295753 580047417 580705605 580728836 579957008 577152481 573175163 574938507 577442017 579067001
510.2 579067001 577529716 574702339 572457542 569614525 569360962 566468849 560857544 559986153 563226547
518.9 563226547 564542007 564248047 566092987 567354240 567416649 565179214 562323761 561275711 561643295
527.5 561643295 564052505 564339676 561779861 561672096 562331123 560333138 560709114 562667885 562705803
536.2E62705803n50461l39699N85823j336441j093177l03116j393013N66024J707840
544.9E60549583K540322J122017m13208J432495K064094J112213J30616j254616j224861
553.6E66058655P80334p90329j729660K59400L78303P00493J355286R89456n53360
562.3E67448578l72887J084938N99327j172981j464348M26979m81186o14891N92232
570.9E66045761O53000k84042j696854L50647J033478j030808j693992o63720Q47435
579.6E63560905Q1749j142463m85382N33523q77N53512J87378l20968J370887J004601
589.3E65342865M81682r7618K4643q96645j976318L00789N01022L81966L11851j423187
598.9E62951050k037163j800804k335053l187103k476082l265991m795799o709099
$$ plain form
536.2 562705803 562155342 561815643 562401466 561065025 559971848 559668732 558275719 558841743 560549583
544.9 560549583 563089905 564211922 563798714 565231209 567295303 568407516 568538132 567283516 566058655
553.6 566058655 566838989 566048660 564319000 564578400 564956703 565657196 567012482 568001938 567448578
562.3 567448578 567075691 568160629 568759956 567586975 566122627 566549606 566068420 565453529 566045761
570.9 566045761 566698761 566414719 564717865 565068512 566101990 565071182 563377190 562713470 563560905
579.6 563560905 563642654 562500191 562014809 562548332 562547455 563100967 563288345 562967377 564338264 565342865
589.3 565342865 565824547 565726929 565751572 564854927 562878609 563179398 563680420 564062386 564374237 562951050
598.9 562951050 560913887 559113083 556778030 553590927 551114845 547848854 543053055 536343956
606.6E36343956p824020p796288r205055j0011826j2258644j2050819j0372620p208366
614.3D59616318l923722L3951L148270L22189j554985n774002q147850r386673r770508
623D24562988n916099k319527P308846J3713111J5368119J4661484J2848243R416275
630.7D89643440O317940L586349k077140m847489p321243o852951m429588k655602
638.4D71363716p37343J328659P626076J1431503J5577088J6911926J5487328J2694816
646.2E51683769J0019608Q331718M600754L210983L626976K938500K534942K194748
653.9E89141998J464424J468583J282081P23190P30286k70195K05193K299881J505203
662.5E98550644K59056J187668J751213Q40378j509705n358925M306183L607597J305275
$$ plain form
606.6 536343956 528519936 520723648 511518593 501506767 489248123 477197304 466824684 459616318
614.3 459616318 455692596 455726547 458874817 459197006 457642021 451868019 443720169 434333496 424562988
623 424562988 418646889 416327362 423636208 437349319 452717438 467378922 480227165 489643440
630.7 489643440 495961380 499547729 497470589 492623100 485301857 478448906 474019318 471363716
638.4 471363716 470626373 471955032 479581108 491012611 506589699 523501625 538988953 551683769
646.2 551683769 561703377 570035095 574635849 577846832 581473808 584412308 586947250 589141998
653.9 589141998 590606422 592075005 593357086 594080276 594810562 594540367 594745560 597045441 598550644
662.5 598550644 598809700 599997368 601748581 602588959 601079254 595720329 600026512 603634109 604939384
671.2F04939384N79796N70183J20506P4883J4763L13453J231041J663666Q80852R23424
680.9F11311951J256485O61621N41191j003723j504860o42510j778907k396508k479057
689.6F03965683j337547p11289j833610j040764K95982L33863m14963j533318j852379
698.2E95871658j547546j627045j179199K136N42794r1935k05383J258392J609536
706.9E94633408J619110K525253K225380J077614Q78334J941376J968956Q37211R91783
715.6F08698425J612130J946487J811790J799851K514839L061905J646957r76867j81885
724.3F21933632N37834n23834n73311j269226j545487j636619j90086P42073o89240
733F16785736l25012p04880p91321J132355O49872q32482n69229J96495n66787l77388
$$ plain form
671.2 604939384 605519180 606089363 606209869 606284752 606299515 606612968 607844009 609507675 610388527 611311951
680.9 611311951 612568436 613230057 613771248 612767525 611262665 610620155 608841248 606444740 603965683
689.6 603965683 602628136 601916847 600083237 599042473 599338455 599672318 599257355 597724037 595871658
698.2 595871658 594324112 592697067 591517868 591520004 592062798 591970863 591765480 593023872 594633408
706.9 594633408 596252518 598777771 601003151 602080765 602959099 604900475 606869431 607706642 608698425
715.6 608698425 610310555 612257042 614068832 615868683 618383522 621445427 623092384 622115517 621933632
724.3 621933632 622471466 621947632 621374321 620105095 618559608 616922989 616732903 617474976 616785736
733 616785736 616460724 615755844 614964523 616096878 616746750 615914268 615345039 615541534 614974747 614597359
742.6F14597359J025390L18528O32820K227173L423233M332885L452683J804962J428604
751.3F33243637L400536L447151J456451K413559K679978L131866L249664Q73642K141037
760F56037521L028336J580124N68313q4075m96369j308594k30865q43964j934356j434784
769.6F54881287k45514J615219R74579N46875J145324K097931K079468J684418L022461
778.3F67802048J783523R94492J507339J273499K052765J818847J518097K471085J665955
787F82887650M24881Q42666k8610K43988J087189N51300k70081j437073m92706L22952
796.6F84132156M15497j07193l2348Q93096M12140O8131n80979p5683K63595Q1254
806.2F85469666k61841q58307J92947L37296K44140O58341J016922L01132J06125J21231
$$ plain form
742.6 614597359 615622749 615941277 616574097 618801270 622224503 626557388 630010071 631815033 633243637
751.3 633243637 636644173 640091324 641547775 643961334 646641312 649773178 653022842 653896484 656037521
760 656037521 659065857 660645981 661214294 661130219 660633850 659325256 659094391 658250427 656316071 654881287
769.6 654881287 654635773 656250992 657225571 657772446 658917770 661015701 663095169 664779587 667802048
778.3 667802048 669585571 670580063 672087402 673360901 675413666 677232513 678750610 681221695 682887650
787 682887650 683312531 684155197 684126587 684370575 685457764 686009064 685738983 684301910 683809204 684132156
796.6 684132156 684547653 684440460 684408112 685301208 685713348 685781479 685200500 685124817 685388412 685469666
806.2 685469666 685207825 684349518 684542465 684879761 685123901 685782242 686799164 687100296 687206421 687327652
815.9F87327652K31934J588897m7073j67313p36465j491089R1858l74680M26407j124115
825.5F85726013j996155n83801j201477j878738l333283l959884l824387l213348l329468
834.2F62405472l954163m397659m270096l656998l462829k894249l457222k970009
841.9F33342247k410011k282601j932029k479592q30421L16467M23279Q94317N40505
850.6F25582161J492538L006897M422341M628563L179435K817154L873597L973312
858.3F52975998K661285K059937J824264K408371K034912J612244K353592J967392
866F69897995J231384J076050J256027J34507N58166J070557L83835L29589L50724
874.7F76288834J388015Q33664J58310j096954j486740j140442k725983k315750j860428
$$ plain form
815.9 687327652 687559586 689148483 689101410 688934097 688197632 686706543 686798401 686423721 686850128 685726013
825.5 685726013 683729858 683146057 681944580 680065842 676732559 672772675 668948288 665734940 662405472
834.2 662405472 658451309 654053650 649783554 646126556 642663727 639769478 636312256 633342247
841.9 633342247 630932236 628649635 626717606 624238014 623407593 623724060 624147339 625041656 625582161
850.6 625582161 627074699 630081596 634503937 639132500 642311935 645129089 649002686 652975998
858.3 652975998 655637283 657697220 659521484 661929855 663964767 665577011 667930603 669897995
866 669897995 671129379 672205429 673461456 673595963 674154129 675224686 675608521 675938110 676288834
874.7 676288834 677676849 678510513 678668823 677571869 676085129 674944687 672218704 669902954 668042526
883.4F68042526j241836k173157l202362k366257k431030j469040j264725q12683M69055
892.1F53550491R79309M91181m4937Q35724M54788j97525k51160M24042J65939n66711
901.7F55841141P9574j301498j897354j030121j509552k425308k412720k287064k731018
910.4F40326080k996368l423996l095551l323097l933220l591728l122444k554588
918.1F14285088k434006k636566k983704k852287j664810j725197k728577k442207
925.8E94817734j713333j346970j578789j125450j30424J53274M32930O01006J764183
934.5E91874161L387565L427353K550888K469826L396607M143829L741722L929176
942.2F18921127M105835L180695L417206L812599L545189L054580K952652K569962
$$ plain form
883.4 668042526 666800690 664627533 661425171 659058914 656627884 655158844 653894119 653081436 653550491
892.1 653550491 654529800 655020981 654976044 655811768 656266556 656069031 655817871 656241913 656407852 655841141
901.7 655841141 655920715 654619217 652721863 651691742 650182190 647756882 645344162 643057098 640326080
910.4 640326080 637329712 633905716 630810165 627487068 623553848 619962120 616839676 614285088
918.1 614285088 611851082 609214516 606230812 603378525 601713715 599988518 597259941 594817734
925.8 594817734 593104401 591757431 590178642 589053192 588922768 589076042 589508972 590109978 591874161
934.5 591874161 595261726 598689079 601239967 603709793 607106400 611250229 614991951 618921127
942.2 618921127 623026962 626207657 629624863 633437462 636982651 640037231 642989883 645559845
949.9F45559845J363983N54428L98941r5215j151199q45032l95736r55658j650849
958.6F42783508k237701k446137k436599l362770l992272l129349l152275l413925
966.3F18612480l180885k500801j289025j324653j957131j055259k73171j325188j689491
975F04016876l91311o3858p70913j290855k307320k126541j080246j507530j836510
983.7E92641792k118835k770996k742653k452393l051376l376007l550911m845390
991.4E67733231n807839q829498j2762528j5549392j2577019O41365J1399307J2462693
999.1E36710320P170677K638168Q17566M83322M61769p72209j052170j353264r31549
1007.8E44172630n69381j389428j424446k005005j712493j020470j329308k062034
$$ plain form
949.9 645559845 646923828 647478256 647877197 647781982 646630783 645785751 645390015 644434357 642783508
958.6 642783508 640545807 638099670 635663071 632300301 628308029 625178680 622026405 618612480
966.3 618612480 615431595 612930794 611641769 610317116 608359985 607304726 607031555 605706367 604016876
975 604016876 603625565 603561707 602790794 601499939 599192619 597066078 595985832 594478302 592641792
983.7 592641792 590522957 587751961 585009308 582556915 579505539 576129532 572578621 567733231
991.4 567733231 561925392 553095894 540333366 524783974 512206955 512848320 524247627 536710320
999.1 536710320 543880997 546519165 547336731 547820053 548281822 547509613 546457443 545104179 544172630
1007.8 544172630 543603249 542213821 540789375 538784370 537071877 536051407 534722099 532660065
1015.5E32660065k544403k700920k820817k769584k579117k351799k818794k429734
1023.2E11644897k877273k435341j566429k174530j282997k130051k771225k916565
1031D93490486k261848j454201k258263k153778k370567j154480j269455r72061q18367
1039.6D78777466j108246J22337p04956l79982p85522J59073l1967n73159Q08296L6355
1049.3D76319695J015129K73552P15255Q13065P83996J797944L24516O55136q58231
1058D81840057j136093q22868n41802o02226j780968n5694m99764j60331r12018j216850
1067.6D74111443j77994q90122n94558j362420j192245j705132m38728j42555j890411
1076.3D65717278k083626j569138O15349j16158m16832j917495j954155q27637k016449
$$ plain form
1015.5 532660065 530115662 527414742 524593925 521824341 519245224 516893425 514074631 511644897
1023.2 511644897 508767624 506332283 504765854 502591324 501308327 499178276 496407051 493490486
1031 493490486 491228638 489774437 487516174 485362396 482991829 481837349 480567894 479595833 478777466
1039.6 478777466 477669220 477791557 477086601 476706619 475921097 476080170 476048203 475475044 476283340 476319695
1049.3 476319695 477334824 477608376 478323631 479136696 479920692 481718636 482043152 482698288 481840057
1058 481840057 480703964 479881096 479339294 478737068 476956100 476900406 476400642 476240311 475328293 474111443
1067.6 474111443 473933449 473043327 472448769 471086349 469894104 468188972 467750244 467607689 465717278
1076.3 465717278 463633652 462064514 462679863 462563705 462146873 460229378 458275223 457447586 455431137
1085D55431137j794739l618507l082390l750458m113731m151115n615616o013642r423675
1093.6D13867264q968621r381484r557457j0594826j1140480q784905j0405540q773995
1101.4C36259956r557151p867527q579445r197903p035027q507518n420761p031632
1109.1B73062992n033932n539188n675774l561859m309559l98941k083664o351k67887
1117.7B46185837J204147J769200j09196L095379J128769L027877R21193J373844J400070
1126.4B59997120p84359R20601j151905J78852k741299k863388l557911l987427k526187
1135.1B43484097m362813j313552k049141m24862k139683k127609j376286k759990
1142.8B26930161k23847l315334j910935l066673j764908j340828k134876L17020k313976
$$ plain form
1085 455431137 453636398 450017891 446935501 443185043 439071312 434920197 429304581 423290939 413867264
1093.6 413867264 404898643 395517159 385959702 375364876 364224396 355439491 345033951 336259956
1101.4 336259956 326702805 318835278 310255833 301057930 294022903 285515385 280094624 273062992
1109.1 273062992 268029060 262489872 256814098 253252239 248942680 248543739 246460075 246453724 246185837
1117.7 246185837 247389984 249159184 249049988 252145367 253274136 256302013 257223206 258597050 259997120
1126.4 259997120 259212761 260133362 258981457 259160309 256419010 253555622 249997711 246010284 243484097
1135.1 243484097 239121284 237807732 235758591 235333729 233194046 231066437 229690151 226930161
1142.8 226930161 226706314 223390980 221480045 218413372 216648464 215307636 213172760 213489780 211175804
1151.5B11175804Q85601p23438N52673J238137J090297K793617l7059K686691J233368
1160.2B20895691L002491K454548K522373L912239K437725N181904K910843N254288
1167.9B48572102M731388N128326N822735M361572O690083N303173P208519N585995
1175.6B93403893O324100O527634N821876O915665N061207P758827O479874O206474
1183.3C44499550N079956N276642O617927M604111N407982L631325N048217M439812
1191C84605522M090538M973488M043579N228920M153366N567322M939919N212402N600357
1199.7D28415413M995384O030464M940605N274964M293861N300789N303154M536934
1207.4D69091568M444885L220406M531288L832397L568650L026199L211670L001328
$$ plain form
1151.5 211175804 212061405 211337967 211890640 213128777 214219074 217012691 216975632 219662323 220895691
1160.2 220895691 223898182 226352730 228875103 232787342 235225067 240406971 243317814 248572102
1167.9 248572102 253303490 258431816 264254551 268616123 275306206 280609379 287817898 293403893
1175.6 293403893 299727993 306255627 312077503 318993168 324054375 331813202 338293076 344499550
1183.3 344499550 349579506 354856148 361474075 366078186 371486168 375117493 380165710 384605522
1191 384605522 388696060 393669548 397713127 402942047 407095413 412662735 417602654 422815056 428415413
1199.7 428415413 433410797 439441261 444381866 449656830 453950691 459251480 464554634 469091568
1207.4 469091568 473536453 476756859 481288147 485120544 488689194 491715393 494927063 497928391
1215.1D97928391J609992K285691J361694J985741J675072J327857J453324P75871
1222.9E10403633J286125P05719Q28972R4261M89846P27729L73269M34455l5133J413384
1232.5E16722260Q48960R10225R43375P60078J229897O62651R30748J29890N56946
1241.2E23695030M69399N94139P10068L85856J044960L17536J300277M24881o2217
1249.9E28879929O57615L76969O59561k32926L70865L3646K58522N95283N77202J301384
1259.5E33478050N25437J187782Q84018O34804K26783K54708Q18176M97246J290130
1268.2E39797134P61834J297798J463279J532364J809349J662331K541199J878738
1275.9E52744026J726341J230622J415138J950264J743355J678009J496315K388420
$$ plain form
1215.1 497928391 499538383 501824074 503185768 505171509 506846581 508174438 509627762 510403633
1222.9 510403633 511689758 512395477 513224449 513318710 513808556 514536285 514909554 515344009 515308876 516722260
1232.5 516722260 517571220 518481445 519424820 520184898 521414795 522077446 523008194 523138084 523695030
1241.2 523695030 524164429 524758568 525468636 525854492 526899452 527216988 528517265 528942146 528879929
1249.9 528879929 529537544 529914513 530574074 530341148 530712013 530745659 531004181 531599464 532176666 533478050
1259.5 533478050 534003487 535191269 536075287 536710091 536936874 537191582 538009758 538507004 539797134
1268.2 539797134 540558968 541856766 543320045 544852409 546661758 548324089 550865288 552744026
1275.9 552744026 554470367 555700989 557116127 559066391 560809746 562487755 563984070 566372490
1283.6E66372490J861267K171898K843552K587966K276116J816292K120628J757317
1291.3E83807526K030525J824226J347656J501847J602669K111663K097435K061158
1299E98384705J729049J947785J934509J218567R36279Q69255J003380Q03719P83882
1307.7F09611130N59616O50558J197548J073303R31321R80949R35211N92346Q55713
1316.4F17387695J094132P31735K73056J99089O66046N49469R42726J502686J474113
1325.1F24820747J163750Q50830J211929Q12951r5597j83067j30386K899L03802N36537
1334.7F29294395J24398k08359N90668Q60481j46904p46117L39547Q62236L78875j95732
1344.4F31153488p18002p41768k85492L4943k42348k67029M16451J1673k73438j50871
$$ plain form
1283.6 566372490 568233757 570405655 573249207 575837173 578113289 579929581 582050209 583807526
1291.3 583807526 585838051 587662277 589009933 590511780 592114449 594226112 596323547 598384705
1299 598384705 600113754 602061539 603996048 605214615 606150894 607020149 608023529 608827248 609611130
1307.7 609611130 610170746 610821304 612018852 613092155 614023476 615004425 615939636 616531982 617387695
1316.4 617387695 618481827 619213562 619486618 619685707 620351753 620901222 621843948 623346634 624820747
1325.1 624820747 625984497 626835327 628047256 628860207 628764610 628581543 628451157 628454056 628757858 629294395
1334.7 629294395 629418793 629210434 629801102 630661583 630514679 629768562 630108109 630970345 631349220 631153488
1344.4 631153488 630435486 629693718 629408226 629443169 629200821 628933792 629350243 629361916 629088478 628937607
1354F28937607o51169p60727m99992l63007n33371k64587j03531k14462r57604j781349
1363.7F22807808M26025P13120m41284r83658j563111j336364p82929q20007k93694
1372.3F17725906o22482j917877j366577j07956M83436M7684k21634j31264n39703
1381F13349533p07588r24797n60494J54724Q92830M46129o13022J435662J730957M49638
1390.7F15653572K1515K76375N70564p32613k430686j68496L15361l40728k243653
1399.3F10921211j082115Q89511J6632k64587L0212j400795q76388j05553m37584n92689
1409F07097855q57239n18036m91982m35447N27992M77219j7319l84560l93715N40123
1418.6F05544891l077507K83318K106590L95584K21901o92253Q00743J669502P78542
$$ plain form
1354 628937607 628286438 627525711 627025719 626662712 626129341 625864754 625761223 625546761 624589157 622807808
1363.7 622807808 623233833 623946953 623505669 622522011 620958900 619622536 618839607 618019600 617725906
1372.3 617725906 617103424 615185547 613818970 613711014 614194450 614242134 614020500 613889236 613349533
1381 613349533 612641945 611717148 611156654 611311378 612204208 612650337 612037315 613472977 615203934 615653572
1390.7 615653572 615675087 615951462 616522026 615789413 613358727 613190231 613505592 613164864 610921211
1399.3 610921211 609839096 610728607 610745239 610480652 610510864 609110069 608233681 608128128 607690544 607097855
1409 607097855 606240616 605722580 605230598 604795151 605323143 605800362 605783043 605398483 605004768 605544891
1418.6 605544891 602467384 602750702 604857292 605252876 605474777 604782524 605583267 607252769 608031311
1427.3F08031311J358566N23682l87383Q81501J488762R03091O02493J389618L94974
1436F15186615k520676J371193L002205J680451O96296R49211J000367J215744N04608
1444.7F23086014Q70971Q30422l28674n77355J380196J927070N92270J28823O39228
1453.3F28548965K000809J837959J19629j683426r06143L558197J469956J775665J240425
1462F37962036J321716K447510r43527L74145J833725J894074J570053J408157K510071
1470.7F50377960R72824l61099M37470L922348L842163M23584J692276K855301K218093
1479.4F66380920J593247J176605J742783J786575J072922L12423R69315K17896j307145
1488.1F73945541J257782j487884k553406J639404J350251L06701L89023Q2855n511093
$$ plain form
1427.3 608031311 609389877 609913559 609526176 610407677 611896439 612799530 613402023 614791641 615186615
1436 615186615 612665939 614037132 617039337 618719788 619416084 620365295 621365662 622581406 623086014
1444.7 623086014 623956985 624787407 624458733 623881378 625261574 627188644 627780914 627909737 628548965
1453.3 628548965 630549774 632387733 632507362 630823936 629917793 633475990 634945946 636721611 637962036
1462 637962036 639283752 641731262 640787735 641161880 642995605 644889679 646459732 647867889 650377960
1470.7 650377960 651350784 650989685 651427155 655349503 659191666 659615250 661307526 664162827 666380920
1479.4 666380920 667974167 669150772 670893555 672680130 673753052 674065475 675034790 675252686 673945541
1488.1 673945541 675203323 673715439 671162033 672801437 674151688 674458389 674847412 674930267 669419174
1496.7F69419174J342163L63083l445053J52130q15201j373748o27976J323853J037903
1505.4F67376328o886979j0057525K79464L012772q56323Q29544j839447l994675k17056
1514.1F47646103j064224p96738l256454l312684K769471L538818j805191o146698
1521.8F37572403o14395J198921J893120l842735j717301m59022j776009N1689L96729
1530.5F32703400M11338l36265j669579m871978J424636N90401K34223K919960k743073
1539.2F28663063p655411J029816P68280j301651J053925J108131j566162J684837
1546.9F23784828N33943J010094l31802j953583J675224Q32176J143189j576882J774712
1555.6F26891899M288254K955818m143600j0333710Q925667M706077K668381J371880
$$ plain form
1496.7 669419174 670761337 671124420 667679367 667831497 667016296 665642548 665014572 666338425 667376328
1505.4 667376328 660489349 650431824 650711288 653724060 652867737 653697281 651857834 647863159 647646103
1514.1 647646103 646581879 645785141 642528687 639216003 641985474 645524292 643719101 637572403
1521.8 637572403 636958008 638156929 640050049 636207314 634490013 634030991 632254982 632306671 632703400
1530.5 632703400 633114738 632778473 631108894 626236916 627661552 628251953 628486176 631406136 628663063
1539.2 628663063 621007652 622037468 622805748 621504097 622558022 623666153 622099991 623784828
1546.9 623784828 624318771 625328865 624997063 623043480 624718704 625550880 626694069 625117187 626891899
1555.6 626891899 631180153 634135971 629992371 619658661 628584328 633290405 635958786 637330666
1563.3F37330666J105575p35512o16645J149215J002579R73625l772621K291451K533493
1572F41261826L49350K92053k30484p93839p072906J726074P23801j211815q15544
1580.6F34228516j755257q26378j533508n76058j112899j600228j532974k689133j917381
1589.3F20684700l371277j882439k125434k063904k639351l342934j341476k357330
1597F01560555j013337k175560j642532k257004k899780k162705l911399j803666k656784
1605.7E81037788j919250k692642j944275k037049l103103k79350k549096j323089
1613.4E65189934j960755p52754j699791j0394554J651688p22313m41437j932755K22359
1622.1E49159622j232261o502114Q46329m58031M80347l503647k609558q00667j526756
$$ plain form
1563.3 637330666 638436241 637700729 637084084 638233299 639235878 640209503 636436882 638728333 641261826
1572 641261826 641611176 641903229 641672745 640878906 633806000 635532074 636255875 635044060 634228516
1580.6 634228516 632473259 631646881 630113373 629537315 628424416 626824188 625291214 622602081 620684700
1589.3 620684700 617313423 615430984 613305550 611241646 608602295 605259361 603917885 601560555
1597 601560555 600547218 598371658 596729126 594472122 591572342 589409637 585498238 583694572 581037788
1605.7 581037788 579118538 576425896 574481621 572444572 569341469 569062119 566513023 565189934
1613.4 565189934 563229179 562476425 560776634 550382080 552033768 551311455 550870018 548937263 549159622
1622.1 549159622 547927361 541425247 542271576 541813545 542293892 538790245 536180687 535380020 533853264
1630.8E33853264q72040j953735O43310k58941l963013k803764J004562K33765J05819
1639.5E25989227O58112j461029Q63151q82263P10221J019020k859116k05116k228318
1648.1E21603889L530007J238441K864647L058167j159668n753060j106M583931J303063
1656.8E31268311J586456N13420J080780J966057J825523K032852q60633L302917K063370
1665.5E44779053K433624K590981J952514Q15659j64948M007683Q70628K984047L328247
1674.2E63597488R62143L92342K850418L851433K306709L276558R54704L992386N571137
1682.9E87755318j398888l483200K857513O535454L693848K605896L395538K403107
1690.6F04364586M086571L781128L898124M058419L743019l312340N332908O971970
$$ plain form
1630.8 533853264 532981224 531027489 531670799 531411858 527448845 524645081 525649643 525883408 525989227
1639.5 525989227 526647339 525186310 526049461 525167198 525877419 526896439 524037323 523832207 521603889
1648.1 521603889 525133896 526372337 529236984 532295151 531135483 525382423 525381317 529965248 531268311
1656.8 531268311 532854767 533368187 534448967 536415024 538240547 540273399 539412766 542715683 544779053
1665.5 544779053 547212677 549803658 551756172 552571831 552406883 556414566 557285194 560269241 563597488
1674.2 563597488 564559631 564951973 567802391 571653824 573960533 577237091 578191795 582184181 587755318
1682.9 587755318 586356430 582873230 585730743 592266197 595960045 598565941 601961479 604364586
1690.6 604364586 608451157 612232285 616130409 620188828 623931847 620619507 625952415 632924385
1698.3F32924385N885964L890228n636864Q181343O104736M306565L002777K862320
1706F61521454K502060L248367M704514K527618J908951K768707K552490K814484O60934
1714.7F85209579J038743L935928L309631m026336L768615M388428J835022R52301
1722.4G00411911P63245J004791J108856P82395Q13446J162109J967087l03955L95279
1731.1G08105164M259948L947296k255325o115112M084472L677750J668472K317276
1738.8G19689941r59167k466354L785705K746430K27966J793594L655091K867431K082443
1747.5G33423080J974335P86209M061661R9945j605377M244995K499847K436753K792740
1756.2G50714188o11878J446457K788239K574005K896576j994706p76748K726745J070404
$$ plain form
1698.3 632924385 638810349 642700577 637063713 645245056 651349792 655656357 658659134 661521454
1706 661521454 664023514 667271881 671976395 674504013 676412964 679181671 681734161 684548645 685209579
1714.7 685209579 686248322 690184250 693493881 689467545 693236160 697624588 699459610 700411911
1722.4 700411911 701175156 702179947 703288803 704071198 704884644 706046753 708013840 707709885 708105164
1731.1 708105164 712365112 716312408 714057083 707941971 712026443 715704193 717372665 719689941
1738.8 719689941 718730774 716264420 720050125 722796555 723024521 724818115 728473206 731340637 733423080
1747.5 733423080 735397415 736183624 740245285 740345230 738739853 742984848 745484695 747921448 750714188
1756.2 750714188 750102310 751548767 754337006 756911011 759807587 757812881 757036133 759762878 760833282
1764.8G60833282L14484J164017J224441k631759J999588M427871J155854k670059
1772.5G65817719j878281M588776K246475j865006R78012L36609Q30536K7466j220627
1781.2G69861679J338120K202606J410370p33185O87179K064209J022873L22647Q30079
1789.9G79006577n35660q12836k536545p08923L640823J110153n31845J745911K285156
1798.6G82662811K06452j412888J757355l81470n95474P42416p9727N38483K91977
1807.3G83729935j16425P03278J257477p60651N97687J456604N00259Q15659l46299
1815.9G87837524n9967q66088l26462N28946k35443Q24661M46396J656417J340867
1824.6G91146851k432938L99246K361145J541825j332856m444732P49817K194137L84445
$$ plain form
1764.8 760833282 761147766 762311783 763536224 760904465 762904053 767331924 768487778 765817719
1772.5 765817719 763939438 768528214 770774689 768909683 769887695 770224304 771054840 771082306 769861679
1781.2 769861679 771199799 773402405 774812775 774079590 774766769 776830978 777853851 778176498 779006577
1789.9 779006577 778470917 777658081 775121536 774412613 778053436 779163589 778631744 780377655 782662811
1798.6 782662811 782869263 781456375 783213730 782832260 782236786 782979202 782899475 783437958 783729935
1807.3 783729935 783613510 784316788 785574265 784813614 785411301 786867905 787368164 788183823 787837524
1815.9 787837524 787777557 786911469 786585007 787113953 786878510 787703171 788149567 789805984 791146851
1824.6 791146851 788713913 789113159 791474304 793016129 791683273 787238541 787988358 790182495 790566940
1833.3G90566940L87650R13925R78088M41971m15344R56802L34702M272j42898R16824
1842.9G94942932j40610n468139K348404K343292j99509m40750R20563J417312K00577
1851.6G95924072O84052j5030k08435k72980l72620J27335l02505K15606N8747O69403
1861.3G96507645K92129L03040Q57315M57992Q02155l55301k5940j567917k171707
1869.9G95099411Q92334J131821P64618J76849N93948J27488J49154M19541K11944
1878.6G99567108L07388n7067K28881m43954q9111j76087m81949J96457J98899J265335
1888.3H00515900l16010j653442J218261J357346K79617K5330q70972j250839J40610
1896.9G99445801j78681K24610M28161Q8044L77349K71454N89447n9738J06506K35596
$$ plain form
1833.3 790566940 790954590 791868515 792846603 793288574 792873230 793830032 794164734 794169006 794026108 794942932
1842.9 794942932 794802322 789334183 791682587 794025879 793826370 793385620 794306183 795723495 795924072
1851.6 795924072 796608124 796593094 796384659 796111679 795739059 795866394 795563889 795779495 795838242 796507645
1861.3 796507645 796799774 797102814 797960129 798418121 799220276 798864975 798839035 797271118 795099411
1869.9 795099411 795991745 797123566 797888184 798065033 798658981 798786469 798935623 799355164 799567108
1878.6 799567108 799874496 799817429 800046310 799602356 799513245 799337158 798855209 799051666 799250565 800515900
1888.3 800515900 800199890 798546448 799764709 801122055 801401672 801427002 800556030 799305191 799445801
1896.9 799445801 799267120 799491730 799919891 800007935 800385284 800656738 801246185 801186447 801292953 801528549
1906.6H01528549m67148p00149m21982j54877j35498O41403K3194K10647N1346P29447
1916.2H01304932K141113k232590j620559J076354M27018L52096j300735o77567M86069
1924.9G99956131r2697j79596K85339K79236N07279L56750M2877L59726l98865l99246
1934.6H00716934m51126j44424K0752l92914Q9187l4484J313552M74472k070388L70178
1944.2G99891739J029739R842l75671K8000k75956l92074r8801P4158J12839j62278
1953.8G99841537Q7739r308M81720L24630j99051j03530o24924m93698j74027J96381
1963.5G99327469l1815Q6212M55857p08466n15442P55005O06461l46070O4850K14157
1973.1G99908218l58581l19901m33273k32468j44882J21155J72424O9046K03018J27793
$$ plain form
1906.6 801528549 801061401 800361252 799939270 799784393 799648895 800290298 800313492 800524139 800575485 801304932
1916.2 801304932 803446045 801213455 799592896 800669250 801096268 801448364 800147629 799470062 799956131
1924.9 799956131 799863434 799683838 799969177 800248413 800755692 801112442 801155319 801515045 801116180 800716934
1934.6 800716934 800265808 800121384 800142136 799749222 799838409 799803925 801117477 801591949 799521561 799891739
1944.2 799891739 800921478 800931320 800555649 800583649 800307693 799915619 799816818 799890976 800003815 799841537
1953.8 799841537 799929276 799919968 800401688 800726318 800527267 800423737 799798813 799305115 799131088 799327469
1963.5 799327469 799295654 799381866 799837723 799129257 798613815 799368820 799975281 799629211 799694061 799908218
1973.1 799908218 799549637 799229736 798796463 798563995 798419113 798540268 798712692 798781738 798984756 799112549
1982.8G99112549o7825m13743j42211l53470n43137n58090l40195N27191J0224r50470
1992.4G96280823L6926J033630K12632r1782M01306q926l42026o19049l02200m16489
2002.1G96184845l24402J7243r5597J03379j08567J59989K65731K09809j07269l50800
2011.7G95954361j18790n70678l20893j68457l97568k48031J63879J19858K6932O14090
2021.3G95054703K88543l47366p05337j23063j01623p28302l01666l18222r7733k05460
2031G92414474r7885L00827J51139R4757q6746J49993j78299n08651n91431l99551
2040.6G91248627k31171j48010Q5068m24729J92719L42102J2512K8000q2550K56347
2050.3G91278915J3352L1814q38317r51615k10266j04752J61515l64304j24817J2207
$$ plain form
1982.8 799112549 799044724 798630981 798488770 798135300 797592163 797034073 796693878 797221069 797231293 796280823
1992.4 796280823 796317749 797351379 797564011 797472229 797873535 797864609 797522583 796903534 796601334 796184845
2002.1 796184845 795860443 795877686 795782089 795885468 795776901 795936890 796202621 796412430 796305161 795954361
2011.7 795954361 795835571 795264893 794944000 794775543 794377975 794129944 794293823 794413681 794440613 795054703
2021.3 795054703 795343246 794995880 794290543 794167480 794065857 793337555 793035889 792717667 792619934 792414474
2031 792414474 792316589 792617416 792768555 792863312 792776566 792926559 792748260 792239609 791648178 791248627
2040.6 791248627 791017456 790869446 790954514 790529785 790722504 791064606 791077118 791105118 791022568 791278915
2050.3 791278915 791292267 791324081 790485764 789534149 789323883 789219131 789380646 789016342 788891525 788903732
2059.9G88903732L56598L81241j25961m7455q39233p77436p13272m59823j21918k98310
2069.6G86258163r3994j89743J38474j90430k52228j09710n06058p03354p61948k42309
2079.2G83346863l15399n93415o00509j5335J08566r2850M13513K25449J63650J22452
2088.9G82762985J84937j88980n52216l32947m41589m2343k38571r5826N65339N68237
2098.5G82189026L30505L17307M00696K82287N19638k04468m27780j58539j18103J2207
2108.1G83142776k67486L92532L75901N67321M76532J79291O98700o4392L9062J831
2117.8G85542068m72946p41348p79343p6980R8419L60031L6011j01547n7526j18103
2127.4G83688736P9117O3858M7378l46450k95258m93011j87073J98288J71890M22058
$$ plain form
2059.9 788903732 789260330 789641571 789515610 789468155 788628922 787851486 787138214 786678391 786556473 786258163
2069.6 786258163 786164169 785974426 786112900 785922470 785670242 785560532 785054474 784351120 783589172 783346863
2079.2 783346863 783031464 782438049 781837540 781822205 781930771 781837921 782251434 782476883 782640533 782762985
2088.9 782762985 782947922 782758942 782206726 781873779 781432190 781389847 781151276 781055450 781620789 782189026
2098.5 782189026 782519531 782836838 783237534 783519821 784039459 783834991 783407211 783248672 783130569 783142776
2108.1 783142776 782875290 783267822 783643723 784211044 784687576 784866867 785565567 785501175 785540237 785542068
2117.8 785542068 785069122 784327774 783548431 783471451 783569870 783929901 783965912 783864365 783806839 783688736
2127.4 783688736 783767853 783831711 783879089 783532639 783237381 782744370 782557297 782755585 782927475 783349533
2137.1G83349533P5836L16086K59323L48358J34735j74789J52283l51410o3172J9227
2146.7G84066010l052j48392k36053P13424O47431J13830J39694O15387L00827n111
2156.4G86203995j49079l57818J22146j13830j02158n6000J7243Q4610K40784N45044
2166G86434937j04218j64795J10016L33633l80859p13882j6175j88980p324j48010
2175.6G85154343l62854j52512M82101N71366o0730n8899l62778n7678K8229k49176
2185.3G84931412l64685j26114N03082J18332J19400L62091Q42590Q98133M55551N14450
2194.9G88254242K94571K0676m60663J6021L43552K9068k92053m13056L39966O15387
2204.6G88747711N87006J7242J85318L83377J48926M02222m00849m35028j54037r7580
$$ plain form
2137.1 783349533 783425369 783741455 784000778 784349136 784483871 784309082 784461365 784109955 784046783 784066010
2146.7 784066010 784062958 783914566 783678513 784391937 785039368 785153198 785292892 785908279 786209106 786203995
2156.4 786203995 786054916 785697098 785819244 785705414 785603256 785547256 785564499 785649109 785889893 786434937
2166 786434937 786330719 786165924 786275940 786609573 786228714 785514832 785498657 785309677 785302353 785154343
2175.6 785154343 784791489 784638977 785121078 785692444 785631714 785572815 785210037 785152359 785180588 784931412
2185.3 784931412 784566727 784440613 784943695 785062027 785181427 785543518 786386108 787284241 787739792 788254242
2194.9 788254242 788548813 788569489 788108826 788124847 788468399 788497467 788205414 787792358 788132324 788747711
2204.6 788747711 789334717 789351959 789537277 789920654 790069580 790471802 790070953 789635925 789481888 789384308
2214.2G89384308o6223J30920L86658K44369L70179j94626K73437K25601j79290L2577
2223.9G90607910k78473J47629m41666l66973j66321j03684L91007j2055N41077L11737
2233.5G90630188j00021p2251m8218r7198n28030k90070k94723k6627R3994K73895
2243.2G89540939J31302j36032J54190R1553K86941j56478q4229j88827m59290k6245
2252.8G89153824J15967L35388k63519M1885J87149j20087K61765L42331L14331j96686
2262.4G90172348j38092k51999j5564J21613P6751J31913m97208K87857L71170J00174
2272.1G90358963p4005j22681L48358R1019K38342m81643m70963j67923k1133K02255
2281.7G89900589k20871J80206k60849j00174K04697M78668L62549n87387j04828l7613
$$ plain form
2214.2 789384308 789318085 789449005 789835663 790080032 790450211 790255585 790529022 790754623 790575333 790607910
2223.9 790607910 790329437 790477066 790035400 789668427 789502106 789398422 789789429 789777374 790318451 790630188
2233.5 790630188 790530167 790457916 790409698 790312500 789784470 789494400 789199677 789173050 789267044 789540939
2243.2 789540939 789672241 789536209 789690399 789781952 790068893 789912415 789828186 789639359 789180069 789153824
2252.8 789153824 789269791 789605179 789341660 789383545 789570694 789450607 789712372 790054703 790369034 790172348
2262.4 790172348 790034256 789782257 789766693 789888306 789965057 790096970 789599762 789887619 790258789 790358963
2272.1 790358963 790284958 790162277 790510635 790601654 790839996 790358353 789887390 789719467 789698334 789900589
2281.7 789900589 789679718 789859924 789599075 789498901 789703598 790182266 790544815 789957428 789852600 789814987
2291.4G89814987L90244k09503n86396p1106l35693L66058N1422J77384L51486K73438
2301G90222321K17666k04773n6839m12979J12610r2926k78015m53263n18341K55280
2310.7G88790741l35007J38779q3542J94779N29098K5024M12674l91006p80106q56170
2320.3G87645264J86309j80816j117630l78189k8382Q71506L19367P77435J99356L6468
2329.9G88330688J67847q28628P62024p06330o80542L79105l87726j46942K72217N92498
2339.6G87754211o38732L34854Q00552l93677p23800K41699J494827L81012K79694
2348.3G89530640J235122R56498m86603J64871K67105j053772o55899j245804m40979
2356.9G88271179J27106m39224q33741P24564J181641p58438N07125j42746J44730
$$ plain form
2291.4 789814987 790205231 789995728 789409332 789338226 789002533 789368591 789420013 789597397 789948883 790222321
2301 790222321 790439987 790235214 790178375 789765396 789878006 789785080 789507065 789053802 788535461 788790741
2310.7 788790741 788455734 788594513 788510971 788705750 789234848 789259872 789672546 789281540 788501434 787645264
2320.3 787645264 787831573 787650757 786533127 786154938 786126556 786998062 787317429 788094864 788294220 788330688
2329.9 788330688 788498535 787669907 788431931 787725601 787045059 787424164 787036438 786889496 787161713 787754211
2339.6 787754211 787115479 787450333 788250885 787857208 787133408 787375107 788869934 789250946 789530640
2348.3 789530640 790765762 791722260 791235657 791400528 791667633 790613861 789957962 788712158 788271179
2356.9 788271179 788398285 787959061 787125320 787849884 789031525 788273087 788780212 788637466 788782196
2365.6G88782196N05219k28272L05481N67169J024399p9880L31803R03473J97219l85666
2375.3G91923141j72958M64096M41284Q23670J73950k61993Q5220N14145P22198K23923
2384.9G94936676L1586l23563j12610m0741j53885j33361k46964K77023K68402L51639
2394.6G94854202J17111m6768J7472q3390J55793k62375j77002l89176n03082l21350
2404.2G93361435l61557K18429K37732K49634J32447K99987K73743l3493r1629o32095
2413.8G93654633m46396k51618k01187l14941p1106J66549m7073M00772J92719J05667
2423.5G93188019q8730j28403j55792n71442r8648k77023m65469l38135J08108N5771
2433.1G91228256k23083L16238R3994L23181J45112j96915j95160n29251k03171k44751
$$ plain form
2365.6 788782196 789287415 789059143 789364624 789931793 790956192 790876312 791208115 792111588 792308807 791923141
2375.3 791923141 791750183 792214279 792655563 793479233 793653183 793391190 793476410 793990555 794712753 794936676
2384.9 794936676 794968262 794644699 794532089 794491348 794337463 794204102 793957138 794234161 794502563 794854202
2394.6 794854202 794971313 794924545 794942017 794858627 795014420 794752045 794575043 794185867 793682785 793361435
2404.2 793361435 792999878 793218307 793456039 793705673 793838120 794138107 794411850 794378357 794286728 793654633
2413.8 793654633 793208237 792956619 792755432 792440491 792369385 792535934 792488861 792889633 793082352 793188019
2423.5 793188019 793099289 792970886 792815094 792243652 792145004 791867981 791402512 791064377 791172485 791228256
2433.1 791228256 791005173 791321411 791415405 791738586 791883698 791686783 791491623 790962372 790759201 790514450
2442.8G90514450l09524k87705L4485J27563j78909K05307M34418K29568k48794l25928
2452.4G90194931m03976m14353k76565l12348m53567o33622J49918N49545L20740O6986
2462.1G88787689L64914N95246l52860n22156m20074n89905r25140o47355q8806l21045
2471.7G85880508l3493J49918P85751O96183p4387L26691n5848p07778q22525n72205
2481.3G85572815m32434m82941k15835j79215K51618P71102J80207l43857J26038J28173
2491G85375671r4223l21884p10449q09555o90537p6294j03759K6474L08990K64130
2500.6G83168564L48739j15280J77079m4785o80084m11911l81394m04281m05884k62756
2510.3G80988007j01929L18146K55508j49383J46560L22724J91726j19934j69220m55780
$$ plain form
2442.8 790514450 790204926 789917221 789951706 790079269 789900360 790105667 790540085 790769653 790520859 790194931
2452.4 790194931 789790955 789376602 789100037 788787689 788334122 787700500 787850418 788399963 788720703 788787689
2462.1 788787689 789152603 789747849 789394989 788872833 788452759 787862854 786937714 786290359 786201553 785880508
2471.7 785880508 785847015 785996933 786782684 787478867 787404480 787731171 787675323 786967545 786145020 785572815
2481.3 785572815 785140381 784657440 784441605 784262390 784514008 785285110 785465317 785121460 785247498 785375671
2491 785375671 785281448 784959564 784249115 783439560 782749023 782672729 782568970 782595444 782904434 783168564
2500.6 783168564 783517303 783402023 783579102 783534317 782854233 782442322 782060928 781656647 781250763 780988007
2510.3 780988007 780886078 781204224 781459732 781310349 781456909 781779633 781971359 781851425 781682205 781226425
2519.9G81226425q05511o72150k28043J61667N0278p8278k34222L33252L77808k14081
2529.6G79917145l4943J46561K16675n38178r73739o06385k38266p9498J8616L40347
2539.2G78168335K43378L36609n8594O3324K17895m46472j99509n49621n35507k23008
2548.9G77016830k84118K7542l3569M0359J30615L31497N01633K81677n52520q52433
2558.5G76607513m33349l00141k00576n44587l23867l49045j76239N20935N09643N60380
2568.1G75870667r6131k28271k13776l96576k89535k97928Q1711m60816n06897k38571
2577.8G73223877j96610K65885J87149O2485k823J46637q3161l40118n95093n89065
2587.4G72079163p1335r4376k33002p07550j85318L89405J25732P6218k40860l6926
$$ plain form
2519.9 781226425 780420914 779748764 779520721 779682388 779732666 779654388 779420166 779753418 780131226 779917145
2529.6 779917145 779882202 780028763 780245438 779707260 778733521 778127136 777888870 777809372 777827988 778168335
2539.2 778168335 778411713 778748322 778689728 778753052 778970947 778524475 778324966 777775345 777239838 777016830
2548.9 777016830 776732712 776760254 776726685 776767044 776897659 777229156 777730789 778012466 777459946 776607513
2558.5 776607513 776174164 775874023 775673447 775128860 774804993 774455948 774279709 774800644 775310287 775870667
2568.1 775870667 775774536 775546265 775332489 774935913 774646378 774348450 774430161 773969345 773462448 773223877
2577.8 773223877 773027267 773293152 773480301 773542786 773539963 773686600 773603439 773263321 772668228 772079163
2587.4 772079163 772007828 771913452 771680450 770972900 770787582 771176987 771302719 771378937 771138077 771101151
2597.1G71101151j6022k41928o70853p92084m34799k08588L95050J87455j53275k67944
2606.7G68898163k97775j36719j54267l26385m97360p1793k12097j79138p1030r1400
2616.4G66860199K5940p31659n85556M6997j04446n92957p4997K68555m36402l01971
2626G64373703l59726j77460k02713n12848j99127P4997J39466m35944k78015k17743
2635.6G62204590p1640K09045m48837p25021o75278J28097N3940n15823k74353j15280
2645.3G59769440K32544n9967l43781m87900l39660j70441k80228j45187o76956m03595
2654.9G57094269J16424k86560R842N54123j77612q85697m86755l52859q8349L82l13950
2665.5G55183258m03290l81393j92032l54157j92489J01318M807m32434p42722N5695
$$ plain form
2597.1 771101151 771085129 770843201 770172348 769380264 768945465 768736877 769131927 769319382 769166107 768898163
2606.7 768898163 768600388 768463669 768309402 767983017 767485657 767413864 767201767 767022629 766951599 766860199
2616.4 766860199 766886139 766154480 765568924 765615921 765511475 764918518 764843521 765112076 764675674 764373703
2626 764373703 764013977 763836517 763633804 763120956 762921829 762996826 763136292 762700348 762422333 762204590
2635.6 762204590 762132950 762341995 761893158 761168137 760492859 760620956 760674896 760159073 759884720 759769440
2645.3 759769440 760001984 759942017 759598236 759110336 758770676 758600235 758320007 758174820 757497864 757094269
2654.9 757094269 757210693 756924133 756933975 757488098 757310486 756424789 755938034 755585175 755496826 755497208 755183258
2665.5 755183258 754779968 754398575 754206543 753852386 753659897 753761215 753766022 753333588 752590866 752646561
2675.2G52646561N47256N1651m37698n74036j62811k50778r95560l10516K08740j85547
2684.8G50537262M6768l75290m20074J17035K80227n569n82123o75964p33872l7765
2694.5G48150635R1247k94799o8207k05307j73035m15955k05612l6850l35006J03149
2704.1G46610260N417o01578n29251j44043j87836o7291k80685n06516k73590j27335
2713.8G43897552J37711m61502o50635m30832j79443L16544j07499l26767m49142l51029
2723.4G41394958j73110M0588L8223p75070o00815j32599j66931m68445l24020R3765
2733G38926544j42059l54386m60739j83792k78015m17633j61591r3536m23584n78689
2742.7G35832520L68499K72980l02124j84860J4343j25122q67233n41001j60980o8893
$$ plain form
2675.2 752646561 753193817 753245468 752807770 752233734 752070923 751820145 750824585 750514069 750722809 750537262
2684.8 750537262 750584030 750208740 749788666 749905701 750185928 750180359 749598236 748922272 748188400 748150635
2694.5 748150635 748241882 747947083 747878876 747673569 747500534 747084579 746878967 746842117 746507111 746610260
2704.1 746610260 746615677 746014099 745484848 745340805 745152969 745085678 744804993 744298477 744024887 743897552
2713.8 743897552 744035263 743573761 742923126 742492294 742312851 742629395 742521896 742195129 741745987 741394958
2723.4 741394958 741221848 741262436 741300659 740525589 739924774 739792175 739625244 739156799 738832779 738926544
2733 738926544 738784485 738430099 737969360 737785568 737507553 737089920 736928329 736834793 736411209 735832520
2742.7 735832520 736201019 736473999 736171875 735987015 736001358 735876236 735009003 734468002 734307022 734238129
2752.3G34238129L7307k62222k89612l24554k06909l17841n76858n17044k20643p4005
2762G31485748j09482m48608o24847j20621o57806o90232J12534k18048m77982j10474
2771.6G28140182l7841l41034k05002o86264o57730O4544l93676p43180o65207k23541
2781.3G24251251l07312k42386j43356p43332j95007O2179J7014j06201n83039m70199
2790.9G21539612o14319j071014j091385m08020n34k9068l54157l75824l21884o70319
2800.5G16603088k00729k04773p68509j133804p87659j26495j78147k70538q15353
2809.2G12117081p76291o00052o61163l11203k70615l74832r19647o68335j65177j87759
2818.9G07182007m07562j121445j225968q58383k68097n7373l62014p88880o33087
$$ plain form
2752.3 734238129 734275436 734013214 733723602 733399048 733192139 732874298 732297440 731780396 731559753 731485748
2762 731485748 731376266 730927658 730302811 730182190 729524384 728834152 728946686 728728638 728250656 728140182
2771.6 728140182 728102341 727761307 727556305 726870041 726212311 726276855 725883179 725139999 724474792 724251251
2781.3 724251251 723943939 723701553 723558197 722814865 722619858 722682037 722699051 722592850 722009811 721539612
2790.9 721539612 720925293 719854279 718762894 718354874 718354340 718325272 717971115 717595291 717273407 716603088
2800.5 716603088 716402359 716197586 715429077 714295273 713507614 713381119 713202972 712932434 712117081
2809.2 712117081 711340790 710740738 710079575 709768372 709497757 709122925 708203278 707534943 707369766 707182007
2818.9 707182007 706774445 705653000 704427032 703568649 703300552 703243179 702881165 702092285 701459198
2827.6G01459198k48871q91037r63363p49131p65991o16150n67245q46100j250916
2836.2F94560394p97271m79813n29480j337051k001801j298370j240464j538162j602249
2844.9F83735733j838150k035522k243653k289886j840592j417465r59549k46963m33121
2853.6F70430832m90112k17896k99911m26178l23792n7526n38940n09644n80673q30993
2863.2F66155167m70581o64521p63244r43451p48062n92118j061096q69141l67813
2871.9F59675140n58319j113357r12018r02939p44247m42276m69895j29776k45132
2880.6F54157181j68610l47519o40716o61469q16650o28967q37021q06198j061402
2889.3F48188629j013946m00620o87332n43137o69860j034852p93685r66645j010818
$$ plain form
2827.6 701459198 701210327 700319290 699355927 698606796 697840805 697224655 696657410 695811310 694560394
2836.2 694560394 693763123 693283310 692753830 691416779 689414978 688116608 686876144 685337982 683735733
2844.9 683735733 681897583 679862061 677618408 675328522 673487930 672070465 671110916 670863953 670430832
2853.6 670430832 669940720 669722824 669422913 668996735 668672943 668615417 668076477 667566833 666986160 666155167
2863.2 666155167 665684586 665020065 664256821 663313370 662565308 661973190 660912094 660042953 659675140
2871.9 659675140 659116821 658003464 657091446 656188507 655444260 655001984 654532089 654402313 654157181
2880.6 654157181 653988571 653641052 653000336 652338867 651522217 650893250 650056229 649250031 648188629
2889.3 648188629 647174683 646774063 646086731 645543594 644873734 643838882 643045197 642078552 641067734
2897.9F41067734m32968j60828m45404p42302r11636o93055n93338l26652j16768o72874
2907.6F35971909n86815k17858l83987p62329r06143o38924q42590j506081j342773
2916.3F28784409p85294r18884p00493l96538n68657r45091r81979k11983m7951j95846
2925.9F23031693q9798R7999J99089J99814k098n06325K22130O98700K30713L9062
2935.6F24120979K6055M65164M46091L87420N95703M31557L54424L75137J73111J23520
2945.2F27499161K22702P9498J25885k66762l63311p5303m20456o71958q86422j48353
2954.8F25094681K97699l38288k76107j01624j33972j08643K06528L54652L61519L93982
2964.5F25750427J2703J81809P19795O33354M19502P21321J060143J278267J030998
$$ plain form
2897.9 641067734 640634766 640473938 640028534 639286232 638374596 637681541 637088203 636761551 636644783 635971909
2907.6 635971909 635385094 635167236 634783249 634020920 633114777 632475853 631633263 630127182 628784409
2916.3 628784409 627999115 627080231 626379738 625983200 625414543 624469452 623487473 623275490 623227539 623031693
2925.9 623031693 622941895 623039894 623238983 623438797 623436699 622930374 623152504 623851204 624081917 624120979
2935.6 624120979 624147034 624612198 625058289 625445709 626041412 626472969 626827393 627202530 627375641 627499161
2945.2 627499161 627721863 627801361 627927246 627660484 627297173 627221870 626801414 626129456 625243034 625094681
2954.8 625094681 625392380 625054092 624777985 624676361 624542389 624433746 624640274 624994926 625356445 625750427
2964.5 625750427 625763130 625944939 626664734 627298088 627717590 628438911 629499054 630777321 631808319
2973.2F31808319Q06351J056709P82967O57310O10657P96432J046296P67326O21490
2981.8F38953857N50194J007500J121979O84433L87725N47562Q18405P66526J038055
2990.5F45876236L61786q2169K70920M37164N22919K30408L68957l8528Q6288M43497
3000.2F48477478m6616J48621j07498k22397L510O8359N8594R8724L17764l77502l25241
3010.8F48093796K46734k93197n58014K38952M10386o58951q11844k74201j71051n14678
3020.4F45707932o54297m82102m83627k07520k67181k83279j94855m89655k21176q0566
3030.1F42343674m60434n17960m22287n03464p43789r27925n50766j83564k44217l83148
3039.7F37406120n81970n39627l23143j34277m40026r12323r22279o94885k07291k53677
$$ plain form
2973.2 631808319 632614670 633671379 634454346 635111656 635722313 636518745 637565041 638332367 638953857
2981.8 638953857 639504051 640511551 641633530 642317963 642705688 643253250 644071655 644838181 645876236
2990.5 645876236 646238022 646155853 646426773 646863937 647386856 647617264 647986221 647947693 648033981 648477478
3000.2 648477478 648430862 648579483 648471985 648249588 648253098 648321457 648380051 648478775 648796539 648419037 648093796
3010.8 648093796 648340530 648047333 647489319 647728271 648138657 647479706 646667862 646393661 646222610 645707932
3020.4 645707932 645053635 644571533 644087906 643880386 643613205 643329926 643135071 642645416 642424240 642343674
3030.1 642343674 641883240 641365280 640942993 640439529 639695740 638767815 638217049 638033485 637789268 637406120
3039.7 637406120 636824150 636284523 635961380 635827103 635387077 634474754 633552475 632857590 632650299 632396622
3049.4F32396622n87349o38657o38313k80075J3504j97602r14077j181412n24788m55437
3059F26992416j128616q27026P2899K9258o47964j061478k68059K41051l14674k44599
3068.6F22843208k65808m68941m53033o80656m98696n87463p62673l19900m47502m21181
3078.3F17937355k14386k59819J22185o35338j122131l85209m25758o17790n64346
3087F13834763k39335j22413m27551q67806q81386j52321M0017K17895m14810j346741
3096.6F09640312p06672k83890k55318r03549j414032o12145k04353m19083n87959
3105.3F04253311k04925O8512n78537q33397n66292m17519l95164r62219p21779k89040
3114.9E99352951r04083o09284j59454k06528r48372j126442j33056p65724j344414
$$ plain form
3049.4 632396622 631809273 631170616 630532303 630252228 630265732 630068130 629154053 627972641 627447853 626992416
3059 626992416 625863800 625036774 625109673 625138931 624490967 623429489 623161430 623402481 623087807 622843208
3068.6 622843208 622577400 622108459 621655426 620974770 620476074 619888611 619125938 618806038 618358536 617937355
3078.3 617937355 617722969 617463150 617585335 616949997 615827866 615442657 615016899 614399109 613834763
3087 613834763 613595428 613473015 613045464 612177658 611296272 611143951 611183968 611401863 610987053 609640312
3096.6 609640312 608933640 608649750 608394432 607490883 606076851 605464706 605260353 604841270 604253311
3105.3 604253311 604048386 604116898 603538361 602704964 602138672 601721153 601325989 600363770 599641991 599352951
3114.9 599352951 598448868 597839584 597680130 597473602 596525230 595398788 595265732 594500008 593155594
3123.6E93155594j077271q74824n41001m58717n03464j034546n14259j78642r39255
3132.3E87033615r67445n37033m34227n84488k69890o96297q81691n97877j021805
3141E81042862q13408q21762p09610p15866q19054l41263n04646p07970j008758j048050
3150.6E73552475o45447m96597o50940r39713o01882m93622j239701j037445J7891
3159.3E67465019o41556j245422o37016r03206j064262p38869n88188o75087q60901
3168E60110512q38814k85339l15781j250992r44099n60799o11305n56526n61028n50079
3177.6E53635750j270943j255836o26946k70080o75583r02481k83280q28819q34198
3186.3E46687584m79584j318893j482849m82827J6785n29289o15959m19999m51011
$$ plain form
3123.6 593155594 592078323 591203499 590662498 590203781 589700317 588665771 588151512 587972870 587033615
3132.3 587033615 586066170 585529137 585094910 584510422 584240532 583544235 582662544 582064667 581042862
3141 581042862 580229454 579407692 578698082 577982216 577163162 576821899 576317253 575609283 574600525 573552475
3150.6 573552475 572907028 572410431 571759491 570819778 570217896 569724274 568484573 567447128 567465019
3159.3 567465019 566823463 565578041 564941025 564037819 562973557 562234688 561646500 560971413 560110512
3168 560110512 559271698 558986359 558670578 557419586 556475487 555914688 555303383 554746857 554185829 553635750
3177.6 553635750 552364807 551108971 550482025 550211945 549536362 548633881 548350601 547521782 546687584
3186.3 546687584 546208000 544889107 543406258 542923431 542940216 542410927 541794968 541374969 540923958
3195E40923958q76656j059761p02324p15942p04689o90308l65066n92995j212501p45316
3204.6E33258400j4839o8894r26056j020736o47125n30205o39038q33435o54564q26340
3214.3E27097168l01323O5155o69975p30095n41725r76181j117058k76566J36834n20363
3223.9E22165871j080246q53997o71615q92754k75230J06964n02625o54068l77769
3232.6E16964531o69670r14612n27267l63312o25229p60803p47338p56721j66245j85012
3242.2E11248322p84684m86259o04553l64228k00386j261558j248093k62566j01737
3250.9E05934258k52305k72674q97904p91740o9313l59573j113701r02939j27792n39361
3260.5E00606956m18930j24359m19235k89917n77850m92363n94483o48918l18870j70136
$$ plain form
3195 540923958 540047302 538987541 538285217 537569275 536864586 536174278 535809212 535216217 534003716 533258400
3204.6 533258400 533243561 533174667 532248611 531227875 530580750 530050545 529411507 528578072 527923508 527097168
3214.3 527097168 526795845 526861000 526191025 525460930 524919205 523943024 522825966 522549400 522686234 522165871
3223.9 522165871 521085625 520231628 519560013 518667259 518392029 518498993 517996368 517342300 516964531
3232.6 516964531 516294861 515380249 514852982 514489670 513864441 513103638 512356300 511599579 511433334 511248322
3242.2 511248322 510463638 509977379 509372826 509008598 508808212 507546654 506298561 506035995 505934258
3250.9 505934258 505681953 505409279 504511375 503719635 503650322 503290749 502177048 501274109 501146317 500606956
3260.5 500606956 500188026 500063667 499644432 499354515 498776665 498284302 497689819 497040901 496722031 496551895
3270.2D96551895n3215l96957m86222j088638p53937K34299n09224q18481o12107p82280
3279.8D91285133m97322j05629j16844o9351m54521q85430n82771k66189K24990p5340
3289.5D88456726m05044k09427m36325l85590m28047l26653l26309n27267m98009l46909
3299.1D84567146k77633l55225j63994l40576m56619m92897k85988k25639o33584k28233
3308.8D81106758k55165l83759k66952k22893o02875j326141p07245q8959j4038n55381
3318.4D76683350o99997k85950l84369R1019k27165n25017m27399n86929m40827r89456
3328.1D72207260q79783m80195l25279j52435m92935m91448l06549j38321m86831p76482
3337.7D67677002l20053n64270n32303Q2741m05274q98437q56438m36745P9499n02854
$$ plain form
3270.2 496551895 496498680 496101723 495615501 494526863 493772926 494007225 493498001 492679520 492067413 491285133
3279.8 491285133 490787811 490682182 490565338 490495987 490041466 489156036 488573265 488307076 488532066 488456726
3289.5 488456726 488051682 487842255 487405930 487020340 486592293 486265640 485939331 485412064 484914055 484567146
3299.1 484567146 484289513 483934288 483770294 483429718 482973099 482480202 482194214 481968575 481334991 481106758
3308.8 481106758 480851593 480467834 480200882 479977989 479375114 478048973 477341728 477252769 477238731 476683350
3318.4 476683350 475983353 475697403 475313034 475404053 475176888 474651871 474224472 473637543 473196716 472207260
3328.1 472207260 471327477 470847282 470522003 470369568 469876633 469385185 469078636 468940315 468453484 467677002
3337.7 467677002 467356949 466792679 466260376 466343117 465937843 465039406 464182968 463746223 463825722 463322868
3347.3D63322868m62417p4654n50423o31294p69882j017265n26390K62718l38173j378098
3357D57836990j050186j16043K85797o63414r58938j87760j24016l13072n0735r6360
3366.6D54562263p90863o88247p02400j112900q61626m74663j64413o7024l02353o00357
3376.3D48797417j21308n7144n14488o92291o97556L0556l25432o09856J27488N1918
3385.9D45989304j83258p6371j47056r14383o76766J25008M501k47574m46548l09982
3395.6D43116875l61061m97513l58429q6441Q9340K07367j08299j135598p00683M68063
3405.2D40633621M80156l37562m88968j06049n31540j18027M41552j46599p91588m60129
3414.8D38574867J92185K07786L03688M6654k08740j94893j90163j44767N607J26457
$$ plain form
3347.3 463322868 462860451 462785797 462235374 461604080 460834198 459816933 459290543 459553261 459215088 457836990
3357 457836990 456786804 456670761 456956558 456293144 455334206 455146446 455022430 454709358 454658623 454562263
3366.6 454562263 453771400 453083153 452380753 451267853 450406227 449931564 449767151 449700127 449397774 448797417
3376.3 448797417 448676109 448618965 448104477 447412186 446714630 446745186 446419754 445809898 445937386 445989304
3385.9 445989304 445806046 445729675 445582619 444668236 443991470 444116478 444120979 443873405 443426857 443116875
3395.6 443116875 442755814 442258301 441899872 441813431 441902771 442110138 442001839 440866241 440165558 440633621
3405.2 440633621 441113777 440776215 440287247 440181198 439649658 439531631 439973183 439826584 439034996 438574867
3414.8 438574867 438767052 438974838 439278526 439325180 439116440 438921547 438731384 438586617 438592224 438718681
3424.5D38718681L4447N03655K59933l14560j89056J96724J65710m69665q1521K22664
3434.1D39047012J98937J80244J86272L06015J29318K77977M60854N66864m67835o4010
3443.8D40821648L85437j83449J245193k76222p49512Q56667L34129O29349M45213
3452.5D43508453M58489L92151j75896J97830O91223N60913j27182J76430L80135M69551
3462.1D46532097N42755N84526L81851p3471R14383O20041J39236N63927K97203J79711
3471.7D50682259J46484R38072J011734K19956J10778M61312J011200O25458K9296
3480.4D55236549M38271O53648J51444Q53004J022110r5863J38512N37567L58772P99789
3490.1D60093803J069451O19850N58929M75312L00712P15714N61218K61765N91926
$$ plain form
3424.5 438718681 438753128 439256783 439516716 439202156 439013100 439209824 439375534 438905869 438824348 439047012
3434.1 439047012 439245949 439426193 439612465 439918480 440047798 440325775 440786629 441353493 440885658 440821648
3443.8 440821648 441207085 441023636 442268829 441992607 441243095 442099762 442433891 443063240 443508453
3452.5 443508453 443966942 444359093 444183197 444381027 445072250 445633163 445505981 445682411 446062546 446532097
3462.1 446532097 447074852 447659378 448041229 447967758 448882141 449502182 449641418 450205345 450502548 450682259
3471.7 450682259 450828743 451766815 452778549 452998505 453109283 453570595 454581795 455207253 455236549
3480.4 455236549 455674820 456328468 456479912 457332916 458355026 458259163 458397675 458935242 459294014 460093803
3490.1 460093803 461163254 461783104 462342033 462817345 463118057 463833771 464394989 464656754 465248680
3498.7D65248680P57637N10750J341248J110496o64787K73132P00684K36320M59252
3507.4D69973412J306419J075668l53508O98204R96476Q98323P98835L35350Q64640
3516.1D76593819L62472M4518N42068R29146J312675J509972L42178r40971O08101
3524.8D81303978J040306N20554J132812J292915K05422M02718N65643N35507J440048
3533.5D88439903P81327J372070P87964n55878J476250J047935L58353M54292R97162
3542.1D95159378J613045R77974J72958L65524J196442p60269J070137K307472J555481
3550.8E03658142J654320j284981J18103J039276J382523K040520K08969R84687J125489
3559.5E10927048Q19931J9035R52034J613083J273003L935470R5902j108246L23219
$$ plain form
3498.7 465248680 466006317 466517067 467858315 468968811 468304024 468577156 469277840 469514160 469973412
3507.4 469973412 471279831 472355499 472001991 472700195 473696671 474594994 475393829 475729179 476593819
3516.1 476593819 476956291 477000809 477542877 478472023 479784698 481294670 481636848 480695877 481303978
3524.8 481303978 482344284 482864838 483997650 485290565 485495987 485898705 486464348 486999855 488439903
3533.5 488439903 489221230 490593300 491381264 490825386 492301636 493349571 493707924 494162216 495159378
3542.1 495159378 496772423 497750397 497923355 498288879 499485321 498725052 499795189 502102661 503658142
3550.8 503658142 505312462 504027481 504145584 505184860 506567383 508607903 508816872 509801559 510927048
3559.5 510927048 511746979 511766014 512718048 514331131 515604134 519539604 519635506 518527260 518850479
3568.2E18850479j092758L018494J587715O50215J613350J779976R41009Q79669J529160
3576.9E29757309L94096K003746J188965M4441J235390J842423J723137O31942L947869
3585.5E42769318J401329l325882J571121o2599K668380L006363K537461P05757K15759
3594.2E51487007L394470r20906J929245L293648J13640J879196M53758J404610K292213
3602.9E65326881J576386J733589K436066K614937j572190K407952N52559n65796O635437
3611.6E81145821J169395k169113L782539l88832L758660N144119J131439J278839
3619.3E94852867k653313k60276L600082K906799K601967L187676K452774K285423
3627F08973999O030731P7934j0202407M669647N652618O115876K210578j640091K410813
$$ plain form
3568.2 518850479 517757721 520776215 522363930 523014145 524627495 526407471 527348480 528228149 529757309
3576.9 529757309 530151405 532155151 533344116 533388557 534623947 536466370 538189507 538821449 542769318
3585.5 542769318 544170647 540844765 542415886 542353287 545021667 548028030 550565491 551271248 551487007
3594.2 551487007 554881477 553960571 555889816 559183464 559297104 561176300 561630058 563034668 565326881
3602.9 565326881 566903267 568636856 571072922 573687859 572115669 574523621 575076180 574510384 581145821
3611.6 581145821 582315216 580146103 583928642 583539810 587298470 592442589 593574028 594852867
3619.3 594852867 592199554 591939278 595539360 598446159 601048126 604235802 606688576 608973999
3627 608973999 615004730 615082664 604880257 609549904 615202522 621318398 623528976 621888885 624299698
3635.7F24299698L552093K695008O58264J427574K530861K646751J599198R79576K743530
3644.4F43132553L519440O074981N12009l534698N735244o61315l692627l21351O102372
3653F56866608N521545M398956N175705q073501J556091O057587J416321J113586J027451
3661.7F75060349K541809J732101J676483J651383R81674M424820L091507O12182o16378
3670.4F91155930q679123K911377R389724J0663452K089615k0569305K077179P597198
3678.1F96636047M812851j530838J07651L090973J902695Q47091L89710P76901M148560
3686.8G11181641O220855r187622m222793Q247070n874329q48999N206833K81525J186600
3695.5G12190781O55288p18383Q22677P17545K562027K801437m383316j222916M301529
$$ plain form
3635.7 624299698 627851791 630546799 631205063 632632637 635163498 637810249 639409447 640389023 643132553
3644.4 643132553 646651993 652726974 653238983 649704285 655439529 654778214 651085587 650764236 656866608
3653 656866608 662388153 666787109 671962814 663889313 665445404 671502991 672919312 674032898 675060349
3661.7 675060349 677602158 679334259 681010742 682662125 683643799 688068619 691160126 691772308 691155930
3670.4 691155930 682476807 685388184 694777908 705441360 707530975 686961670 689038849 696636047
3678.1 696636047 701448898 699918060 700025711 703116684 705019379 705866470 706256180 707033081 711181641
3686.8 711181641 717402496 708214874 703992081 712239151 706364822 705515823 710722656 711004181 712190781
3695.5 712190781 712846069 712127686 712950363 713667908 716229935 719031372 714648056 713425140 717726669
3704.1G17726669N34592K55127K010498L337021L441162p071304M596328N171662j3260803
3712.8G16740952L973693L985291M63028O22406K449188J907883k856369J030273N094528
3721.5G33410873l136901m307328N378571J282959j025162k261200q03299L106003
3729.2G31644516J177597N688629k215729p311554Q175202k554779q378372J606063
3736.9G27831573J736451J203766K939529L529205l919754K986756J1267929j2568512
3744.7G35006943j4749069J0522003N536041O300812l57514j0385284Q648071o576767
3752.4G33945236o009903O008911M562302L346939n888443J803665N226288q619919
3760.1G34375076q95309M417496R81216M04892L580856l485946n630722L766250N951462
$$ plain form
3704.1 717726669 718261261 718516388 720526886 723863907 727305069 720233765 724830093 730001755 716740952
3712.8 716740952 720714645 724699936 725162964 725785370 728234558 730142441 727286072 728316345 733410873
3721.5 733410873 730273972 725966644 731345215 732628174 731603012 729341812 728538513 731644516
3729.2 731644516 732822113 738510742 736295013 728983459 737158661 734603882 726225510 727831573
3736.9 727831573 729568024 730771790 733711319 737240524 733320770 736307526 747575455 735006943
3744.7 735006943 720257874 730779877 736315918 742616730 742259216 731873932 740522003 733945236
3752.4 733945236 727935333 733944244 738506546 741853485 735965042 737768707 742994995 734375076
3760.1 734375076 733479767 737897263 738878479 739283371 742864227 739378281 733747559 737513809 743465271
3768.8G43465271R01337r399109K064667L538589o5460M90646k55432P35168k31399
3777.4G41244278K012100q1177p373123K260666K338028J563187K306289k539672j199875
3786.1G40530701O53305P62558L09753l78723L80478M2419O06003l31192J138687L727646
3795.8G47441635m417877n486069K199097M374771N619659o211547r783860L470459
3803.5G37206268K747422M360580M855423r248352l858490M516525J902161N38788
3811.2G43020325P11212J2054J157379N094681k632065j3274993N608139N609588M689865
3819.9G49996185J780472j8073349K316971N163193J628418K474365L10669m244080
3827.6G41352844M38004K398605K873383M21371r378967L177719P828827n704422n61295
$$ plain form
3768.8 743465271 744366608 734967499 737032166 740570755 740505295 740995941 740740509 741475677 741244278
3777.4 741244278 743256378 743175201 735802078 738062744 740400772 741963959 744270248 741730576 740530701
3786.1 740530701 741184006 741946564 742256317 741877594 742258072 742300491 742906494 742575302 743713989 747441635
3795.8 747441635 743023758 737537689 739736786 744111557 749731216 743519669 733735809 737206268
3803.5 737206268 739953690 744314270 749169693 739921341 736062851 740579376 742481537 743020325
3811.2 743020325 743731537 743743591 744900970 749995651 747363586 734088593 739696732 745306320 749996185
3819.9 749996185 751776657 733703308 736020279 741183472 742811890 745286255 745596924 741352844
3827.6 741352844 741790848 744189453 747062836 747484207 738105240 741282959 749111786 743407364 742846069
3836.3G42846069Q098374q678971m615402P593765n438079O1111O901093j941986l675461
3844.9G41150513J982269Q11920l87497J404343j96915K985382N832291j0769119m341355
3853.6G38471832r704361M717865J0617981j166839k670212J740188K539139K251282
3861.3G46796875n611191N88074O662140n774384n663299L906784N746383O066819
3869.1G52718201q118973r633789L569946O609955L468552j1085587N86853M741211
3876.8G42856369P70950J935959L869705o577224p044144O752319J460648J379928
3884.5G45404510M825593j2791291N96695L807450R04998M378205J38778r260025l9291
3893.2G37965622L339767n57785J571350J001893K081909K187652r347458M453888
$$ plain form
3836.3 742846069 750944443 742265472 737650070 745243835 739805756 739866867 746767960 744825974 741150513
3844.9 741150513 743132782 743944702 743557205 744961548 744764633 747750015 753582306 742813187 738471832
3853.6 738471832 728767471 733485336 744103317 742936478 740266266 742006454 744545593 746796875
3861.3 746796875 741185684 741773758 748435898 742661514 736998215 740904999 746651382 752718201
3869.1 752718201 744599228 734965439 738535385 745145340 748613892 737528305 738115158 742856369
3876.8 742856369 743627319 745563278 749432983 742855759 735811615 742563934 744024582 745404510
3884.5 745404510 750230103 737438812 738035507 741842957 742747955 747126160 747264938 738004913 737965622
3893.2 737965622 741305389 740747604 742318954 743320847 745402756 747590408 738242950 742696838
3900.9G42696838K215424n554657M451523k199860k149200M19311J742020K270584
3908.6G43891983n37033n0354j78833P6752l75748m78210J516647J808777l032303
3917.3G42641678k684403L751145j656342l760071L175507K112274R31320l057327
3925G41453781l206406J613160J778717J963348o93283k72522J172562l533326j163864
3933.7G39112167J502762K8687K94571J372909N48935j173477n22995J756592J021728
3942.3G43941879l968124p28302J694565R40094J304168k210846K3957J22604k796478
3951G38323517J746597N17655p11747J219254Q1711r48716l67507O25991r7656Q54340
3960.7G41243439K88543j510620o2942q4458p6065j5564K25525Q50754m42123j031266
$$ plain form
3900.9 742696838 744912262 739357605 743809128 741609268 739460068 739879379 741621399 743891983
3908.6 743891983 743354950 743304596 743125763 743202515 742826767 742348557 743865204 745673981 742641678
3917.3 742641678 739957275 743708420 742052078 738292007 741467514 743579788 744511108 741453781
3925 741453781 738247375 739860535 741639252 743602600 742909317 742636795 743809357 740276031 739112167
3933.7 739112167 740614929 740643616 740938187 742311096 742860031 741686554 741163559 742920151 743941879
3942.3 743941879 739973755 739245453 740940018 741880112 743184280 740973434 740997391 741119995 738323517
3951 738323517 740070114 740587769 739876022 741095276 741176987 740228271 739860764 740486755 740389099 741243439
3960.7 741243439 741531982 740021362 739958420 739873962 739797897 739782333 740007858 740858612 740416489 739385223
3970.3G39385223N22614Q15124m64248k3346N02701J59607m66767l73840L18527p7896
3980G40297699j84555l40958M959O84510M01611j31836l26309K16522L30048N90362
3989.6G41542053l44009j683045l51028J024628P54852n35584k78549N25055l51639
3998.3G40302734p33871J53580
4000.2G39722443
$$ plain form
3970.3 739385223 739907837 740722961 740258713 740235367 740738068 740897675 740430908 740057068 740375595 740297699
3980 740297699 740113144 739772186 739777145 740461655 740863266 740731430 740405121 740621643 740951691 741542053
3989.6 741542053 741198044 739514999 739163971 740188599 740943451 740407867 740129318 740654373 740302734
3998.3 740302734 739568863 739722443
4000.2 739722443
##END=$$ End of the data block
