##TITLE=$$ Begin of the data block
##JCAMP-DX=5.00 $$ ACD/SpecManager v 10.08
##SPECTROMETER/DATA SYSTEM=Varian
##DATE=18 Dec 2012 14:35:42
##DATA TYPE=INFRARED SPECTRUM
##DATA CLASS=XYDATA
##ORIGIN=
##OWNER=
##NPOINTS=3735
##FIRSTX=399.26403809
##LASTX=4000.35498047
##MAXX=4000.35498047
##MINX=399.26403809
##MAXY=80.53163910
##MINY=21.10034370
##XFACTOR=1.0000000000
##YFACTOR=0.000000100000000
##FIRSTY=60.11982346
##DELTAX=0.96440572
##XUNITS=1/CM
##YUNITS=TRANSMITTANCE
##XYDATA=(X++(Y..Y))
399.3 601198235 595038986 605844574 603291550 592441559 596972771 602351265 604534111 601595573
407 601595573 595748291 597982712 603409805 599928131 596002235 600374374 599386787 592040405 590851707
415.7 590851707 595623398 584696121 554245605 565189934 579315224 588472633 594521370 600138474
423.4 600138474 600259209 588427124 581920433 586220207 588766479 587520180 589899826 590222969 586364899
432.1 586364899 588307343 589355240 584983940 585166969 591096725 588627625 584280128 585172691 587025871
440.7 587025871 586932449 585680122 592656746 594783401 588364334 587261391 587957382 586914711 584643211
449.4 584643211 583957863 589304886 590509377 584321289 582143364 582417412 582637405 582975502 583728867
458.1 583728867 579056664 577324333 584294968 583243828 578210258 579395294 579466400 577578430 573490410
466.8 573490410 570196190 569590073 577072411 583191566 580626526 576775742 572057915 573555260 575682259
475.5 575682259 574566345 574257202 574690437 575482254 574478722 576968994 580768700 582903061 582889061
484.1 582889061 582023926 583493805 583683815 586629906 584818802 578827400 579754486 580031052 579391632
492.8 579391632 580251350 580900040 583208275 586098709 588735657 590695953 589008980 585784721 584923439
501.5 584923439 582473717 581382904 581059723 579305840 578402672 577269592 577340508 578370132 579805412
510.2 579805412 578432312 574083786 571984520 571317558 568307762 564355583 562788277 562267647 562369270
518.9 562369270 562304268 563666840 566478691 567564240 567534904 566200027 564679375 564006577 562917137
527.5 562917137 561140785 559826355 559624557 558274841 557812767 559531975 561501579 561797333 561199112
536.2 561199112 560679665 560410194 561177559 561003456 560712776 560799484 560209999 560759621 561327820 561584129
545.9 561584129 563888321 565563202 565586472 566347008 567740097 569400291 568352547 566585274 566499214
554.5 566499214 564890366 564162445 564766083 566348152 566978760 565999069 566902657 568228760 569109154
563.2 569109154 567873116 566614876 567564926 568380890 568238182 566977997 566713295 566003990 565488396
571.9 565488396 565850983 565582008 565216980 564409256 565239792 564975166 563832512 563216667 561599312
580.6 561599312 560470085 561057549 562772560 562584267 563091431 563455200 563655281 565976677 565924835
589.3 565924835 565419960 565940933 567342644 567741890 566890831 567080956 566062050 564853745 563351402
597.9 563351402 561178703 558725510 556817589 555929909 553909111 551814308 548952370 544758797 538145790
606.6 538145790 530696449 523260002 512746696 500941505 488092422 476967964 466780319 459109573
614.3 459109573 455709190 455211754 457454109 458665771 458141632 452832451 444871674 434968719 424900017
623 424900017 419453697 418367653 425740776 437656746 451992950 466147079 479541588 490335655
630.7 490335655 497201996 500942154 497532387 491148949 484298477 479477425 475612221 470930214
638.4 470930214 469620895 473033371 482109795 492386360 506893997 523897781 538767471 551348228
646.2 551348228 561329651 570043983 575849838 579260139 582836990 585463371 586703300 587852478
653.9 587852478 589939384 592989159 595644073 596906433 597543221 598021049 598621979 599010086 598885880
662.5 598885880 599749870 600629425 602028999 604746170 603929176 596965714 602998848 606369095 607151566
671.2 607151566 608078995 608863754 608797989 609196053 609165115 608833199 609737549 611047592 611909790 612721519
680.9 612721519 614127922 615195427 615600739 615134125 613237076 611303673 610019073 609133186 608039169
689.6 608039169 606439743 604487724 602982674 601798286 600311699 599476471 599136543 598422279 597641144
698.2 597641144 596944618 594818993 592563667 592450104 593127899 593636169 593460236 593812180 595979652
706.9 595979652 598511429 600595779 602388153 603907661 605142021 606856575 608319397 608856888 610281944
715.6 610281944 612224503 613703499 615227013 618326035 621586647 622428055 623574333 625180855 626078072
724.3 626078072 625736656 624209175 622563629 620749893 620338783 620884895 621081123 620400963 619056206
733 619056206 618356400 617740669 617751961 618459396 618548088 617995262 617061272 616513405 616097069 615341797
742.6 615341797 615990868 618454819 620877876 622541771 624571762 627894630 631310730 634102745 636614761
751.3 636614761 638299065 640668411 643857346 646486511 649155502 652185135 654439850 655682983
759 655682983 658499603 660986023 661995544 663067322 663392410 663532639 662869186 662060242 660718079
767.7 660718079 658659897 657464142 657024307 657616348 658068008 658775787 660857162 663612671 665874100
776.4 665874100 667195969 669379501 671755524 672915955 674204865 676274643 678022919 679838486
784.1 679838486 681387177 682580185 683998489 685037003 686541367 687093277 687621613 688651810 688512650
792.7 688512650 687870560 687022095 687292633 687200241 686862335 687009125 687099686 687528381 687618484 687780304
802.4 687780304 688217392 689178925 687947922 686204758 686276855 685776825 685666046 685614700 686753235 688539886
812 688539886 689328461 689575119 689403076 689549637 689877472 690699997 690702438 691402206 691047745 688832703
821.7 688832703 688512955 688230896 688075714 686882324 685157471 684290314 683022385 681400146 678146744
830.4 678146744 673711929 669591904 666810379 662889938 658350449 654774780 651000977 647215118
838.1 647215118 642612305 639274101 636797752 633680725 631257935 629848785 628603477 626340981
845.8 626340981 624778862 623956261 623978920 625202599 626756821 629783363 632791138 635546036 638557358
854.5 638557358 641913910 645989685 649509659 652593842 655454636 658105164 659590302 662258072
862.2 662258072 665493622 666956406 668756332 670210495 671617966 673046570 674743195 675520248 675071259
870.9 675071259 676028519 677283630 678360519 678780670 678969574 679546432 679710464 678584366 676826324
879.5 676826324 675692902 673494949 671000900 669642258 668431168 665452957 661792068 659514465
887.3 659514465 657615128 656044235 654911499 654580765 654281464 653768768 654770279 655866470 656310959
895.9 656310959 657061386 657444458 656916122 656862717 656626358 656008148 656314011 655454636 653824921 652367935
905.6 652367935 650863037 649253922 646638641 644191360 641586380 638140755 634805145 631269951
913.3 631269951 627568512 623996201 620508728 617768517 615732498 612962685 609822235 607755394
921 607755394 605253029 602562294 600157280 597680092 595837708 593341370 591443863 590183754 589144363
929.7 589144363 589501152 590074768 590784187 591606293 593137474 595313606 598132401 601458473 604426460
938.4 604426460 608099747 611629295 614742355 618934441 623601151 627338104 629706535 632812691
946.1 632812691 637048492 640358429 643243027 645325394 646565475 647275772 647478485 647671890 646958084
954.8 646958084 646112595 645145416 643753586 642240067 640491333 638633919 635862160 632245941 628473091
963.4 628473091 625317268 622629814 619288597 615781822 612924728 611092873 609897194 608514252
971.2 608514252 607817001 606904602 605515594 604677582 603942757 603635292 602697639 601063576 599257927
979.8 599257927 597385368 596377983 594628983 591967392 589643440 587295227 584895325 582460899
987.6 582460899 579563980 576744385 573192558 567634964 561415596 552793159 540134277 524430122
995.3 524430122 512330704 513793221 525443192 537594986 544428558 547033882 547909813 548206024
1003 548206024 548429985 547702522 546656036 545992851 545447502 544081688 542803192 541018639 538428917
1011.7 538428917 537173004 536046982 534938240 533249664 530802803 528055763 525128098 522540359
1019.4 522540359 519711227 517358856 514528503 511766930 509244461 507603989 505890656 502811890
1027.1 502811890 501111679 498576088 495962868 493789062 492130203 490683250 487701111 485171394
1034.8 485171394 482678032 481707039 480272293 479478531 479488373 478327599 478551292 477634392 477114258
1043.5 477114258 476376801 475842247 476074791 476031876 476905937 476996803 477670746 477669945 478989182 480204620
1053.1 480204620 479973297 480931244 480880165 481130333 480674820 480326118 480076294 479880562 479193382 477449951
1062.8 477449951 477071838 475758896 475675430 475222206 474243889 473562775 472665710 472918968 471506844
1071.5 471506844 470912285 469329872 467814789 466476440 464512177 464252052 462427635 462220383 461993065
1080.1 461993065 461269493 460501480 459057198 458118591 455744400 453958435 450949097 447432442 443247452
1088.8 443247452 438341904 433773499 428160477 421669312 413071518 405543137 396318436 385942039
1096.5 385942039 374886513 363799591 355082016 344555931 335752182 326109924 317638912 309007759
1104.2 309007759 300402126 293830051 285254364 279456959 271887226 265973816 260733910 256170731
1112 256170731 252798462 248129368 247584076 245792942 246572533 246831074 247247086 248753834 249607868
1120.6 249607868 252856598 253577862 256286716 257214050 258213844 259206219 259548683 260661564 258281898
1129.3 258281898 258290234 256149769 254011669 250867996 246635456 243367348 238989544 238340034 235602970
1138 235602970 234250927 232329044 230684662 229361916 226331329 225919857 222343216 220702858 217833366
1146.7 217833366 215934105 214912815 212454891 212729721 211003437 211776218 211324711 212451763 213352051
1155.4 213352051 213862629 217043209 217831593 220369320 220915852 223507500 225855236 228723335 233028316
1164 233028316 235679169 241083965 244258633 249587269 253822041 258691807 264649487 269160213 276226578
1172.7 276226578 281450005 288666706 294711475 301638699 308752403 314049759 320567513 325786476
1180.4 325786476 332799339 338516273 345001335 350862770 355957680 361797562 366238937 371998138
1188.1 371998138 376237717 381299934 385690193 390226402 395082245 398865318 404060173 408228035
1195.9 408228035 414017448 419161186 424465179 429868202 434734344 440907021 445801468 451335526
1203.6 451335526 456208878 461330032 465799751 470050697 474997139 478668556 482891388 486234398
1211.3 486234398 490211678 493362885 496141510 499491119 501247635 503436852 504960518 506614113
1219 506614113 508097992 509448509 510710182 511435852 512561302 512858315 513737183 514503250 515207329
1227.7 515207329 515330124 515505829 516313286 516145973 517253113 518331528 519425888 520195961 520786209
1236.4 520786209 521805725 522490311 523646622 523665009 524441299 525237198 525864944 526703224 526704712 527558708
1246 527558708 527993202 529107437 529775887 529886475 530515327 530733643 531077843 531073723 531414719 531105881
1255.7 531105881 531339607 532158585 533227539 534459724 534703217 535950775 536653023 537272377 537675362
1264.3 537675362 538209534 539191322 539531746 540814247 541276283 542316513 543653870 544924850 547230606
1273 547230606 549309959 551569176 553147087 554996490 556531372 557813683 559346046 560855827 563000946
1281.7 563000946 564827309 567008896 568948479 570911713 573448372 576069069 578681145 580966225
1289.4 580966225 582827110 584183235 586374779 588575783 590160294 591656380 593173180 595064163
1297.1 595064163 597025795 599017487 600793190 602844048 604567528 605687218 606750259 607703781
1304.8 607703781 608605957 609315567 610377808 611278954 612077217 613123398 614058838 615064278 615966301
1313.5 615966301 616658745 617032394 618246536 619737206 620183296 620424500 620797729 621539497 622303467
1322.2 622303467 623439217 624860039 625972404 627150307 628075752 628853416 629484024 629763985 629843712
1330.9 629843712 629588318 629507866 629680901 629918747 630068283 630178947 630738411 631132317 631025124 630945129
1340.5 630945129 631456757 632129364 632174721 631871605 631457787 630941467 630551338 630287971 629894829 629855309
1350.2 629855309 630515900 630574265 630256042 630072060 629357796 628425369 628060875 627964478 627403374 627048950
1359.8 627048950 626415176 625827789 625670853 624959984 625385818 625383110 624546051 623846474 622098618 620495377
1369.4 620495377 619812279 618905830 618516579 618036919 616453667 615514946 615419159 615690765 615611229 614976730
1379.1 614976730 614641800 614207458 613790779 613376808 612763138 612825928 613724747 614161263 613893242 614994774
1388.7 614994774 616469040 616913185 616871185 617130508 617537766 616412048 614181442 614678268 615219078
1397.4 615219078 614821701 612812424 611922531 612465515 612022972 611721306 611686897 610263062 609393578
1406.1 609393578 609310760 609034805 608323135 607412491 606664848 605998955 605831795 606250725 606457291 606487122
1415.7 606487122 606629028 606854858 607830925 604344368 603924141 606152802 606633835 606663551 605540466
1424.4 605540466 606312218 608039246 608666191 610041084 610828590 610921478 611591644 612751694 613505974
1433.1 613505974 613872337 615600548 616735840 614312630 615010910 617731171 619453049 620540047 621642799
1441.8 621642799 622248039 623274956 623820877 624814796 625847626 625545578 624957466 626208649 627914238
1450.5 627914238 628429565 628910103 629771690 631682014 633431702 633445587 631745911 630423317 634211044
1459.1 634211044 636132431 638356667 639644318 640452881 642905121 641891785 642129211 644222717 646254883
1467.8 646254883 647886505 649228592 651806641 652414017 652062988 653252106 656608429 660118256 660460434
1476.5 660460434 662656631 665734940 668104782 669939880 670790863 672121353 673634186 674641037
1484.2 674641037 675080719 675798035 675743713 674559402 675280762 672975998 671879578 674356995 675827942
1492.9 675827942 675933609 676175308 676416626 670808334 671844559 671500473 668128510 668469391 667729187
1501.6 667729187 666960831 666294632 667271347 667764511 658207092 649869461 652325974 655494995 653988876
1510.2 653988876 654117661 652115631 649256058 649476700 647962875 646903076 644573975 641406097 643137131
1518.9 643137131 645463715 641744919 636900368 638601303 639907455 641700974 637640152 636182556
1526.6 636182556 635929146 633997383 634358711 634771042 634748116 633911133 632316055 627814674 628937569
1535.3 628937569 629526825 629322472 630801849 626397133 621069756 622099342 622703133 622163887 624204521
1544 624204521 625379105 623189735 625479088 626568413 627488060 627398605 625565300 626771965 627362289
1552.7 627362289 628469048 626803513 628247108 632502556 635692024 628305283 614121895 628767395
1560.4 628767395 634825783 638310204 639897308 640351257 639226151 639408531 641129913 641957703 642796631
1569.1 642796631 639187469 641177444 643397522 643253021 643608322 644055557 644094849 635966148 636954651
1577.7 636954651 637988625 637070618 636165123 634374771 633687935 632174454 631539497 630483932 628876305
1586.4 628876305 627291756 624809685 623284912 620080490 617779427 614742737 612260323 610006981
1594.1 610006981 606831207 605402374 603209076 602305641 600162582 598369217 595941162 593107491
1601.9 593107491 591074257 587380486 585596771 582903786 580862732 577857132 575818214 573531685
1609.6 573531685 570351791 570062675 567508545 566265984 563721390 562878914 562238197 552019920 553177834
1618.2 553177834 552134018 551567917 549479485 549167519 547796440 542497139 543012543 542121658 542639275
1626.9 542639275 538594627 536421280 536273193 534855118 533870354 531664772 532283134 531647797 526634903
1635.6 526634903 524709282 526462402 526877708 526904030 527817650 526520500 527481880 526379166 526878128
1644.3 526878128 527890511 524693718 525889091 523347321 525630913 526644974 529427147 533048859
1652 533048859 534111176 526018372 526262321 531316032 532971649 534797096 535651093 536983299 538620567
1660.7 538620567 540023384 541874275 541051178 544667473 546809807 548957481 551349030 553382378
1668.4 553382378 554606552 554119720 557795639 558432465 561341324 564804649 566009827 566256943 568869629
1677.1 568869629 572999420 575572433 578727760 579859276 583765678 589288750 588519821 585174179
1684.8 585174179 588151550 594574089 597937088 599895172 602982674 605905113 610388222 614024811
1692.5 614024811 618039818 622285194 625983658 623389053 628347778 635097198 640994873 644445419
1700.2 644445419 639380722 647166367 652704315 656768188 660339508 663590012 666300507 669850922
1707.9 669850922 674508972 676826248 678425140 680969467 683545303 686543732 687635117 688947983
1715.6 688947983 692389069 693995514 689921341 694974518 699570084 701674881 703189392 703788376
1723.4 703788376 704193039 705392761 706372375 707337189 708415375 710151520 710049591 710492172 714294510
1732 714294510 717130661 712844849 708128815 713934097 718089600 719620209 721985321 721258163 718651962
1740.7 718651962 722190781 724944382 725371475 727117996 730892029 733540497 735171051 736793518
1748.4 736793518 737300568 741248322 741742096 741113510 745421066 747806473 749982681 752540970 752180405
1757.1 752180405 753876495 756964722 759710617 762826538 760811462 759699097 762455292 763516312
1764.8 763516312 764192734 765267563 765598907 763021545 765714035 770199432 770876083 768737717 766829376
1773.5 766829376 770848389 772733841 770927353 772240219 772647171 773385010 773016586 771527328 773226013
1782.2 773226013 775619507 777178268 776582336 777263489 779289551 780141678 780385971 781342163 781156006
1790.9 781156006 780647049 777832870 776810303 780495834 781889114 781664886 783175735 784743195 784553299
1799.5 784553299 783775635 785662155 784891891 784577026 785662384 785376740 785654526 785953979 786087494
1808.2 786087494 787065353 788291779 787219925 787727127 789405518 790006866 790579147 790060883 790247345
1816.9 790247345 789694977 789101868 789432755 789503937 790489807 790715485 792050629 793516693 791403503
1825.6 791403503 791779938 794235077 795964432 795236511 790637817 790897141 792951050 793015594 793403702
1834.3 793403702 794362106 795236740 795498962 795327225 796612167 796782227 797085571 797025604 797720184 797921295
1843.9 797921295 791799622 793744202 796195755 796254349 795898285 796771698 798470993 798830338 799165573
1852.6 799165573 798869858 798954086 799060593 798860092 798722000 798219681 798669891 798418655 798884811 799385757
1862.2 799385757 799806519 800695038 800885391 801404953 800859146 800900574 799320984 797211533 798466187
1870.9 798466187 799502869 800037689 800299072 801163864 801402740 801620026 802148056 802155151 802363205 802377167
1880.6 802377167 802621918 802268753 802092285 801634903 801073761 801395950 801702805 803195038 803222046 801372070
1890.2 801372070 802226715 803528595 803730011 803754044 802961578 801783524 802241211 802215042 802383575 802713547
1899.8 802713547 802913742 803429642 803369980 803970184 803988953 804036407 804489517 804116364 803673935 803280792
1909.5 803280792 802821350 802469177 802840500 802646713 802617950 802820892 803628159 805316391 803442383
1918.2 803442383 802501221 803560944 803928375 804217758 802588654 801635056 802486877 802969666 802882767
1926.8 802882767 803104172 803345947 803607712 803675156 803597870 804081726 803726730 803341446 803142319 803096466
1936.5 803096466 803155289 802914429 802863159 802534561 803934479 804483871 802086868 802628555 803846054
1945.2 803846054 803558960 802973328 803073883 803040695 802692642 802328186 802234726 802370605 802396774 802695694
1954.8 802695694 802800140 803220367 803214264 802700424 802749405 802943649 803038635 802398911 802059631 802254410
1964.5 802254410 802487793 802430878 801776962 801807938 802400208 802952347 802839813 802718506 802634506 802133484
1974.1 802133484 801632233 801357346 801389542 801038513 800952377 800960922 801090317 801488266 801518631 801548080 801269531
1984.7 801269531 801282806 801047287 800549698 800138702 799556503 799901886 799901352 798939362 798980865 799976349
1994.3 799976349 800348740 800220642 800440826 800445328 800314560 799921722 799605713 799097290 798829575 798982849
2004 798982849 798695374 798669510 798664017 798930893 799375534 799494705 799442368 799108276 798656998 798062439 797905045
2014.6 797905045 797953110 797537231 796863174 796922226 797206421 797261276 797829437 797924805 797554779 797236023
2024.2 797236023 797037048 796714249 796237869 796194611 796126862 796017227 795624008 795464020 795615082 795803833
2033.9 795803833 795938568 795590515 795716934 795819473 795489960 794958344 794535141 793983688 793546066 793809204
2043.5 793809204 793456421 793695068 794297256 794354553 794576721 794437943 794421692 794397125 794132233 793426208
2053.2 793426208 792864304 792573929 792227554 792186737 792100830 792432632 792380600 792220688 792311096 792322006
2062.8 792322006 792386551 791585464 790968246 790651932 790234375 789754562 789284439 788967896 788789444 789264984
2072.5 789264984 789182434 788975372 788969116 788534012 788056183 787352371 786744080 786128387 785348587 784677734
2082.1 784677734 784672623 784805756 785046158 785385208 785236130 785602341 785760727 785710220 785650940 785293045
2091.7 785293045 785001755 784696045 784824295 784386902 784076157 784762802 785498047 785883408 786094742 786473694
2101.4 786473694 786631088 786922531 786780624 786395645 786290359 786188507 786313858 786330795 786748734 787234879
2111 787234879 787845230 788228607 788174133 788440094 788466721 788546295 788307037 787918549 787353134 786739883
2120.7 786739883 786665955 786700974 787113647 787056274 787010498 787154999 787070084 787481079 787765808 787617798
2130.3 787617798 787141571 786551743 786051102 786065674 786141281 786109772 786255264 786367722 786850815 787144547
2140 787144547 787381210 787363052 787427444 787800674 787852554 788217468 788038864 787531662 787159195 787369003
2149.6 787369003 788078995 788143616 788289185 788676758 789280167 789585648 789600449 789334488 788987885 789032898
2159.3 789032898 788767776 788790359 788728027 788819962 789029007 789357910 790075912 789877014 789803009 789939270
2168.9 789939270 789890671 789503403 788979721 788880234 788647385 788537216 788227386 788346024 788594055 788431091
2178.5 788431091 788400497 788659592 789355164 789388885 788908844 788269958 788205338 788545151 788415527 788308334
2188.2 788308334 788204651 788791351 789504547 790047989 790667267 791376877 791982498 791843185 791812210 791613541
2197.8 791613541 791512070 791672516 791789474 791823196 791554642 791642532 792006760 792672806 792938538 793144836
2207.5 793144836 793448105 793528976 793845520 793618698 793373108 793089066 792943649 793020782 793201218 793347092
2217.1 793347092 793178101 793867569 794196243 794057388 793815765 793617020 793874664 793859406 794116135 793624268
2226.8 793624268 792835159 792642365 793007431 793650360 793548965 793511200 793609390 793968811 794066849 793830109
2236.4 793830109 793852158 793697968 793396530 792873611 792630463 792475586 792721558 793078613 793191681 793410492
2246 793410492 793373566 793469620 793333282 793272400 793100967 792969360 793073730 793017426 793134918 792851562 793043823
2256.7 793043823 793195343 793104553 793321686 793558578 793824615 793489151 793487473 793353577 793383179 793586578
2266.3 793586578 793470230 793732147 793398590 793300858 793571243 793772888 793630066 793675613 794077072 793798141
2275.9 793798141 793881912 793863449 793663101 793228912 793116837 793494720 793442688 793531189 793349457 793579102
2285.6 793579102 793423843 793306274 793648148 793525162 793870697 793762283 793831406 793680725 793490677 793492889
2295.2 793492889 793029785 793208923 793201752 793686905 793816757 793530045 793629608 793804474 794071960 793336716
2304.9 793336716 792960968 792686844 793002319 793045197 792258682 792282181 791621780 791760406 791976624 792383118
2314.5 792383118 792754059 792172928 792725525 792629776 792140045 791741028 791500397 790981750 789957733 789517822
2324.2 789517822 789170380 789817429 790376892 791045227 790933228 790744705 790969162 790644226 791182251 790326996
2333.8 790326996 790111923 790360718 789801712 790165787 791077957 791683426 791197510 791957092 792033234 791048965
2343.4 791048965 790805511 791386185 792427444 792395325 792840424 793941727 794550476 793697739 793054657
2352.1 793054657 793222733 793763962 794393539 792229996 791066818 791287766 790834351 790466614 790997086
2360.8 790997086 792196350 792495575 792756500 791317978 791466522 792359314 792322693 792818222 792623825
2369.5 792623825 793210907 793655701 794633102 795506668 795324326 794771881 794614258 795995483 796798172
2378.2 796798172 797140579 797371826 797283020 797611542 797979736 798225021 798315125 798392792 798130646 798004456
2387.8 798004456 798246307 798285980 798079605 797972488 798181000 798045731 798248596 798746414 798906097 798706589
2397.4 798706589 798210373 798224411 798298340 798030853 797728806 797695770 797404251 797149887 797335358 797185516
2407.1 797185516 797286224 797362518 797511139 797835999 798059006 798161087 797504654 796908569 796493073 796281815
2416.7 796281815 796252365 796107483 796149216 796204300 796376266 796926193 797598572 797363815 797051849 796835022
2426.4 796835022 796087341 795688705 795426865 795171738 794743347 794764252 794919052 794704361 795084763 795484924
2436 795484924 795831604 795835342 795538788 795322189 794934387 794516373 793962097 793517227 793245010 793195648
2445.7 793195648 793124619 793375931 794044724 794516754 794792099 794723663 794539185 794023285 793404083 792751617
2455.3 792751617 792238998 792000504 791560059 791569901 791891327 792339859 792396240 792551270 793124542 792984161
2465 792984161 792689056 792123947 791431427 790624237 790232925 790409927 789963684 789564972 789463043 790264587
2474.6 790264587 791233902 791364441 791355438 791082993 790761337 790198746 789494476 788878326 788558807 788270569
2484.2 788270569 787921219 788307495 788719254 788680191 788552246 788722458 788776398 788701630 788594742 788061676
2493.9 788061676 787537231 786836319 786483994 786423416 786490021 786803513 786896210 787281036 787420578 787222824
2503.5 787222824 786894073 786337433 785755005 785303955 785278702 784980087 784453354 784210434 784335022 784555740
2513.2 784555740 784841232 785361176 785555725 785466232 785419235 785287170 784724045 784086685 783421402 783011856
2522.8 783011856 783191223 783291702 783402786 783669586 784185486 784041367 783683472 783750839 783491898 783592682
2532.5 783592682 783319778 782899170 782382507 781575775 781499100 781550140 782023392 782503662 782489624 782371216
2542.1 782371216 782703705 782918777 782337189 782313385 782021103 781282730 780718002 780564346 780902252 780602112
2551.7 780602112 780404434 780671616 780906982 780937958 781144791 781268463 780749512 780160522 779503479 779248047
2561.4 779248047 778969269 778586197 778552704 778671799 778888245 778783493 778996811 779186554 779220200 779305115
2571 779305115 778946915 778474884 777996826 777884979 777831573 777584610 777247314 777038116 777220078 777381821
2580.7 777381821 777552490 777409821 776988602 776872711 777157745 776964645 776067200 775580215 775693588 775674744
2590.3 775674744 775057678 774706802 774672775 774752884 775046844 774916992 774774704 774637604 774144669 773490753
2600 773490753 773195572 773010178 772752991 772655029 772281723 772170486 772069702 771928940 772155609 772364426
2609.6 772364426 772202759 771499329 771240540 771070938 770509338 770175400 770307617 770320969 769650803 769416656
2619.3 769416656 769666672 769583130 769205246 769249191 769137497 768275757 767926865 767836380 767776108 767775345 767318115
2629.9 767318115 766610336 766592178 766927338 766399841 766159592 766110229 765784912 765703201 765594711 765388718
2639.5 765388718 764889603 764533081 764176483 763789978 763598557 763611984 763976135 763992691 763584442 763111801
2649.1 763111801 762734528 762360840 762248917 761964340 761323929 761233673 761150818 760788803 760491409 760679016
2658.8 760679016 760651550 760168533 759905853 759311676 759117355 759120407 758877029 758810654 758577194 758065338
2668.4 758065338 757344818 757150192 757246475 757253647 757188797 756950684 756556778 756284409 756560135 756297302
2678.1 756297302 755672379 755554962 755558701 755281067 754868927 754590149 754325485 754251785 753979721 753839569
2687.7 753839569 753785400 753498306 753323517 753033066 752803574 752340927 752438583 752710037 752301407 751872711
2697.4 751872711 751102066 750878601 750909271 750776596 750772552 750473404 750505219 750488205 750041428 749561691
2707 749561691 749138336 748563309 748457565 748748474 748557587 748417358 748045883 747595749 747262955 746827850
2716.6 746827850 746672592 746564560 746353683 745873642 745633087 745426712 744895782 744792557 744896698 744907837
2726.3 744907837 744710846 744218826 743745193 743391724 742948608 742563782 742467422 742487030 742300339 742026520
2735.9 742026520 741917267 741589508 741263046 740813065 740211334 740060959 740182877 740313034 740210266 740263443
2745.6 740263443 740098495 739317932 738740082 738686752 738650894 738053665 737711487 737632523 737647934 737718124
2755.2 737718124 737194901 736743317 736336823 736138458 736138611 735626450 735247803 735070190 734170761 733203354
2764.9 733203354 733265533 733404617 733217392 732780075 732107773 731756134 731759567 731958618 731781769 731542816
2774.5 731542816 731157990 730322495 729741287 729585495 729382782 728546448 727899399 727763062 727705002 727456894
2784.2 727456894 727134476 726876678 726136322 726036682 726112289 725422516 724960861 724561615 723874207 723118591
2793.8 723118591 722795029 722477188 721936722 721521378 721258163 720879059 720267792 720117035 719639359 718970337
2803.4 718970337 718445740 717436218 716844864 716619263 716282806 715685043 715016632 714534225 714257278
2812.1 714257278 714182205 713659286 712990723 712440643 711859818 711287155 710685959 709959946 709089813 708609772
2821.8 708609772 708204193 707542877 707024460 706636810 705887985 704962387 704327927 703454742 702695847 702403564
2831.4 702403564 701961746 701245499 700174561 699133453 698406372 697523193 696785431 696106491 694859848
2840.1 694859848 693500366 692064362 690430222 688613739 686788559 684990997 683003311 681378708
2847.8 681378708 679147110 676714706 675425262 674345398 673871078 673953094 673660355 673136673 672714920
2856.5 672714920 672250290 671869049 671919861 671448975 670773621 670451126 670172653 669778900 668690643 667391129
2866.1 667391129 666396027 665873184 665703506 664955673 663525925 662515411 661798019 660795746 660277634
2874.8 660277634 659709549 658840485 658276901 658006439 657995987 657881470 657627792 657174835 656848831 656180420
2884.4 656180420 654900513 653777008 652848816 652546616 652030334 651183853 650650024 649660339 648504944
2893.1 648504944 647902603 647846603 647004700 645621796 644639816 643584671 643041916 642951508 642922668 642269745
2902.8 642269745 641124268 640552673 640139008 639962654 639487686 638818130 638615341 637808762 636753426
2911.4 636753426 636183891 635582390 634444160 633131294 632180557 631129761 629899292 629046974 628661308
2920.1 628661308 628258286 627839546 627370529 626838417 626758385 626592178 626364594 626552010 626809578 626959877
2929.8 626959877 626603737 626164093 626316109 626617355 626849747 627406502 628173904 628620644 628715935 628925018
2939.4 628925018 629670715 629971733 629697151 630232468 630963631 631092186 630954666 631242180 631729164 631555939
2949.1 631555939 631230125 630805473 630320892 629621735 628659363 628261414 628252449 628385735 628253326 627857437
2958.7 627857437 627430573 627381859 628247833 628786697 628703194 629007339 629559479 629858208 630228767 630654869
2968.3 630654869 631164818 632258453 633457680 634590836 635583954 636701393 637740097 638208351 638975143
2977 638975143 639654427 640249100 641167221 642024155 642795181 643311615 643951263 645150528 646399918 646808472
2986.7 646808472 647230606 648133316 649011765 649897842 650111237 650150528 650421600 650890274 651111374 650978012
2996.3 650978012 651562347 651900482 651857910 652048264 652349243 652903366 653195114 653038712 652855453 653092728
3006 653092728 653113022 653005447 653248215 652899017 652316666 652262802 651922836 651495667 651662903 651406326
3015.6 651406326 651032028 650993729 650673904 650410538 649978867 649335785 648858490 648817902 648806229 648131409
3025.2 648131409 647265472 646942825 647038116 646810760 646446991 645782013 645070114 644984512 644851532 644281082
3034.9 644281082 643189087 642527847 642442169 642367935 642172546 641614227 641242065 640956345 640676880 639996109
3044.5 639996109 638814888 637947845 637255440 636729736 636458511 635965118 634901772 634071655 634066544 634330330
3054.2 634330330 633729591 632612228 632527122 632361984 631478310 630458336 629652138 629351692 629355278 629080391
3063.8 629080391 628084259 627625618 627359886 627069092 626832466 626015320 625916328 625830078 625350609 625003014
3073.5 625003014 624410820 623931808 623442078 622946510 622381210 621961784 621901283 621908340 621311531 620349884
3083.1 620349884 619846382 619314537 618822479 618488312 618356018 617997437 617408333 616728096 615966377 616018372
3092.7 616018372 615665474 615224457 614917068 613801994 613218498 613035240 612590103 611479683 610625076
3101.4 610625076 610274162 609705429 609380112 608744774 608437653 608547134 607897110 607030563 606767616 606432266
3111.1 606432266 605817413 605159378 604262161 603980293 603207588 602167778 601915283 601230392 600587540
3119.8 600587540 600039520 599645882 598973923 597609138 596541214 595943222 595428925 594278069 593489990
3128.4 593489990 593120804 592447853 591882668 591408424 590842323 590062408 589749031 589493294 588859711 587807693
3138.1 587807693 586824493 586441383 585313072 583957176 583156052 582794228 582402840 581476631 581012535
3146.8 581012535 580887871 580019951 578215981 577025070 576900787 576621017 575891190 575058670 574416695
3155.4 574416695 573490486 572673645 571917305 571002235 570488358 570218620 569852829 568633690 567329140
3164.1 567329140 566465874 565769844 565191383 564260178 563873634 563572388 562530365 561390038 560645981
3172.8 560645981 560379257 559706268 558766861 558132019 557408333 556460457 555586433 555081062 554747734 554045563
3182.4 554045563 553209953 552486191 551387215 550518684 550001793 549018555 548202133 547784882 547026482
3191.1 547026482 546146011 545366173 544757957 544551926 544121590 543616714 543166542 542171097 541178627 540357895
3200.8 540357895 539371529 538549080 538195839 537543755 536910057 536659164 535776863 535082779 534681969 533956108
3210.4 533956108 533032455 532166138 532035561 531679420 530880013 530421448 530102005 529909363 529433098 528229637
3220 528229637 527297707 526872864 525966797 525330772 525139809 524599571 523584785 522425346 521865463 521522255
3229.7 521522255 521221313 520830650 520437622 519993668 519297867 518775291 517710571 516691055 516260414
3238.4 516260414 515819550 515456848 515340691 515083160 514259644 513692589 513009300 512730026 512491608 511000137
3248 511000137 510153847 509690170 509106941 508779564 508561630 508561440 507921791 507292786 506633644 505699005
3257.7 505699005 505368767 505192337 504641762 504209404 503788567 502797813 502229843 502000809 501709404 501569710
3267.3 501569710 501053658 500664711 500263824 499521370 499053574 498787384 498196182 497574730 497066231 496318550
3276.9 496318550 495769806 495323410 495103683 495149384 494847870 494262238 493608932 493226624 493018036 492669220
3286.6 492669220 492312279 492015762 491739120 491913605 491392517 489664612 489279861 489627419 489566040 489316940
3296.2 489316940 488583641 488597984 488747711 488168182 487560883 487278366 486883621 485854454 485345535 485264091
3305.9 485264091 484873886 484500847 484204788 484008331 483619270 483301659 483272324 482758293 481530151 480587349
3315.5 480587349 480493317 480467682 479942398 479491005 479331932 479048958 478983078 478531647 477439232 477115326
3325.2 477115326 476861610 475913849 475137939 474736252 474464531 473830338 472872925 472369690 472153664 471693611
3334.8 471693611 471447220 471293945 470765495 470210686 469627609 469140205 468771362 468159447 467441406 466732140
3344.4 466732140 466401520 466587830 466312180 465363045 464546318 464026527 463791962 463387985 462565155 462202721
3354.1 462202721 461965370 461112251 459918785 459368782 459690971 459273796 458345566 457623138 457019615
3362.8 457019615 456957970 456354790 455671196 455654984 455123558 454356499 453916550 453453751 452790337 452679443
3372.4 452679443 452703705 451946907 451162453 450764313 450667381 450372124 449847374 449335403 449031830 449134521
3382.1 449134521 448835907 448507500 448108292 447328720 446898270 446490707 446256485 446120720 445841980 445705528
3391.7 445705528 445431290 445263748 445089836 444468498 444094124 443928871 443352737 442937279 442624359 442535782
3401.3 442535782 443010025 443133049 443009987 442892456 442321167 441883888 441672096 441214027 441167488 441316109
3411 441316109 441291237 441257362 440657997 440370293 440729179 440780106 440586243 440391655 440204010 440066185
3420.6 440066185 439795799 439075661 439102821 439784966 440149422 440577469 440529709 440421829 440713539 440782242
3430.3 440782242 440314674 440184402 440735512 440821724 441023178 441057930 440801315 440833015 441228065 441763344
3439.9 441763344 441508255 441852379 442320747 442405396 442724152 443004265 443765030 442901917 442472153 443480835
3449.6 443480835 443865967 444593468 445213547 445481987 445463181 445520630 446173058 446726952 447207985 447460861
3459.2 447460861 447814598 448357544 448969688 449122391 448885994 449507446 450364304 450879974 451166573 451445236
3468.8 451445236 451989937 452603111 453223953 453737984 454286118 454638138 454450417 454748001 455635986 456374474
3478.5 456374474 457081642 457433434 457905846 458424606 458492241 459470329 460430450 460682182 460811768 460963135
3488.1 460963135 461682434 462380905 462999611 463839645 464814987 465544205 465998116 466235008 466234512 467098618
3497.8 467098618 468362808 469123764 469666519 470589561 471239777 470709343 470272064 471077232 472779274
3506.5 472779274 473946953 474861603 475285187 475123405 475711060 476131210 476950493 477837639 478623199
3515.1 478623199 479286270 479125938 479820480 480875168 481225204 482068329 484117279 485502968 484636726
3523.8 484636726 484341660 485640373 487047997 487680740 488259125 488322258 489061890 490136185 490827560
3532.5 490827560 492131615 492689247 494132080 494999313 494456673 495537376 496320496 497104454 497884521
3541.2 497884521 499103699 500187836 500975533 501612167 501427956 502965469 502985153 503942375 505510826
3549.9 505510826 506775322 509423294 508492584 508358803 508985405 509831924 512065353 512636909 513856697
3558.5 513856697 515079536 516117706 516607933 517955780 519026566 518825455 522562332 523569221 523467903
3567.2 523467903 523865356 521984711 524917450 526478920 526969795 528614616 530908394 531910477 532404671
3575.9 532404671 534486465 535107040 536960220 538321991 538572960 540186577 541902046 543370323 544040375
3584.6 544040375 548169174 550084381 546784897 547917023 548062019 550948792 553059654 555132179
3592.3 555132179 557129669 557912216 560353279 558719292 561079597 564628639 564921951 567576408 568464279
3601 568464279 569384842 570865669 572033043 574243546 577115097 579648018 578659744 581176109 580560608
3609.6 580560608 580171585 587745590 590442963 588051453 590208435 589471626 593370476 597939606 597830887
3618.3 597830887 599322395 598931580 599325409 602792320 605811272 608147392 610756912 612731247 615421371
3627 615421371 622722549 623374710 611708794 616108589 621451569 627430840 630211906 628970222 630952301
3635.7 630952301 634514008 637615433 637747231 638700943 641548386 644649124 646926193 647940750 650163193
3644.4 650163193 653899307 660081863 659393845 655231705 661184464 661933899 658903046 658952408 665214691
3653 665214691 669735413 673087921 677938232 670968781 672807388 678182449 679844437 681503296 682500381
3661.7 682500381 684800949 686102371 688008575 690151672 691013718 694909515 696788788 696093063 696478271
3670.4 696478271 690161362 693224182 702085419 712276001 715917435 696636581 696490097 703716049
3678.1 703716049 709168243 707664871 707424927 710315323 711941376 712940826 713095245 713141251 717236481
3686.8 717236481 723491516 715140457 711433105 718564072 712884140 712860489 718041229 718593826 719882431
3695.5 719882431 720054703 719211807 720471802 721322250 723613281 726369553 721721573 719949646 724656525
3704.1 724656525 726478271 726871643 727566681 730619507 734539108 726978989 731489563 736651459 723252411
3712.8 723252411 727708435 731938095 732527313 733193893 735539322 736897125 733024902 734532013 740692444
3721.5 740692444 738004074 733402710 737703018 738768616 738604660 736235123 735710373 739095917 740270157
3730.2 740270157 745223770 740955276 733270645 742629623 742444763 732978058 734591370 736715393
3737.9 736715393 737259445 740951920 744728394 740476532 742906113 753636169 744455948 727815704
3745.6 727815704 737258453 743697052 750061874 748171082 736853104 744601517 738157654 734197006
3753.3 734197006 740488663 745486679 749582672 743860931 745689163 751984940 744004822 741836853
3761 741836853 745583344 746502457 747141800 750240631 746604462 742330475 745883484 750934448 751278687
3769.7 751278687 741557922 743240891 746731262 747500458 748276443 747511063 748393478 749293747 751961517
3778.4 751961517 751002045 743311996 746235199 748495026 749506073 751460266 747937241 746550217
3786.1 746550217 748032684 748647537 749040298 749054642 749124298 748929291 748945389 748980026 750826569 753529358
3795.8 753529358 749129486 745027008 747358398 751888809 757747345 750727768 740315170 744861374
3803.5 744861374 747950745 752121048 756764603 746749496 743430862 748364868 750207367 750255737
3811.2 750255737 750342178 750416336 751761246 757494278 756379700 741805725 746246490 751893539 756706772
3819.9 756706772 757246857 739444427 743103943 748603897 749612274 751570435 752856674 749085388
3827.6 749085388 748868866 750665894 753740387 755430908 746516724 748527603 754502716 749166718
3835.3 749166718 749804535 756872711 748106155 743757248 751225433 746500854 746717453 753111877 750339050
3844 750339050 746642075 749093857 750920029 750997620 752439575 752604980 754467697 760073395 753947754
3852.7 753947754 751166534 737886887 740573807 750146179 748684158 747231674 749855957 752403717
3860.4 752403717 755364914 749924316 749048615 754544373 747549133 743049774 747136765 752427902
3868.1 752427902 758636703 749482269 740684052 745242081 752175751 755982285 745369949 746135025
3875.8 746135025 750098648 750179062 751825485 755920944 750806656 743872986 749984055 750772705 752668457
3884.5 752668457 757920532 744073792 744577408 748426132 750145264 755040741 754463272 746206131
3892.2 746206131 747137985 749926376 748591461 749982071 750890503 752849808 754772339 745109253 749233475
3900.9 749233475 750883942 745394821 749714890 747639923 746330032 746713715 748347473 750929031
3908.6 750929031 750080643 749777451 749858856 750207214 750074921 749035110 750537033 752888870 749426727
3917.3 749426727 746163254 750363693 750963516 747300034 749033432 750471573 751083450 748444061 744962997
3926 744962997 746889420 749221497 751437683 750815659 749257431 750320587 747374344 746502609 748069916
3934.6 748069916 747493515 748229218 749208832 749001007 748607330 748155136 749935989 751036377 746414719
3943.3 746414719 745954285 747632675 748227234 749706726 747666550 747840195 748128128 745405884 747280807
3952 747280807 748071213 747183762 747704697 748031387 748034973 747894287 748138580 747545395 748281021 749199524
3961.6 749199524 747870789 747315369 747398682 747698441 747848816 747510681 747338409 747107849 746799469 747526550
3971.3 747526550 748181229 747721481 747695770 747955704 748112793 747256241 746536407 746810303 747032166 747458649
3980.9 747458649 747240753 747193375 747589417 747887115 747944107 747393188 747629700 748479080 749327164 749112549
3990.6 749112549 747628326 746669006 746870041 747687759 747797165 747546539 747715836 747710800 747138824 746963806
4000.2 746963806
##END=$$ End of the data block
