##TITLE=$$ Begin of the data block
##JCAMP-DX=5.00 $$ ACD/SpecManager v 10.08
##SPECTROMETER/DATA SYSTEM=Varian
##DATE=07 Jan 2013 10:27:12
##DATA TYPE=INFRARED SPECTRUM
##DATA CLASS=XYDATA
##ORIGIN=
##OWNER=
##NPOINTS=3735
##FIRSTX=399.26403809
##LASTX=4000.35498047
##MAXX=4000.35498047
##MINX=399.26403809
##MAXY=78.46613312
##MINY=10.04830742
##XFACTOR=1.0000000000
##YFACTOR=0.000000100000000
##FIRSTY=49.97711945
##DELTAX=0.96440572
##XUNITS=1/CM
##YUNITS=TRANSMITTANCE
##XYDATA=(X++(Y..Y))
399.3 499771194 770061340 765290833 739012299 772241745 536852875 426876526 634703064
406 634703064 714043655 530254631 490399513 552483292 538255730 521645012 445753098 437741203
413.7 437741203 505831985 512164497 508276749 450950699 337451935 304117146 431975250
420.5 431975250 427737274 386241302 504087181 612153168 591368637 538814583 572277908
427.2 572277908 548266907 469716873 498834305 573524933 568425522 474909439 421697350 461698608
434.9 461698608 506958122 449314308 388159065 500203247 600595818 501995659 464453888
441.7 464453888 501157036 448057175 442764435 498233719 482126961 463831215 423016624 417762032
449.4 417762032 482699203 529708366 630357780 637015877 551631279 529611816 519745064 539148636
457.1 539148636 479055557 492150345 527233963 494151421 472893829 466640930 519558563 613155746
464.8 613155746 575628548 488081512 441863136 387622719 411345901 528362999 591347694
471.6 591347694 570207443 547004433 483341522 430239639 481921310 554340134 532721405
478.3 532721405 501299324 492724266 479116936 460717545 419095840 461520271 539570312 525790482
486.1 525790482 500707664 504479942 509290886 442406883 443041649 509123306 486491280 497608948
493.8 497608948 534925995 573811455 554571953 461406059 468806496 520234413 510092850 460312614
501.5 460312614 427942390 453502502 492171478 515914383 481738167 470942993 487201538
508.2 487201538 468810387 462453308 499028053 537555885 526232910 519852524 494500771 460807724
516 460807724 459162598 455141411 475733566 463020554 456315880 472639694 429139099 421204300
523.7 421204300 466542206 475357666 440393028 450125389 469749794 465747032 482125397 485638657
531.4 485638657 463021851 453528481 445069160 426668434 441626778 490182266 503531799 492833672
539.1 492833672 473620605 457390823 472907372 492528687 496681519 491490173 486266556 497089500
546.8 497089500 504606705 490978127 489180756 497134476 486291008 477789879 472612305 456821136
554.5 456821136 452178345 465487442 470600128 470313263 475609131 480809402 489042053 478191414
562.3 478191414 455008354 459225883 472320595 476449623 485172768 489041290 492761612 497755928
570 497755928 484441605 477728539 483334427 482447968 483887672 483474083 469280739 456312332 468251534
578.6 468251534 486302452 476511154 450601273 441825752 450541191 455528374 468564987 480328140
586.4 480328140 476403656 479858856 479165802 474814224 491023941 500559845 479011269 460871735
594.1 460871735 459134865 462127075 463384781 459823418 459439011 469059067 479796333 468600616
601.8 468600616 444852905 444150429 459856796 461372452 461344604 460201607 429884453 402639427
609.5 402639427 407082710 411495399 395183449 366395988 346844177 349671593 361863899 369532166
617.2 369532166 378493652 380823555 373998680 350731354 318924961 307066593 296520386 290946121
624.9 290946121 301793022 320606155 357253723 383325157 399179001 409680138 416490479 413015022
632.7 413015022 400792503 404351120 392671051 382773819 384827843 385235672 385923233 370366859
640.4 370366859 369091034 387099609 410684662 430684814 446681290 462334709 464564934 466611519
648.1 466611519 479746780 499056740 500343170 492879639 494048882 492872543 509809875 531834564
655.8 531834564 525445442 508522377 511816711 521949844 517893295 514432831 517348442 519346695
663.5 519346695 510028534 510240364 520306511 521580849 542442703 527977676 521641464 533265800
671.2 533265800 529624825 509709740 502193336 519152946 526188812 518394508 525285835 528245850
678.9 528245850 533909111 551160851 544365883 536822510 542415009 529874687 524578056 534594955
686.7 534594955 540323944 543832436 538672867 535259171 536112518 526621628 516661682 518553047 517536201
695.3 517536201 505660782 505827332 511346512 508798828 511178932 512394142 514085159 517559967
703.1 517559967 516632767 519623451 518863945 518691101 518640556 514946747 521705742 524374886 527344131
711.7 527344131 537345047 539994431 540088654 535324059 530116882 536426277 543510017 533754349 523993225
720.4 523993225 532006912 539431038 544350586 550381432 550302811 545901222 548221054 545909386 535923996
729.1 535923996 535967216 543973694 562098236 565874023 551467018 548352394 547603149 543549690 537920685
737.8 537920685 530842667 518894463 521580315 538751335 536764679 536239738 540153656 543365860
745.5 543365860 544939308 538623657 542382164 547510376 557705536 565271950 556884003 557908707
753.2 557908707 564496002 567853737 573084869 575765610 571501503 567206230 570603409 577890282
760.9 577890282 585060081 588532791 591210861 595999184 596203842 593278389 593091698 594549866 599046822
769.6 599046822 603830605 605729828 604340324 591050606 580368500 586463280 589300117 584315910
777.3 584315910 587977753 596046562 599428749 601961975 602976761 605954285 613812943 619280968
785 619280968 618888397 618526955 618019371 608764381 603881607 610555191 613032265 607048912 606762199
793.7 606762199 618223648 622920113 616009216 610243378 616360512 627385330 628390923 621178398
801.4 621178398 616957932 626132164 626304817 618619843 618246841 613013268 614478493 619673347 625494003
810.1 625494003 624622879 610562134 605530090 606897011 611468201 617073479 628886642 639051132
817.8 639051132 630064583 627965660 633329391 639108162 646246033 633740578 616517143 615345879
825.5 615345879 613301430 604316559 606517754 615641136 613506813 603970146 605312119 611675148
833.3 611675148 609940224 602821007 589437027 580065155 573916817 567156067 568049774 569981995
841 569981995 569767761 569052238 569141502 565039864 550764885 535794678 535298271 553960114 571000519
849.6 571000519 568989868 555570488 548973808 560671654 574595947 582449913 585483589 576247520
857.4 576247520 575248985 587224884 588369102 585229568 588720741 590628128 592201576 600316467
865.1 600316467 601954498 598596344 608666496 617180977 616974297 613941002 605662193 605578499 615646477
873.8 615646477 619229469 614601212 616260986 618808670 615667038 615202751 614199448 612411919 608689270
882.4 608689270 604538002 602178764 602564163 606985588 606512184 602076454 592410469 587880096 591770134
891.1 591770134 589200821 585973396 580145035 576341705 584690590 596121292 601347160 598819275
898.8 598819275 597558098 597485352 595148315 593241425 592490044 588145332 582834854 587510071 592186012
907.5 592186012 590632858 584320335 572906799 568373756 569068298 568019485 564598579 556754646
915.2 556754646 548327904 542992172 543004913 544839897 543695602 540087929 531078339 525327225 527272415
923.9 527272415 529850769 530550728 524766121 522283974 521574287 514289436 509984589 508013725 511242790
932.6 511242790 515303078 511877403 514159279 524877434 533268509 534598579 532812805 537310295
940.3 537310295 544899406 544934769 548853531 560172691 565483856 568527870 569362411 570384064 578089142
949 578089142 585084152 584696732 580019302 583983955 589579773 587976723 586307259 580978546 577190514
957.7 577190514 577746964 577214394 575282173 568095818 559742126 555269203 551107635 547563820 545661163
966.3 545661163 545461464 546380997 546188354 548788605 548694496 543317108 540942230 537800522 535041885
975 535041885 531359749 527157364 531050301 532721863 528133545 526021347 527659225 527691956 522825279
983.7 522825279 519844589 517586975 511918755 508497314 507949829 504903259 497255402 491247101 489747162
992.4 489747162 483319359 470180244 452933044 435173912 434285240 448835411 457506981 460610580
1000.1 460610580 466045265 469894562 473502808 476307602 475950279 473818550 471529274 469209557
1007.8 469209557 468108559 470412636 468041458 461480217 456489525 451951370 451901245 450581245 445754433
1016.5 445754433 441820030 437199440 433238182 429897003 431553268 435459251 428411369 418211327
1024.2 418211327 418957443 421330070 419183159 415201950 413652077 418282852 417936096 412116165 403311844
1032.9 403311844 397787895 401653366 403249168 400461235 392508469 385957069 382299728 383833733
1040.6 383833733 391522942 389200668 388691864 389376259 383492126 379291420 378636818 381534615 379177055
1049.3 379177055 380964279 388749886 390882301 389143448 387404900 387915611 387273483 386428070 384456902
1058 384456902 383631516 385170555 384518051 384271812 385313835 387125854 388694382 389841499 386901283
1066.6 386901283 380125504 376698456 377369537 377927017 378808632 384354019 388603134 388694077 382771759
1075.3 382771759 371314392 365511093 368511353 373843575 375156136 375927849 377737694 378998718
1083 378998718 376973648 371826744 372444344 376603394 375495796 369688148 363334198 356207733 352882500
1091.7 352882500 349093857 336109047 324081345 319581451 317100258 306929321 295277748 286311932
1099.4 286311932 275913544 266629181 254677544 247845192 237613373 217482452 203071938 200366077
1107.1 200366077 200826283 186905823 171315937 163309498 160958443 159131794 151123056 144569063
1114.9 144569063 142393990 148328304 149737787 148308182 151044207 151417780 151231766 152151556 153977680
1123.5 153977680 151565676 153725204 156189127 157546263 160845242 161308880 166213264 167070007 164234257
1132.2 164234257 159587393 156373177 155327711 149288130 145393019 141373081 135320168 130247440
1139.9 130247440 132248936 128712559 122167339 122061949 115384655 113256216 111502876 109304447
1147.6 109304447 108491249 107529306 110202866 106656876 103672142 100483074 100628052 102850370 105697994
1156.3 105697994 108975916 107581682 111639271 112917299 116001844 121489515 124422712 128623104
1164 128623104 129716330 132780704 137370081 143912716 146579762 149156246 156272659 164350281 174269581
1172.7 174269581 177422504 179966297 186655045 195035038 205456276 215619202 221555920 227279453
1180.4 227279453 237779083 247264004 256730347 263422108 271764908 280359020 285708904 294264832
1188.1 294264832 300044918 306306343 311302891 315507164 324124031 330002213 333022079 337024460
1195.9 337024460 344818192 353206787 359850388 364624901 368676529 373785858 380561218 388703117
1203.6 388703117 393685875 396876373 399404068 402650414 406913948 410187416 412267952 414508629
1211.3 414508629 418770027 419817238 421110573 425198669 427781105 429610519 430842743 429673424
1219 429673424 426703262 428353424 430511093 432268906 435312538 435456924 436014900 433416557 431406059
1227.7 431406059 433022194 434347878 437421608 440450363 442736778 443744659 444082794 441819267
1235.4 441819267 439531479 440924606 442859535 444483032 441629105 438907089 441288376 444004669
1243.1 444004669 445106125 445881920 446658325 446886635 449344978 451165085 450555458 450731163 449839935
1251.8 449839935 448573189 449928169 450266953 450186844 453298950 453609428 452227135 453146935 455221329
1260.5 455221329 455501747 453649597 454461899 454744911 455801926 457529030 458629074 461496506 462507553
1269.2 462507553 463949432 464984970 466440964 467652016 468001366 471367035 472646446 475267982
1276.9 475267982 479853172 480398064 481370468 485409393 488275833 488412132 490465813 495309143 497009811
1285.5 497009811 498509712 504279938 505446548 505308876 508409386 508816757 509211807 511277733 516354675
1294.2 516354675 520068207 520675888 524604263 528461990 528849564 527929611 529011230 531017189 532035904
1302.9 532035904 532818069 534282379 536167831 536178398 537972298 540904922 541831627 543805313 545538063
1311.6 545538063 545286484 545929832 547306099 547553482 548525925 549105682 549168663 549967422 550383873 552509804
1321.2 552509804 555818405 557638092 557715263 559017792 562034073 563310356 561259995 558190269 558579330
1329.9 558579330 561360664 562617722 562920837 563889999 564202499 562727242 559490547 557895622 558867836
1338.6 558867836 557488899 558154144 560438538 561540222 563213272 561901054 563125153 566026192
1346.3 566026192 566053314 565008545 561251373 560057106 561642113 563370743 564650421 563308105 562463036
1355 562463036 562520256 560304527 555344849 555024490 557928085 555216637 552666130 554056168 556495781
1363.7 556495781 556093063 553051033 551341820 551507378 552671967 554013443 553252754 549537506 546887093
1372.3 546887093 548463631 549214249 547632027 547810822 546791687 544209213 543202171 542323341 542429848
1381 542429848 543990173 543318214 541225090 540129013 541400261 543129311 542519417 543782768 546168327
1389.7 546168327 546658936 547174263 547539940 547038383 546560822 545116730 546326866 547052574 544722366
1398.4 544722366 542782135 541516533 540878716 541842461 541952782 540406036 540102882 540414543 541120186
1407.1 541120186 542096138 540450974 538878365 537792931 535852165 534336433 533661804 534348183 534925003
1415.7 534925003 534439926 535718307 540112686 538123016 534352989 535295601 534914398 535587692 536035347
1424.4 536035347 536116104 538581161 540314751 540808678 542068176 541355705 538161125 539271202 542824898
1433.1 542824898 544394608 544974785 544803429 542716827 543958931 548300896 551812706 551598663 550537605
1441.8 550537605 552135811 553267517 553449478 555945625 557533798 558054848 556409531 557518120 560527267
1450.5 560527267 561673164 562961922 561385918 560366745 562026329 568011513 568659019 555916443
1458.2 555916443 558990746 564570351 569437828 573357468 576322975 578147087 574111290 574546509
1465.9 574546509 577825890 581810570 584212456 585167351 586312561 582991600 578370476 583055191
1473.6 583055191 593523407 598258057 598421860 599452591 601583557 605151100 606835747 608172607
1481.3 608172607 609026375 610209084 611336784 610254097 611772995 613216286 614177017 616191864 614650726
1490 614650726 613416061 612722092 611762924 610840721 612398300 614775734 610450211 609929047 609744186
1498.7 609744186 608195724 607677155 606474113 605653877 603907318 602267761 599551926 594077072 592281990
1507.3 592281990 593877220 593412132 589291534 586810303 583410873 582462158 583717041 583217430 581019249
1516 581019249 576652718 572900925 573672485 576234474 573598251 570212135 571936302 572285042 571853981
1524.7 571853981 568386230 570373001 570616684 568591423 567915115 566824684 565762634 564236069 564455032
1533.4 564455032 559891853 559697533 561668777 560691528 559302559 556176834 556592445 553851738 553946304
1542.1 553946304 556239281 554696541 552504311 551335411 553959312 555850220 556124306 555253792 553826256
1550.7 553826256 555869026 558707352 559417229 555628700 556282310 560879402 567773323 567060776 555513992
1559.4 555513992 563189583 566533394 568060265 569407005 568926086 567746620 569964256 570324402 569967995
1568.1 569967995 571504860 570460625 573239899 574914246 573171196 570831490 570068245 568645096
1575.8 568645096 562985916 568585014 570915489 569369240 566886978 563566475 563071175 562906914 562586670
1584.5 562586670 559912338 557091713 555098724 552715378 551970863 550189400 549514809 545236740 539976997
1593.2 539976997 536368904 533641930 532288589 527009392 523318443 520459328 519601898 517331352
1600.9 517331352 513067093 511788483 508639832 505178833 500653229 497572975 493073578 489170418
1608.6 489170418 487322273 484162979 482765083 479543190 477585068 474585075 472872467 470689507
1616.3 470689507 463253975 465822868 465395279 462525711 456692467 453564491 450825806 448382607
1624 448382607 448577690 446562920 446941605 441826935 437812767 436803017 436983223 437824974 436263237
1632.7 436263237 437237701 436151390 432045135 428358498 428997612 427936745 427316246 429316139 427609329
1641.4 427609329 427951279 425959282 426286964 428565788 430448074 435917892 431426048 432960587 433944550
1650.1 433944550 435450172 438170166 437932205 438779793 437357788 440104866 441947556 444799728 445972443
1658.8 445972443 447180328 448015442 450021858 456976967 457622299 459867325 462562790 463494110 463478889
1667.4 463478889 467075157 475484352 475054283 479371376 482102814 482873421 483961601 484271889 488010979
1676.1 488010979 493786621 499517517 500600357 502545166 504296379 506369820 509859085 510058365
1683.8 510058365 516118469 519807167 524054832 527474670 531065979 535908890 540883713 544005241
1691.5 544005241 545915718 550332794 554344673 557905617 561495857 567130356 573805733 579359436
1699.3 579359436 579638062 580034561 589170799 594876328 597893105 598802032 599888954 602503242 607402420
1707.9 607402420 614185104 618075371 618248367 620725403 625863266 629038658 627271805 628413086
1715.6 628413086 632985611 636590233 633459244 634234276 637425728 639748421 640690689 639249115 638665581
1724.3 638665581 640049286 642082596 643737259 643815231 646180725 646947250 644509964 646438293 647991333
1733 647991333 647277603 647847595 650462570 653141632 654398270 657514496 658776398 655743332 658048248
1741.7 658048248 660869446 663678589 667306137 670255432 671525040 672290115 672731018 673324280 677616882
1750.4 677616882 680486908 682432938 685694046 688002930 691764984 696830139 699082870 699746399
1758.1 699746399 702057495 702514420 702739639 702956619 703657837 705645218 706403885 708095016 709986496
1766.8 709986496 709540482 708388138 712270889 715177841 712506485 711929932 712829056 715690918 716249619
1775.4 716249619 716158295 719055557 718285294 719373093 721945343 721614685 721720352 723246460 724342728
1784.1 724342728 719878769 718307419 721608047 723823776 724497528 725089874 726345215 727121582 726538696
1792.8 726538696 725410004 726335831 728430862 730037613 730241394 730686188 729669418 727236328 728395157
1801.5 728395157 729185333 729883804 730164337 729419098 730539551 732123795 732998047 733263702 733537445
1810.2 733537445 732426224 731982574 733102112 733731537 733825302 734852371 738370743 739998245 738778534
1818.8 738778534 737116852 736546478 737962875 738504639 739865036 741365051 739620056 738145142 738961258
1827.5 738961258 739985657 739179764 738193436 740135498 742201538 742210693 743347626 743811111 741784973
1836.2 741784973 740179672 739724503 741683502 742952423 743069916 743114166 745526581 747136993 740749817
1844.9 740749817 742675934 745336685 745448456 744455795 743764954 746484222 748199387 747542343 746056900
1853.6 746056900 746946640 748171921 746912766 746551590 746349182 746580963 747391357 748272781 747780991
1862.2 747780991 746963425 746592560 746745987 748051910 747011871 746065063 745281677 746060715 747085876
1870.9 747085876 745830231 746970673 748466644 748981094 749366379 750115128 750215836 748650055 748542328
1879.6 748542328 748892822 749479828 749926682 750390625 749824753 747751999 749393845 752204361 751932907
1888.3 751932907 749969788 748818207 749118500 748799591 747947311 749297485 751050415 750142899 750353012
1896.9 750353012 751828918 752653351 751211624 750460892 751264725 750260468 749718399 747647018 747779846
1905.6 747779846 752607880 753540573 750471344 749758835 751440735 750512619 748825531 749777908 752211456
1914.3 752211456 752734528 752041016 752385941 748426437 746999054 750283051 750905151 749931870 748905640
1923 748905640 748775864 748863373 749696121 751542053 751535873 751266785 751427765 750918274 751028366 750562973
1932.6 750562973 750014877 750285873 748811188 747709885 748440247 749761505 750331268 749788055 749670639
1941.3 749670639 747972717 748250046 750584030 750648727 751373749 752300034 751002808 748876648 748846664
1950 748846664 749608231 748460770 746816406 747305145 748432693 747319260 748316803 750377731 750932083
1958.7 750932083 751741867 751564331 751028442 750019760 749423981 748674622 747691498 748918457 750619888
1967.3 750619888 750430298 748445358 748553314 749765701 749222794 747949219 745711517 746192932 749265747
1976 749265747 751486435 752212448 751223221 749258957 746911469 746643448 746993484 745925140 746477280
1984.7 746477280 747416916 747385254 747067413 746071701 745592880 745117264 745426102 745667648 744984436 747578506
1994.3 747578506 748662872 746832275 747084732 746568985 745715408 745100098 743853760 744096069 744106140
2003 744106140 743205185 743399200 744662857 745355225 745651398 746671524 746196289 743979187 743819809
2011.7 743819809 745276642 744661102 742912216 743166809 743581848 743200684 743705521 743106079 742483749
2020.4 742483749 743249130 744438019 744157715 741583939 741268997 743069229 744231110 744051285 743875809
2029.1 743875809 744008102 742739868 742130280 740675125 739926910 739978333 739899368 742225571 742271576 741615601
2038.7 741615601 740957260 739761734 739722595 738916016 739565659 739685364 739738312 741052780 741196213 739831696
2048.4 739831696 738712540 739279633 737812576 736465454 737283401 738737106 738512497 736125717 736855469
2057 736855469 738733826 739248199 738046341 736413574 735728073 735514755 738149948 739966583 738661499
2065.7 738661499 736423340 735526505 736545105 736793976 735975800 734795685 735032425 735339584 734547119
2074.4 734547119 733150711 731491318 730966568 730631638 730877304 730618591 729866638 730666809 731829147
2083.1 731829147 731611176 730859680 730317688 728506012 728111343 728479996 728386841 729981842 731060638
2091.7 731060638 731430740 731574860 731384277 730307083 730336914 731868973 731083832 730305939 730890121
2100.4 730890121 731729507 731447525 730369034 730147400 729708023 730065308 731108475 732951431 733223190
2109.1 733223190 731558151 732366562 733447723 734400864 734556580 733709488 734375992 734531708 735190582
2117.8 735190582 734752960 733022232 733550034 733870392 733928833 733387756 732603607 734124756 734833679
2126.5 734833679 732777023 731116409 731852036 732785339 733428574 733319321 732861862 733798828 733967819
2135.1 733967819 733861160 732870865 731631088 732295914 734024658 735450516 733632736 733618851 735775146
2143.8 735775146 735855560 736299362 735540848 734387283 734332733 734253464 733023453 732749252 734222565 734403458
2153.5 734403458 735706635 735833206 735213470 736261826 735965347 736037445 735222626 733949966 734686661
2162.1 734686661 736116333 736906052 735941315 734827805 735459290 736631241 736424637 735997009 736171036
2170.8 736171036 736723862 736493073 735631561 736326523 736363754 735388641 734910736 734223404 733777313 734867249
2180.5 734867249 735579453 734688568 734595337 734498367 734439926 734434509 735070038 736973724 737126083 736079559
2190.1 736079559 736024551 737604446 738846130 739568405 739286652 738419418 739486847 739564667 738992081
2198.8 738992081 737879028 738357162 740949860 741251984 741264496 740973282 741692352 741731491 739708939
2207.5 739708939 739560699 740585098 741477737 740375748 740382690 740612869 739707642 741717606 743023376
2216.1 743023376 743465195 743687515 742694321 742420425 742884598 743686371 743707886 742956467 742225418 741108780
2225.8 741108780 740257721 741218643 741247253 739627151 739206390 740684662 743015900 742489471 741731567
2234.5 741731567 741849976 741221619 743070221 743876648 742760849 742629395 742641983 743175201 743139420 741928940
2244.1 741928940 741108093 741291351 741701508 741876526 742070160 741962280 742488861 743213882 741435165
2252.8 741435165 739828644 740752563 742193604 742918701 742115326 742288666 744086304 745023193 743946152
2261.5 743946152 742519150 743056335 743176651 743586502 744215775 743755493 743698196 743353195 743763809 744630737
2271.1 744630737 744752197 743533173 742105865 742005920 742076416 741471939 740818634 742758179 743676758
2279.8 743676758 741952972 741393509 742242508 743565826 743734818 744567108 745214539 744859848 744858093 744583817
2289.4 744583817 745058975 745123825 745676117 745443954 744529419 744818802 744124756 744865494 746671753 747029343
2299.1 747029343 746055450 746016541 746988983 747101517 748139343 747999039 747176971 747951813 749310303
2307.8 749310303 750830536 751258698 751089859 750947342 750901184 750956345 751130600 751204910 751988068 753045807
2317.4 753045807 753758392 755926514 757251740 758472061 759465637 758516388 759022903 760105667 759729919
2326.1 759729919 760908813 765119095 764554138 761790466 765488892 768559113 767887650 766290817 764025269
2334.8 764025269 764326630 769042206 772364120 769866333 763443832 762414322 767666855 765385284
2342.5 765385284 763971863 770001450 768347855 762315979 758292389 755616760 757568283 761494751
2350.2 761494751 763008041 765021667 766412659 769368057 777826233 780838394 775556564 770818939
2357.9 770818939 778261795 784661331 778782196 775224533 774797974 773279953 772364960 776620941 777757797
2366.6 777757797 775169830 774638748 768180161 765149612 767296753 764493561 760181503 758166809
2374.3 758166809 760178299 761471329 757863617 755479965 755557632 754531097 753055573 752498398 751979904
2383 751979904 749633331 747812424 748926392 749936905 749031448 748050842 748475876 747763443 746845627
2391.7 746845627 748303299 748661652 748348236 749169159 750002289 749846954 748968277 748275452 747736740
2400.3 747736740 748777771 748528214 746736374 747019272 747303314 748162689 749084244 748601761 748995056
2409 748995056 748599548 747739334 747562103 746267548 746375656 747624054 747496414 747065430 746476059 746644745
2418.7 746644745 747479401 747949677 748098373 747892227 747487717 747327118 747374649 746790085 747793503 748886337
2428.3 748886337 748110733 747978897 747917938 746977463 744243011 743813934 746297531 745802155 743808212
2437 743808212 743290863 744460526 744563293 744236679 744966278 745280228 746303940 746023407 744285660
2445.7 744285660 743643112 744481201 744589996 743615112 743689880 743889618 744575729 743981781 742372665 742347870
2455.3 742347870 742064438 741424103 741269684 741213303 741369400 742853851 744118958 743692856 741718369
2464 741718369 739856491 739796295 739560623 740443802 741466293 741851578 742045517 740427246 739571533 739093094
2473.6 739093094 739386139 739999466 740261841 741143494 740595322 740294724 739834061 739242783 739152069 738909912
2483.3 738909912 739535446 739192886 738299561 737782822 737776108 738318176 738527679 737862320 737302475 738510284
2492.9 738510284 739098511 738939362 739504776 739698410 738714218 737106171 735355225 734215927 736489258
2501.6 736489258 738568192 737291565 736507568 735793381 734404221 735079346 736107635 735221252 735057449
2510.3 735057449 735436630 736021652 736704483 735842972 735202713 734749527 734848328 735105362 733696747 732070770
2519.9 732070770 731263580 731329803 731729965 732952499 734239273 734915619 734715118 732839432 732118683
2528.6 732118683 732131805 731649475 731778717 732019043 732283707 732327881 732824936 733111038 732133865 730902710
2538.2 730902710 730118790 730807724 731662445 731858444 732824097 732157288 730079041 730304489 731098328
2546.9 731098328 730947495 730063324 728112717 727747116 729495087 730775375 730875702 730360794 730175934
2555.6 730175934 730763931 730772018 729914932 729168625 728923874 729089584 728063354 727209091 727768784 727940750
2565.2 727940750 728386993 728094864 727091293 726836090 726386795 727101974 728552780 728021545 725911560
2573.9 725911560 725422287 727069702 727275085 725755081 725322800 726126938 726077118 726573029 728323364
2582.6 728323364 728338776 727388687 726434021 725749207 725493088 725323563 725891190 725208130 724492416 724491425
2592.2 724491425 723556671 724056549 725032730 724885101 724647827 723663712 721032486 719273453 721227646
2600.9 721227646 723239288 722854843 722171173 721412582 720900955 720949097 719524841 718219986 719369202
2609.6 719369202 720153122 720059586 719505463 718555679 718233109 719253845 720730820 718854904 717062912
2618.3 717062912 718027725 718361511 717796478 717205734 717877731 718256531 718333588 718349075 716892395 715439301
2627.9 715439301 714582748 714725800 714719086 715191956 715091553 714335785 715872879 715565872 714201279 713906250
2637.6 713906250 713578491 713979874 713614273 713111343 712667542 712888412 714080582 714153976 713081589
2646.3 713081589 712003784 711095657 710537567 711761703 711933746 710277863 709906235 710282898 710280457
2654.9 710280457 708757172 707589645 707792435 707809372 707937927 707104111 705585327 705047379 705764542
2663.6 705764542 706581497 706802521 707265930 706094513 704262772 705007019 704703903 703429947 704556808
2672.3 704556808 705402603 705711823 705629272 704595184 704620361 704524460 702956085 701722565 701789322 701712265
2681.9 701712265 701638794 701773529 701744385 702410889 702405701 701952057 702072678 701392822 699798584 698866425
2691.6 698866425 699403534 700194397 700032654 699162369 699060822 699066849 698191605 697916183 698347015 698562622
2701.2 698562622 698169785 697719574 697826996 697582474 695995407 695143509 695753708 696600571 698297272
2709.9 698297272 697822189 695696564 695718155 695614319 694197845 693651352 694157715 693292923 692178955
2718.6 692178955 692518158 693248520 693595734 693620758 693662643 691957550 689905777 687890625 686820831
2727.3 686820831 689315033 690982819 691254196 690922852 690246429 690647812 689542084 688552246 688386917
2735.9 688386917 687907639 688546295 688807297 687810974 688101273 689048004 687994003 686824951 685847855
2744.6 685847855 684644852 684402695 684242706 684810028 685169296 684544220 684473648 683684692 683138885 683980408
2754.3 683980408 683654633 683327866 683967590 683549271 682399292 681550293 681878128 681719742 680873413
2762.9 680873413 681536560 681171875 680240479 680256271 679045639 678250580 678634491 678987503 678870239 677209549
2772.6 677209549 675901184 675757446 675153656 674886169 675221100 675226593 673932343 672854462 674457855
2781.3 674457855 675819244 674888992 673622971 673068161 673452148 673086777 671785278 671272278 669636841
2789.9 669636841 667906113 668361588 668771591 668636093 667831650 667623672 668479614 668184586 667523346
2798.6 667523346 666714325 665373840 663634033 662971802 662316666 661238861 662660370 662565308 661218719
2807.3 661218719 660673904 660046844 660977631 660958328 660768204 659854965 657186432 655598984 654664917
2816 654664917 654402313 654053421 654976654 655715714 653615646 652581024 652016602 650477982 650046234
2824.7 650046234 649453354 647138824 646097717 646876221 647140045 647660141 646935043 644825516 643910675
2833.3 643910675 643686981 643635025 642314301 639475746 637618179 636333961 635369301 635002060 633727913
2842 633727913 631984138 629838753 627499352 625205650 621955490 619055672 616902161 615110512 614301147
2850.7 614301147 613650360 612616425 612020416 611838112 611952324 610801811 608407249 609097824 610894356
2859.4 610894356 610971489 610343513 609392891 609561653 608855324 607376709 606359367 604948311 603672752
2868.1 603672752 602415695 601803932 600732498 599392128 599403877 599333649 597298279 595783882 596312408
2876.7 596312408 594984398 593794250 593727226 593142509 593042107 591870041 591111641 591188011 590214157
2885.4 590214157 588914680 589200096 589861679 588429489 586905785 585676193 584308891 583007545 581798935
2894.1 581798935 580940781 580285759 579246826 577132187 576704712 577153778 576919441 576833611 576152382
2902.8 576152382 576121826 575867996 574365273 572526627 571984940 572063103 570039406 568264046 568467789
2911.4 568467789 569496689 569157028 566464310 564124489 562648506 560130692 558273277 559456024
2919.2 559456024 560738678 559865379 558433113 557654648 557811317 557576866 556628647 557512703 557386780
2927.8 557386780 554665527 555041199 556080208 555837555 556635971 557082481 557214699 556702957 557930031
2936.5 557930031 560553360 561814651 561769333 560714607 560545540 560314102 561703796 564468956 564519577
2945.2 564519577 563110619 561609650 560629463 560640297 562132912 563427315 563771019 563585129 562042961
2953.9 562042961 560982857 560087585 560289726 560979271 559113274 557372742 558116150 560135498 561134872
2962.6 561134872 561084023 561159554 561988258 563446121 564612427 564398613 563974037 565783386 567172890
2971.2 567172890 567584915 568233795 568350945 569102592 570707474 572665825 574464760 576639748 577704887
2979.9 577704887 576565018 576545715 578756180 580657997 580931053 581607666 582020226 581813049 582310486
2988.6 582310486 583426514 585021553 586374474 588185387 588022652 587149849 587895699 587711143 588126488
2997.3 588126488 587795868 587618446 589298744 588945427 588175354 589346199 590305824 589716339 589717255 590512161
3006.9 590512161 590136948 589795227 590538597 590960464 590205269 588914261 587584229 587823296 589392586
3015.6 589392586 589865990 588895874 587397804 587044792 587667198 586893959 585012093 584685555 585233841
3024.3 585233841 585077324 584641724 584290199 584172249 583523674 582939491 581997108 581232224 581458397 580855789
3033.9 580855789 580850716 580335464 578673096 577552185 576978302 577371216 576960373 576353912 575758972 574409103
3043.6 574409103 573322144 572546158 571983185 570587120 570274887 569986229 568210907 568006020 567476044
3052.2 567476044 566629372 566738663 566822090 567360229 566656532 564041519 562335396 562955437 562773437
3060.9 562773437 561188316 560710602 561139183 561580086 560186501 558706932 558750687 558029861 557598991
3069.6 557598991 557867050 558352814 558417702 556969490 555975380 555288811 553939323 553675079 554296722
3078.3 554296722 553550568 552065887 551873817 551739807 550181313 548746490 548715897 548463516 547386780
3087 547386780 546579361 546650467 547626915 546686821 544048195 544061165 545096130 544530716 543892365 543079796
3096.6 543079796 543044434 542761879 540840340 540678215 540165024 539174042 539357071 537647705 536425247
3105.3 536425247 536207123 535836105 535106964 533774681 533458748 532683334 531651077 530900650 530303268
3114 530303268 529473839 527668304 526802559 526255531 525428619 524845657 524126663 522757530 522065277 522312584
3123.6 522312584 521214447 520442505 519099121 516723900 516385803 516542892 515932884 515645943 515311852
3132.3 515311852 513936195 512872238 512673531 512134666 510963974 509900742 508849831 507688751 507781334
3141 507781334 506333008 503689728 503370628 503535728 502571220 500469933 499059906 498576050 497534752
3149.6 497534752 495624390 494561119 496010132 496501770 494742889 492483292 490796165 489399414
3157.4 489399414 487912560 487769394 487557831 485664215 483534088 482727585 482703400 483151245 482362862
3166 482362862 480186348 479515419 478677063 477909508 477440605 476755371 476584625 474794426 472473106
3174.7 472473106 470656624 469605980 469180870 468985786 469083252 468305283 467283478 465151558 463239174
3183.4 463239174 463392487 463365440 461880417 460348663 459318237 457027855 455741119 455909653 455872536
3192.1 455872536 456131325 455050240 453570061 453136406 452519341 450541191 449181557 449712715 448904419
3200.8 448904419 447102814 446106300 444854851 443624268 442948685 441867447 440321655 439557533 440088844
3209.4 440088844 440221024 439012680 437382355 436117592 435135078 433382072 433705215 434415207 432426414
3218.1 432426414 431462364 430271072 428197212 425816765 424769211 425925789 425305786 424613724 423408508
3226.8 423408508 422227859 423023567 423134880 423186264 422905121 421566696 419687653 418702240 417134628
3235.5 417134628 414327049 413623848 413998375 414225426 414208107 413707199 411402054 409289246 410091248
3244.2 410091248 410753593 410502510 408912582 407109528 406366501 405872612 406064835 406169052 405488358
3252.8 405488358 403166389 401594086 401401596 400815926 400587349 400658188 400175781 398100433 397647362
3261.5 397647362 398428993 398133354 397210999 394928436 394640923 394919586 393788605 393617973 393017197
3270.2 393017197 392460937 393057137 392407112 389751434 388675652 388680229 388312569 388730125 387951698 386913300
3279.8 386913300 386553574 385669937 385133095 384349251 383404312 383555870 383535500 382605286 382179184 380971642
3289.5 380971642 378987732 379609566 381048698 380192146 378452721 377869148 378894005 378417969 375396919
3298.2 375396919 374328079 375358124 375335579 374740982 375076942 375150604 373614998 372462425 372642555
3306.8 372642555 372076988 370204887 368632774 367976608 368058472 367647667 367109756 367206078 364446754
3315.5 364446754 361722717 362051659 361998329 362427177 362903442 362324905 361313782 360779915 361533737
3324.2 361533737 361251984 359403343 357574539 357677612 357672958 355901299 354706306 353698807 353320274
3332.9 353320274 352820091 352338028 353095818 351766891 349708900 349444656 348048096 345825958 344757538
3341.6 344757538 343763275 343527756 343850327 343742905 344363441 344165077 342571831 340554848 339283752
3350.2 339283752 339533119 339267807 338096237 336514473 335882874 336161461 334894829 333467331 332428856
3358.9 332428856 331437416 331440315 330831490 329285355 328651886 328737488 327266159 324985313 324610825 324483109
3368.6 324483109 323392754 322532310 322092896 321764870 321504135 321849442 321761971 320927467 319713192
3377.2 319713192 317867470 316524868 316289253 316152477 314535484 314524403 316156273 314929905 313880424
3385.9 313880424 313886337 313247852 312999535 312708092 312081623 310872364 309509125 308209000 307948055
3394.6 307948055 308922215 309256020 308285904 306686821 306313114 306985188 306990700 306140537 305962791 306422195
3404.2 306422195 305675392 304918461 305392323 305993023 304949875 302947521 302673664 303716621 304673424
3412.9 304673424 305631180 304522972 302097740 302668457 303123131 302498341 303229885 303438377 303161964
3421.6 303161964 301721878 300774612 300920143 301023102 301663513 301131840 300880432 301099815 301632233
3430.3 301632233 302126179 301606178 302118378 303102989 304487991 304247723 303216038 303994198 304076157
3439 304076157 304566135 305536842 305379257 304988575 305360489 305018139 304282475 305321712 305785141 306351643
3448.6 306351643 306962986 306355457 307214336 307639141 306258678 306640263 308829575 310032635 310024815
3457.3 310024815 310296288 312364368 313975849 313510666 313117199 312405548 312490349 313278999 313147888
3466 313147888 313933926 316156330 317671471 317567463 318092060 319436893 320778694 321729507 321418762
3474.6 321418762 321452370 321751976 321730156 322989426 325005188 325399513 325815392 326550751 326054115 327253113
3484.3 327253113 329060936 330608025 331648254 331299667 331995239 332362938 331808739 332213135 334563179
3493 334563179 337143059 336815147 335640564 336636810 338521729 339464111 339918289 340288811 341937599
3501.6 341937599 344431000 345589714 345795631 345068245 344597206 345300980 347817993 348978767 346794090
3510.3 346794090 347043228 349265633 351628723 352537270 352834511 354232483 355157967 357022858 358444214
3519 358444214 358803940 359507065 361229057 363150215 362684288 363352890 364744873 365167732 366314087
3527.7 366314087 368163757 369311600 369839439 371388741 372242508 371437378 370586052 372384949 374811325
3536.4 374811325 376119232 378616905 379765663 380552597 381849327 383275146 385046959 385603447 385245934
3545 385245934 385028343 388123817 389041901 388066330 390761337 393876648 395469055 395667458 398248062
3553.7 398248062 400156517 399692764 399629631 400203247 403373032 405298805 406980782 408242111 408558388
3562.4 408558388 411356010 412610207 414148216 415749359 417744255 419213028 418476944 421889610
3570.1 421889610 424132195 425079842 426828842 427856445 429465904 431412697 432861061 433391762 435307732
3578.8 435307732 437129555 438666840 441300507 444475441 447040138 447423248 451078453 455516052
3586.5 455516052 456213531 458338547 458052902 458533325 460175362 463208580 464571838 465355606 470565186
3595.2 470565186 472024536 473555107 475964432 476764412 481159248 483428879 483594971 485614624 488539314
3603.9 488539314 491254807 493004990 494530411 494993134 499389801 502203522 501114845 504979744
3611.6 504979744 506613274 508064613 512317619 511415291 514862976 519657555 519479752 522290268 525038414
3620.3 525038414 526511154 529538383 534189758 539700851 543393974 544110832 544162216 550664635 554581757
3628.9 554581757 544773064 548774910 554398727 560257530 563018188 561732521 564709320 569156303
3636.6 569156303 572250252 572703018 574860420 577784309 579812431 583315277 586104622 588772964
3644.4 588772964 592342453 598257141 600229073 598533821 602312355 598919830 597685928 599766769
3652.1 599766769 604063568 608913918 613867683 620401802 616237679 615498352 618480759 620352364
3659.8 620352364 624522858 627228088 629210358 628977966 630055847 633636208 635724182 639398727
3667.5 639398727 640233841 641970596 646677322 638297577 639761162 648125000 656097412 659806290
3675.2 659806290 644664383 643817902 650863800 654605103 651681824 652140656 656083069 658402863
3682.9 658402863 661499329 662815475 660904999 663644791 671958771 669217529 662766037 669856491
3690.6 669856491 667884369 663892670 667064819 668716965 671672821 671934586 670369415 671535950
3698.4 671535950 671966171 673989334 676315155 672977982 672220917 675747375 676031876 676902008 677778549
3707 677778549 679048996 684392319 680593338 684762268 691879272 677673798 679416885 682890549
3714.8 682890549 682377625 683124466 684882355 686991425 685831833 686601181 690724640 687299881 681707611
3723.4 681707611 685974350 690089645 691246490 690157928 690752029 692563629 690833359 694614105
3731.2 694614105 693396530 687348709 694675980 690585251 679066391 683353424 689374695 691191254
3738.9 691191254 691688385 695144730 693874664 693749771 703891449 697846069 681796188 692493896
3746.6 692493896 695516434 699033585 699327774 685870667 690990753 685847015 682395477 689668427
3754.3 689668427 695489044 699477081 694380264 695585937 700560913 694611282 691915817 695539551
3762 695539551 697348709 696392441 699542923 699602890 694845352 694965820 698794098 701561890 692655563
3770.7 692655563 692024994 695467758 698329697 701082993 698698578 696749802 696625977 700749817 703820419
3779.4 703820419 696103897 697188568 700000839 699181671 700253067 700310898 700269699 700925293 701192703
3788 701192703 701085892 698670502 697593002 698827591 699439316 699255753 701038437 706834869 705230255
3796.7 705230255 696474457 696742783 701476440 709173126 708555145 696036301 697326355 699256821
3804.4 699256821 702037582 706950455 701177902 697076874 700248260 702353439 703136368 703344727 703819199
3813.1 703819199 704139786 707542877 707731094 693381882 696064606 703399506 708891525 711691742
3820.8 711691742 696455841 694840240 699212723 700760117 703536835 705026703 701383438 699605408
3828.6 699605408 699460602 701722107 704593811 698319626 700265808 708099823 702029419 699100494
3836.3 699100494 707462311 702192841 697485123 703052902 698130569 698337479 706017532 706118317 700523148
3844.9 700523148 700370941 701269302 700820465 702867584 701989594 702583542 708284149 703964310 710508270
3853.6 710508270 700317764 692758255 702436523 704111786 702020798 702032852 701732254 704662704 701774063
3862.3 701774063 699474792 705192795 704334183 697342224 698739548 703866043 710125656 702396851
3870 702396851 691768951 696377716 703705521 708682556 698917160 696603012 700471420 700122910 701535797
3878.7 701535797 705528336 703611145 697494507 699700165 701647644 705221939 711630325 701594391
3886.4 701594391 699808426 701440430 701571045 708908615 711894455 701253433 699362946 703424835
3894.1 703424835 703556747 702703934 700322037 701072922 706693344 697731400 697324600 699827194 696174469
3902.8 696174469 701486969 700601730 699047165 700713120 701002960 702159958 700819702 700517654 701809998
3911.5 701809998 702457809 702441406 701328430 701540222 704154282 701662598 698097153 702866821 702631912
3920.2 702631912 697801514 699381180 700870819 701962891 700507202 697115097 696556091 697899017
3927.9 697899017 700999603 701715088 700956879 701808243 701183167 699749603 700296402 700890808 700377350
3936.6 700377350 701754150 702509232 700172119 698564987 699049225 698987961 695579834 695633240 698483582
3945.2 698483582 700259933 702176361 700927429 699736404 699839554 698811111 699750443 700213470 700245514
3953.9 700245514 700363312 701049728 702396469 701909943 701854782 701032181 700496979 701769409 700860748
3962.6 700860748 700310059 701236572 701575165 701822128 701428909 700441132 698594437 697117310 699738464
3971.3 699738464 702788467 701879578 700465393 699958038 700337524 700921478 699640121 697380753 696780167
3980 696780167 698696976 700932236 700725174 699862900 701575623 702223969 700922241 699475555 697401886
3988.6 697401886 698129883 699529648 699455414 699851227 699218674 699546509 700178375 698450012 697991867
3997.3 697991867 698131409 697298431 699771194
4000.2 699771194
##END=$$ End of the data block
