##TITLE=$$ Begin of the data block
##JCAMP-DX=5.00 $$ ACD/SpecManager v 10.08
##SPECTROMETER/DATA SYSTEM=Varian
##DATE=07 Jan 2013 10:27:06
##DATA TYPE=INFRARED SPECTRUM
##DATA CLASS=XYDATA
##ORIGIN=
##OWNER=
##NPOINTS=3735
##FIRSTX=399.26403809
##LASTX=4000.35498047
##MAXX=4000.35498047
##MINX=399.26403809
##MAXY=85.14244843
##MINY=9.83432674
##XFACTOR=1.0000000000
##YFACTOR=0.000000100000000
##FIRSTY=35.96537018
##DELTAX=0.96440572
##XUNITS=1/CM
##YUNITS=TRANSMITTANCE
##XYDATA=(X++(Y..Y))
399.3 359653702 851424484 549127502 338684158 512251091 516975288 404915886 507527847
406 507527847 537534485 549569969 668672485 697834015 648621826 595908241 531466675 568099937
413.7 568099937 682525024 600967827 498477325 386234589 295023117 464100151 378441544
420.5 378441544 380580139 450310173 417944565 443961754 555890541 736934280 761037216
427.2 761037216 565661011 450509148 493058586 523359261 460310860 423512573 413116722
434 413116722 465748901 443189545 358217125 369144554 427660713 498042297 422661095 412134743
441.7 412134743 484436340 526342239 559828758 476411858 535683594 600627403 513553886
448.4 513553886 530042038 464976692 426961403 588770866 659448166 595467262 591064148
455.2 591064148 535047073 552518005 667784271 479809990 355805740 347305717 390943184
462 390943184 481276283 540086403 598746147 546181450 412224770 392241478 464632492 494183311
469.7 494183311 482924347 506962471 508765869 477676506 503474655 520925941 524825897 491560745
477.4 491560745 460656700 497962456 496520042 432755966 424175835 438248978 436513214 491605225
485.1 491605225 535414352 529513435 555503197 589016647 496517181 405648994 456774979 532576866
492.8 532576866 540596352 535005341 559940529 564309158 495353813 453582497 458603477 497948189
500.5 497948189 524499855 474301910 449018745 481343040 523190384 515081062 469936485 479363937
508.2 479363937 511243401 510221291 528614578 540960159 498997154 465777893 433726654 428322487
516 428322487 456605835 486900253 523489532 492997513 473862648 490103111 461594887 439573936
523.7 439573936 468740578 518621140 509997940 494411011 479593735 455341339 449264030 445094795
531.4 445094795 453505058 485716095 534037437 523254852 489596329 479704590 443326950 433285599
539.1 433285599 453136024 484345016 496376724 486694069 493348045 488339043 484417877 457398567
546.8 457398567 436493340 450205536 454903984 472176170 486110649 499710922 516745491 505752373
554.5 505752373 483020020 477170868 474848022 471000595 472514839 450766563 454753532 470065308
562.3 470065308 457920952 473612022 478682060 458093262 453595657 466210213 477290459 484445610
570 484445610 489790955 474686165 471764984 481318207 469305878 457379799 469559975 477270393
577.7 477270393 470835800 480072174 470931892 460000038 485007477 487140923 472547989 478749237
585.4 478749237 483282623 468323708 459716492 461400299 463594017 476425362 472421951 465680161
593.1 465680161 484471130 497905884 488223457 479917488 485971107 463511162 451106300 487114143
600.8 487114143 488121567 467764130 467507019 460276375 451034698 453847313 445809021 418751755
608.5 418751755 408519707 412613373 399723167 385369492 379961700 366116943 357130318 359900513
616.3 359900513 362163811 374865875 367882614 346360245 341508064 323331375 307799473 306939945
624 306939945 311929474 326056252 330998192 342697105 365725021 389904671 402713585 403168793
631.7 403168793 403473396 403371468 395408516 375945435 375869827 385056038 379878082 369210815 361799583
640.4 361799583 365425453 381294174 411218605 428524323 447252350 466828766 463965569 479716835
648.1 479716835 504973679 507034492 490895386 489838409 508084450 502199821 500102043 517228355
655.8 517228355 523215790 521673393 524908981 528752098 521064682 516339951 516554298 512203484 516593170
664.5 516593170 524124985 514099693 494477043 515852318 521955490 523198814 539119034 541409760
672.2 541409760 532445221 531993370 527373352 518069458 522011642 525152359 528236198 537843208 535120010
680.9 535120010 527575111 525474472 529021721 529436417 519907303 519642525 522958832 520150070 528674965
689.6 528674965 539959221 536260338 521479378 511381760 518708191 527362633 520309792 515777588
697.3 515777588 522322197 526653519 526702919 523182640 524233055 529751625 521171837 512144318 514255257
705.9 514255257 521049042 528370743 524269485 520329437 518491325 517968788 525700912 528672180 533003807
714.6 533003807 535323792 532328987 534740143 534376106 538386154 549721985 554021339 550444527
722.3 550444527 548373604 556570854 560811424 549879799 542672729 548025475 551283302 548749695
730.1 548749695 555567245 563032379 545577698 533186340 545882835 550826797 547872353 551407814
737.8 551407814 556008224 550074120 538204498 538034554 541739922 545215683 544846382 539124947 539931793
746.5 539931793 537669945 539923859 549357796 552705612 562014008 565272255 563313065 573082008
754.2 573082008 576708145 580250473 585419350 581165695 574986305 571211052 581335144 590471573
761.9 590471573 588303566 590445900 593122177 594379768 593536034 590359306 586389503 588522911 590665855
770.6 590665855 584696312 585895767 579401207 574523277 588520317 587127571 578795815 591099319
778.3 591099319 606871567 612367630 617309151 620327911 620322914 623494682 620615883 617042236 618024178
787 618024178 616355324 613915100 614359245 620720596 623720551 619918289 619023857 620525551 618603287
795.6 618603287 612683449 612905121 622336197 627828331 622088661 618995209 628898048 629213371 619455147
804.3 619455147 622650337 623081551 619159317 621647835 623096008 624435577 620091476 621779404 624331551
813 624331551 613277512 614767647 624815598 629590378 627306938 619532776 624236183 627579803
820.7 627579803 622848358 628710022 623715439 609810982 615273399 617877769 618009872 619931335
828.4 619931335 608581963 602569427 597706451 600086441 609239120 605115776 597658691 583714142
836.1 583714142 578340492 583746071 584255905 590908661 590539970 571508980 556712265 557112923 558897095
844.8 558897095 555411987 542417793 536092567 549603615 557958221 559210434 564041443 570549507
852.5 570549507 574344711 577185478 585336151 585537453 578402596 578031044 584333076 594907341 606402359
861.2 606402359 606876526 600653076 602163696 600059662 597509880 602372589 605958252 609594612 613576317
869.9 613576317 616498642 610907631 604347687 611822128 620397186 625564003 631985474 632926407 627214699
878.6 627214699 613623505 605148087 612577858 616691132 614801178 609219780 600074768 595726547
886.3 595726547 593538857 598908844 600290070 593711090 592797394 597993469 605035477 601632805 600834846
895 600834846 602294769 595048370 594613228 598743629 603127251 597935219 584858475 584828568 590750160
903.7 590750160 586433105 581473503 586277351 586531830 590458221 598159637 583143463 565511475
911.4 565511475 561944275 567382202 574119301 567921295 561911545 555739594 545193176 546642265
919.1 546642265 548937759 543304176 534611473 526417770 526006927 530508499 527975960 518286285 517716980
927.8 517716980 514881325 507956352 511365280 511959152 512167320 513926277 516257362 523065605 529604988
936.4 529604988 531828194 525281448 525582466 535375977 542691727 546118965 549824562 561018982
944.2 561018982 570119514 573717804 571114235 565308990 568191986 574811745 576244583 573121033
951.9 573121033 580226288 588305321 581909332 580136833 587059860 585859261 576861076 573501396
959.6 573501396 570772438 566840477 564351540 559597549 560326271 561953163 554727478 542310219
967.3 542310219 537679939 542520027 542951012 539275475 538602448 537876434 534363251 531507454 528989792
976 528989792 529265900 530208168 529595871 530725594 527620239 527655296 528622665 522434998 521001625 523733826
985.6 523733826 522206650 515244141 509874268 505932655 499866714 494493675 488891983 481437874
993.3 481437874 467212296 448211250 431677666 429585876 442141647 452702866 461745872 467457733
1001.1 467457733 467621651 473543510 476781082 473028641 471177940 470006790 466322250 463925514
1008.8 463925514 468393059 469789963 462612762 459629936 459525528 458754578 457180710 450546417 444265976
1017.5 444265976 439821510 435536499 430248795 427971954 432485161 431616325 419648361 408268509
1025.2 408268509 411018410 420193214 420149651 416780128 413568077 406120567 401962738 404168434 404286003
1033.8 404286003 401782265 400627747 397675858 392979393 390848274 388379402 388040848 387693138 380549812
1042.5 380549812 384256821 396144600 395122032 386207314 376706085 375358162 383136482 387231865
1050.2 387231865 386445999 388889618 394614105 392687607 388272018 391050301 392938728 393612289 395005684
1058.9 395005684 396972694 393713188 384067001 384350586 389985924 389934959 385007896 382088928 385820961
1067.6 385820961 387657700 391317825 391701813 385998611 382096977 377925949 376914177 372871056
1075.3 372871056 370455093 370278358 365678101 368255043 372688370 374345894 373388062 374551392 379488792
1084 379488792 375736389 371613998 374204445 373329010 367272415 360810127 353311081 347694435 344595299
1092.7 344595299 336798325 325095291 315129642 310096836 300959282 291234016 285806026 277212811
1100.4 277212811 271468277 262355404 247040443 231652374 221411953 215214901 203674316 191007423
1108.1 191007423 180999050 178300018 175552483 169230576 161675892 152432823 145329838 139165239
1115.8 139165239 144318247 150741940 148841085 144114552 142467623 148683777 153566523 156044941
1123.5 156044941 155082645 156366663 159293041 160130978 161628742 162231388 166886940 167234116 163112297
1132.2 163112297 160296822 156651974 153069315 150761757 148768234 144694004 145039682 142352076
1139.9 142352076 134464407 130188217 130481663 127965422 118607426 116602030 114915819 108321009
1147.6 108321009 104166536 103557796 105719557 105055037 101842337 98343267 101369724 105314350 106339779
1156.3 106339779 107231579 109585581 114051609 115687237 117497053 117716236 119601355 121612177 127490158
1165 127490158 135026455 135387468 140996542 146114664 155101271 165296211 167384682 169544468 172361565
1173.7 172361565 181464596 193194389 203924599 209845848 216407185 225650196 232205219 243106518
1181.4 243106518 249624519 253887386 262091465 271452560 278588009 284746952 296549416 303469067
1189.1 303469067 305722485 310075932 315138435 321801414 329689751 335104942 338796654 344899559
1196.8 344899559 348653870 354371033 363278885 368579979 374041634 380857201 385556984 390878372
1204.5 390878372 398889275 401891594 403311577 411093903 417485199 418215599 420212173 422608986
1212.3 422608986 423169823 425859566 428149719 428593407 426212692 426517372 431770401 433711090 435015297
1220.9 435015297 434699059 434965744 435959587 434366112 436064911 435963402 431736450 428587265 430890656
1229.6 430890656 435583572 440426903 444208984 441284065 441082268 444090614 444128571 442020111 440854034
1238.3 440854034 442894859 442800446 444457474 446802673 445406799 444491882 445919533 448751717 451517181
1247 451517181 451735878 447398224 445712395 445974884 447567444 451188393 449541588 449721375 452310677
1255.7 452310677 453425217 454488220 455174789 456011658 454906082 454805832 455127983 455137405 457366600
1264.3 457366600 461066666 463114777 461879425 461579247 461695709 461944885 464532051 466402245 465799522
1273 465799522 468449783 473704071 473687820 473621712 477428398 479431801 480191841 482872086 485573807
1281.7 485573807 488027229 491710396 494224548 496089096 499759521 503507500 504144554 504351120 508103943
1290.4 508103943 511474266 510890846 512274704 516814232 518488235 521091805 525874710 526713829 525711441
1299 525711441 528608856 531186981 529900627 533015785 537510414 537635117 537151756 536333656 537945137
1307.7 537945137 541436882 542401199 542029762 543903313 547947922 548173904 545620880 545659599 545880623
1316.4 545880623 547274895 551543808 552231941 549889412 551288605 555378685 556366730 556501465 560512314
1325.1 560512314 563856697 564358635 560723343 557809753 560819626 563072433 561605873 559928780
1332.8 559928780 561955261 562890663 560379257 559599228 560372086 561597710 560513344 558442421 558169823
1341.5 558169823 561016960 564738350 562884941 560981293 561307526 563535767 565422974 562842979
1349.2 562842979 561942902 561909370 562696114 565024223 563647194 560718422 558535767 557272720 556997566
1357.9 556997566 557707100 558280640 555514565 553338661 554227982 553918037 554694366 556803665 556283493
1366.6 556283493 554541664 555443001 556136208 554484901 552167549 549477501 548254166 549813499 551949310
1375.2 551949310 549636765 543300781 541070404 541475601 539600525 540301132 543082619 545441895 544395676
1383.9 544395676 542366829 543870888 545787659 544612350 541970100 542709885 546138458 549285049
1391.6 549285049 549080086 545988464 543366776 541186066 542004776 543822174 545002174 544882202 543223305
1400.3 543223305 544138794 545156364 545877457 544137993 538987007 538734322 539985237 538794785 536237946
1409 536237946 537719727 540299835 537798347 535341606 534636192 535059929 535203629 532278862 530531540
1417.7 530531540 532654915 534277267 534994965 536407356 536253395 536629639 536715851 536063690 536490059
1426.3 536490059 537135353 540007744 542525177 541551971 540303116 539827538 540266418 542482834 545700607
1435 545700607 546675224 544317894 547404175 550068512 551956100 552215042 551386642 553768730 556083260
1443.7 556083260 557908401 558415070 555722733 553888168 554031258 557896042 559606590 559935226 562348709
1452.4 562348709 561188660 560944405 562813034 568727455 566494980 556263885 563527679 566912117
1460.1 566912117 568297729 570443077 572178764 573261108 574085045 577994881 580125084 582195740
1467.8 582195740 583281174 584660568 585895462 584633560 583044434 587092133 595786209 599221077
1475.5 599221077 600668907 601242905 602054634 604873772 606215553 608046379 610403709 612586212 612363548
1484.2 612363548 610052643 611843719 615220184 616788292 616886139 614406395 612396851 613007660 614330711
1492.9 614330711 614046288 613992386 614694061 611106491 610374870 610077553 608855896 607910271 605898819
1501.6 605898819 604322090 603299065 603161087 600546570 591145821 593967896 595545845 594623528 593076553
1510.2 593076553 591225891 587592278 583784370 581785202 579436378 576501350 571587944 570577545
1518 570577545 573074036 573687477 570521927 573483582 572770615 575335045 579891930 574294891 570934677
1526.6 570934677 570562515 569805527 569773865 567631493 565714264 564853134 563355942 560016785 561673508
1535.3 561673508 561378174 558859138 558172035 557937279 555233040 553037910 558586655 558391304 555653572
1544 555653572 553214111 551471176 555071564 555109215 555147972 556688347 558668976 562227745 563929291
1552.7 563929291 568771935 567829323 559332542 559327583 564362946 580011101 569892349 567641754 569848824
1561.4 569848824 569359055 568972397 567028923 566226501 570488014 574291115 575181313 573661156 570894547
1570 570894547 574229012 575761528 572763519 571273193 572655716 571173935 561182632 564418907 567846718
1578.7 567846718 568878822 569623909 567929878 566592064 565572662 562613754 558452301 556198349
1586.4 556198349 555372810 553979988 552757835 550475883 548794365 544958954 541611748 538539276
1594.1 538539276 534033585 531863670 528032455 523569603 520428391 520530510 517710609 513059006
1601.9 513059006 511955757 508812714 503308372 499064445 499549370 495993996 492103882 488832741
1609.6 488832741 484017296 485082588 483281555 479385910 474236603 471264572 469820061 461352844
1617.3 461352844 461879196 463264275 463213043 458321991 456707993 457243385 453585587 449175148 444613800
1626 444613800 446256752 445710106 442104378 440341415 440204201 439036255 436350250 436275597 432835083
1634.6 432835083 432507401 429849014 430709877 433497581 430826416 428808899 428735619 431486549 430213966
1643.3 430213966 430118179 431121368 431810303 434604454 429889145 432574310 433627205 434536057 435887909
1652 435887909 436305580 435140915 435813408 440909119 442092438 445002975 448191490 449760056 450623360
1660.7 450623360 452728539 456446800 456288795 458410683 460132904 463481560 466042595 469536514
1668.4 469536514 474471703 472141609 476220665 480940094 483731346 484414101 487081528 492715950
1676.1 492715950 496268082 501634026 502755203 504428177 509075623 513349991 515246124 515274963 517604904
1684.8 517604904 518941269 525300331 527480392 531212883 537331352 540097275 543088989 546173248
1692.5 546173248 551564598 554879837 556756783 559958153 563591805 570188217 576618118 578345070
1700.2 578345070 579402924 588437843 593303833 595017319 597842140 602015800 606920738 611401939
1707.9 611401939 616888390 621117058 621789589 622880554 624731903 626741447 629317856 632207642
1715.6 632207642 635233078 636626358 634421463 637032700 638846321 640294037 641234894 639025116
1723.4 639025116 637269974 638307076 642581253 646216354 645803986 647610931 649352798 648346252
1731.1 648346252 650223160 650900497 648088684 648525391 651702042 654306412 654991608 656392441 657812424
1739.8 657812424 656266327 658388596 662332230 664780350 666570358 669830933 673177032 676135406
1747.5 676135406 676383057 674670181 676963120 677722931 681447983 688559265 691938629 693276443 695417862
1756.2 695417862 694491653 695867615 700441437 702198792 702744293 702763443 704987793 707188797 706022110
1764.8 706022110 707777481 711819992 712758026 711468582 715303421 719939804 718730316 713307877
1772.5 713307877 710029221 714175415 716353149 716118927 719131851 719760284 721669769 722434082 720861206
1781.2 720861206 722195816 723098145 724763870 723699112 722542191 723743973 723973465 724613419 725437164
1789.9 725437164 726213303 727638702 728572235 727478180 727115936 728256226 730102692 730850601 731428452
1798.6 731428452 730909958 729514160 731511917 732908554 731453018 729684677 729282761 731738052 734048996
1807.3 734048996 734430389 734566422 733998795 732706985 733974075 735241623 736824188 738751602 739552917
1815.9 739552917 740970154 740316391 740044937 741032791 739864349 739270020 740571976 743570633 744024582
1824.6 744024582 738459244 736261826 739453506 744054108 744624786 740288773 739326553 741672211 744461136
1833.3 744461136 744324493 742998886 743586426 743793869 744062576 745938416 745832672 745296249 744973221
1842 744973221 745073013 744264832 740491714 742481995 744958267 746864548 747459946 746479187 747035980
1850.7 747035980 747899323 746630173 745630188 746965256 746731491 746517029 747420197 747807007 748889999
1859.3 748889999 749270096 749336014 749008865 749250946 749063416 749260254 750409470 749019012 750415344
1868 750415344 752773743 750655670 748807831 748680954 749461441 748750458 748779221 749549103 750462265 751828918
1877.7 751828918 751590271 749546051 749162445 751218338 751599426 751852112 751509094 750287170 751560593
1886.3 751560593 752738266 751660385 750262680 751156006 751264267 750026398 749815979 752629471 754919968
1895 754919968 752078552 750650482 752415237 754302597 752644272 750038452 751311493 753681259 755062943
1903.7 755062943 753343201 751281052 752333908 753685684 753194733 751966248 751257248 750373535 749788361
1912.4 749788361 750107117 751792145 752684555 753790283 755250702 752636414 751273193 751014252 750680847
1921.1 750680847 752096558 752088852 750475922 749779739 750766296 752163162 753524170 753960648 753263626
1929.7 753263626 752218323 751860428 752580948 752526779 753242340 752744751 751507721 752214737 752986298
1938.4 752986298 752462463 749734344 749103928 749621811 749313049 750259399 750736542 752426758 753214569
1947.1 753214569 752309952 752017517 751120071 750567398 751731262 752114944 750717316 749564896 749716721
1955.8 749716721 751594467 752531281 751145020 749577484 750316315 751712646 750059433 748991013 748951416
1964.5 748951416 749224014 750910797 751508789 750138855 748306122 749890213 752426071 751763229 750057831
1973.1 750057831 747827682 747274017 748747177 749055557 749599686 751383667 750689087 748169556 747351761
1981.8 747351761 747736969 747788086 747962723 748982162 748979874 748157120 747486115 747799683 748840637 748181686
1991.5 748181686 747199478 747583008 749213943 749536438 747747421 747210159 747266388 747841797 747488861
2000.1 747488861 746091461 746474457 746177979 745137024 745561752 746680756 748339233 748651047 746829910
2008.8 746829910 745510559 744697800 745305405 746831894 745918579 744784241 745681229 745823975 745205688
2017.5 745205688 745837708 745200424 744911118 746210480 746358566 745588455 743719254 743130112 744167175
2026.2 744167175 745218735 744674149 743500900 745232162 745537720 743958817 741813812 741248322 743685532
2034.9 743685532 744135590 744357147 744282761 743078995 742270737 741902847 740288315 738299103 740230255
2043.5 740230255 740384750 739711227 741764145 742014236 741533051 741412048 740653763 738742371 738318100
2052.2 738318100 739112625 739658356 739686432 738146439 738673401 739962616 739367599 737536545 736664810
2060.9 736664810 737481842 737656631 738661957 738890228 737530823 737850037 738839798 738201065 736913528
2069.6 736913528 736136322 735497894 735349579 734972229 734376144 732971115 732698212 734185944 734393997
2078.2 734393997 734514313 734321976 734390411 734232178 733176880 733321915 733741074 733404312 731901093
2086.9 731901093 730913773 730230255 730211182 731608505 732417221 733078537 732859650 733082275 733374710 732873306
2096.6 732873306 733667374 733950348 733147736 732556534 732617035 732255249 731134872 731107101 732393036 732745132
2106.2 732745132 733181992 735429916 735564804 734371948 734212952 734597397 735092850 734436035 734882431
2114.9 734882431 736403198 737258606 736923447 735350266 735167389 737450409 738162842 735311966 734191742
2123.6 734191742 734557800 734631042 735420837 733961258 732328873 732663193 733228760 733768387 733866196 733979797
2133.2 733979797 734563980 735119781 734965820 734675751 734912109 735313492 736002045 735422287 734392700
2141.9 734392700 735683594 736832047 737154541 737332153 736787872 736975861 736633606 735095062 733332748
2150.6 733332748 734040756 736652298 736996613 738140640 739251328 738178101 738132553 738040466 736875381
2159.3 736875381 735852661 735932083 736822052 737485123 737835312 737881088 736470108 735737152 737145615
2167.9 737145615 736889496 737017746 739354858 740858841 740465927 739366455 738674698 737095947 736342545
2176.6 736342545 737566071 739259491 739933624 740503845 741394653 738861389 736304932 736561813 736685181
2185.3 736685181 735517654 734804611 737321701 739227142 738567963 738771362 739371414 739074707 739395142
2194 739395142 740578003 741741943 743008652 742998199 741346970 740254364 741642685 743092041 743278656
2202.6 743278656 743758316 743877563 744286346 743828964 742809143 743256302 744063263 743131485 741882629
2211.3 741882629 744062805 744877014 743327103 743874283 744697037 744148407 743002014 743017807 743776932
2220 743776932 744480743 744089203 743417053 744012299 744363556 744192123 742996216 742558212 743261185 743885803
2229.7 743885803 743806763 743395615 744645081 744329071 742680054 742324982 744137421 745746765 743779221
2238.3 743779221 743476791 744446564 744333496 745026855 744168701 743125458 743759613 743006744 741488724
2247 741488724 741902008 743172379 744507217 745327454 744934235 743728943 743418427 744758224 745638199
2255.7 745638199 744817505 743117905 743820724 744562988 743762817 744294891 744810486 745824127 745533524
2264.4 745533524 745009384 745694504 745462341 745942230 745995331 745739746 744236374 743506927 745496292
2273 745496292 745393829 743826904 742877045 743063736 743247986 743695221 744208832 743874130 744633255 745203094
2282.7 745203094 745699005 745990448 746391220 746616669 745468979 745324097 745342941 745379562 744988403 744928741
2292.3 744928741 746616440 747589798 747170181 746057205 747310791 749493179 749209671 748402557 748198700
2301 748198700 749070435 750253754 751347504 751621628 750278473 749851761 751653061 753596115 753153381
2309.7 753153381 751519547 750456467 749572372 749880981 751846542 754524307 757343292 757654266 756026382
2318.4 756026382 756254120 758035965 760101395 760827255 758295517 756738663 758840179 760151367 761768875
2327.1 761768875 765028915 765183792 762767792 761707916 765023270 767970886 766145401 764872284
2334.8 764872284 764925156 765348663 768636322 769664612 764126740 763891220 769025345 768882599 770118103
2343.4 770118103 772434540 768075180 762397156 760554199 759524689 760536041 762952423 763878937
2351.2 763878937 767451630 769533157 772097702 779150391 782409744 784529648 779652634 775551529
2358.9 775551529 778533020 779757767 779472961 776748886 771941910 770266876 777617187 779019394
2366.6 779019394 776096191 777630920 773091812 767808075 765584412 765480270 764245834 760926132
2374.3 760926132 761096954 760705566 758436203 757083130 756932220 757340851 756614227 755443268 753320084
2383 753320084 750830383 750661621 751058044 751123505 750933456 749907532 750337067 750751953 750832291 751867447
2392.6 751867447 751724625 752054443 752038040 749712524 748130188 748497925 748817520 749064331 750151367
2401.3 750151367 749660263 748202362 748195496 749690552 751754227 752162628 751732025 751544647 749885712
2410 749885712 747923813 748206558 748571777 747687378 748005981 749731827 750435944 749807205 749442978 749295654
2419.6 749295654 750545120 750339890 747576675 748094788 749748764 749556961 749090271 749065399 749296494
2428.3 749296494 748824692 748625488 749277725 748573685 745643158 745554123 748851471 750441208 748231506
2437 748231506 745822830 747373581 747311935 745694656 746571808 747833176 749180069 748591690 745985947
2445.7 745985947 744183731 743768845 743535614 744537964 745978088 745749817 745838089 745680313 746236649
2454.3 746236649 746219559 744401627 743588867 743391418 743616867 742979050 743562698 745087891 744074020
2463 744074020 742933655 742414856 742433701 743286819 742926178 741435318 741505814 740675201 739439163 740982208
2472.7 740982208 742018967 742778778 742706146 741665192 741233673 740350723 740562820 741850510 742300873
2481.3 742300873 742122650 743046265 742924652 742339325 742476044 740627518 739812088 740749588 741743011
2490 741743011 741038284 739126205 739604874 741266251 741041031 739089355 739697800 740333023 739496384
2498.7 739496384 739168167 736798172 736867065 739287872 739606018 739972916 739383774 737003403 736964645
2507.4 736964645 738739929 738562851 737249603 736143723 737121887 739281158 739938049 739723969 739422607
2516.1 739422607 738118820 735638962 735897598 736105270 734368515 735168915 735860596 735416489 736164780
2524.7 736164780 737040710 736600037 736367264 736798706 735991974 734032288 733204041 734052582 733594894
2533.4 733594894 733338852 733708115 733452377 732748108 731480408 732170944 732933578 733658600 734355698
2542.1 734355698 734555588 734653473 733093414 733292160 732888031 731765594 732313843 731861725 730981445
2550.8 730981445 730357513 732357025 733637695 732410660 732617950 732903442 732842484 732792053 732033157
2559.5 732033157 731193237 732556915 732815475 730446167 730046539 729502258 728162689 727997665 727911835
2568.1 727911835 727569885 727994995 729013138 729816666 729945755 728514099 728110733 729093933 729201050
2576.8 729201050 727528000 725837784 727119751 728158569 728309555 728869934 728750305 728500366 727644424
2585.5 727644424 726730270 725886002 726169968 727788467 727725525 727218552 727426605 727931519 729572296
2594.2 729572296 729134216 726815033 726279755 724517441 722103653 722628403 724571991 726264725 725840836
2602.9 725840836 724087601 723279877 723198471 723194275 722094040 721215134 721458206 721357574 721896210 722883453
2612.5 722883453 723441086 723611832 723387299 723221893 721387711 719996414 720166550 719268036 719182663
2621.2 719182663 719182968 719181213 720012131 720061722 719744797 718662796 717996750 717720337 716614227 716341705
2630.8 716341705 717633514 717221985 715005722 715589828 716058502 715096741 715293655 716193542 717309799
2639.5 717309799 716302032 715124969 714849930 714323044 715259247 715754700 714622116 713324051 712087250
2648.2 712087250 711620255 712395630 711962357 710789337 711069565 711332626 712002563 712536850 711538391
2656.9 711538391 710343628 709587173 709337692 709603348 710142212 709860382 708734741 708559875 709257812
2665.5 709257812 709380035 708859482 708791122 708429947 706465073 706333466 707810440 707661438 708191223
2674.2 708191223 707554703 706482010 706872025 705215149 703818817 703769913 704559937 704737396 704561539
2682.9 704561539 706397705 706428528 705701447 705534210 704486084 703012543 701574020 702383881 703555679
2691.6 703555679 703169098 702095718 701822052 702986145 703103638 701062546 699349213 700075684 700742874
2700.3 700742874 699703064 699031601 700258408 701123962 700162125 699285126 699148712 699512634 698580551
2708.9 698580551 698211517 699061279 698381500 698125992 698151016 697410126 696427536 696217804 696516342 696495132
2718.6 696495132 697031708 696664734 695987320 695543594 694390182 693852463 693448715 691432037 690270309
2727.3 690270309 691561356 692246780 692241898 691161728 690300446 691223450 691042480 690700912 690307846 689072189
2736.9 689072189 689545288 691400604 691012268 691001434 691639328 688927765 688431244 689110260 687844925
2745.6 687844925 686950760 686467209 688235016 688580933 687162704 686706161 685997467 686185608 686896133
2754.3 686896133 686496506 684933624 684149323 683619308 682682419 682874756 684501038 685078812 683456421
2762.9 683456421 683649216 683676224 683213959 683796844 682055359 681600494 682880249 681881104 679898224
2771.6 679898224 679161453 679722977 679541855 678394241 678457642 678644028 677247620 676217880 675566025
2780.3 675566025 676167221 676830673 675820541 675894547 675060730 674245300 674064941 673186798 673444748 672518387
2789.9 672518387 671752396 671079025 669299622 669576874 670661545 671161728 670745621 669449539 668216934
2798.6 668216934 667860184 668197937 667816696 667126617 665484314 664265900 665343781 664890137 662998962
2807.3 662998962 662955933 662752228 661986084 662196732 661611557 660466843 659746246 658530273 657645187
2816 657645187 657510452 657809372 657839127 656337662 654839401 654372482 653629837 652797852 652743988 652513275
2825.6 652513275 651381683 651114197 650933228 649737778 649501190 649126968 647805634 646580429 646198883
2834.3 646198883 646498795 644701767 641360779 638767700 637314453 636845627 636282082 635057182 633280869
2843 633280869 632263489 631226158 629335251 626860733 622237434 618537254 617076035 615972099 615184059
2851.7 615184059 614033813 614853477 615699921 614325485 613024101 611983681 612600021 613100891 612303925
2860.3 612303925 611254921 610099297 610027390 609700394 609283676 607808228 606021042 605880356 604934273
2869 604934273 604469795 603456421 601694336 602252960 602223358 600022278 597685585 597082062 598358803
2877.7 598358803 598429794 596392479 596476593 597486992 595774040 593461609 592235947 593027000 593093567
2886.4 593093567 591324959 590142937 588972244 588035583 586892548 586207504 586086884 585819550 584830284
2895.1 584830284 582637787 581089668 579703827 579788361 579921036 577930565 577204437 577306824 576852074
2903.7 576852074 576863670 577038956 575647392 574862823 574342194 572357521 571803665 571152229 570367546
2912.4 570367546 569502983 568561363 567868423 565505676 563201752 560547066 560092163 561504478 561186447
2921.1 561186447 560509262 558373108 557123451 557932129 559223518 559863930 558905258 558557434 558113556
2929.8 558113556 557069473 557373428 559190750 560207138 559709969 559969368 561577034 562683716 562311363
2938.5 562311363 561267929 560886955 562500191 563583145 564367256 566128273 565124168 563727722 564971657
2947.1 564971657 566137886 565327110 564248238 564382973 564175797 564160805 565076218 564091873 561379852
2955.8 561379852 561920853 563713226 562355270 560588303 561436653 563619690 563764496 563049431 562181740
2964.5 562181740 562054291 564157906 565886612 566433525 565505981 566284714 567656288 566458855 567917900
2973.2 567917900 571467705 572908745 572378998 572393227 573433151 574928246 576690292 577290382 578550339
2981.8 578550339 580639839 582538300 583652496 584578743 586275978 586289253 585626144 585967369 587956467
2990.5 587956467 590440826 590826302 590072784 589840965 590459251 590128059 589848633 591143379 592599411
2999.2 592599411 592505455 591029167 591383896 592295876 592021027 591835251 591956062 591819916 591528435 593023033
3008.8 593023033 594816589 594401817 592102203 591106110 592617149 593340759 593088036 591895027 591008492
3017.5 591008492 591108780 591022072 590555954 587612457 586084213 587887993 588610306 587976723 587200050
3026.2 587200050 587610512 586891937 584725418 583969841 583836632 584377480 584165573 583580513 583825340
3034.9 583825340 583353882 581951180 579893875 579626045 580015793 579104347 578963814 578853416 577720032
3043.6 577720032 576054039 575752068 576007195 574460793 573749123 573846588 572471924 571763039 571566429
3052.2 571566429 570407066 570779800 570924492 569037018 568066292 566827469 565584755 566249008 567016678
3060.9 567016678 566362419 564847336 564029541 563874931 563539848 563112831 562736244 561700287 560563927
3069.6 560563927 560702477 561127205 559546356 557115631 557096901 557021751 556813316 557992935 556984978
3078.3 556984978 555924530 556641350 556295090 554738503 553437881 552499237 551176910 550968170 551479454
3087 551479454 550411568 549440498 550500793 550019226 547601852 546687279 545630798 545840912 547488670
3095.6 547488670 546385498 545090065 545203667 544205551 542564659 541833801 542081184 541855011 540231972
3104.3 540231972 538947182 537753525 536616325 536705284 536863327 536608772 535008163 534198685 534336433
3113 534336433 532796478 531800117 530969543 530644989 531147461 530539169 529546928 528266640 526476402
3121.7 526476402 525117073 524420509 522549362 521770706 522588577 521612740 520926476 520879440 519850159
3130.4 519850159 517913933 516711044 515885391 514291534 514357147 514529648 513724327 512736473 511318359
3139 511318359 510563049 509915199 508143349 505747070 504746780 504973183 504814453 503512421 501846619
3147.7 501846619 501298981 501237144 500618744 499552040 499776917 499146767 495384636 492628632 492517662
3156.4 492517662 492378044 491222954 490705643 490176086 488400307 487182884 487423134 487508087 486183701
3165.1 486183701 485074806 484574165 483857079 482341080 480275078 479238281 478497238 478383293 478358307
3173.8 478358307 476305389 474362984 473645172 473060341 472529602 471491623 470976753 471297493 470214233
3182.4 470214233 468070068 467425423 467855339 465481758 462537575 462100563 461273994 460464325 459858513
3191.1 459858513 459373436 458638268 457238617 456487923 454884415 454533691 454042854 452071495 451747665
3199.8 451747665 450603180 449285812 448216057 446867332 446843834 446632614 445499153 443930359 442634583
3208.5 442634583 442734642 442831573 441304893 440339088 439362030 437384949 435914841 435778694 436194458
3217.2 436194458 434299469 432999573 432161636 430609474 430607758 429537315 428327827 427731819 427924614
3225.8 427924614 427042694 425073013 426603165 427660866 426176529 423558273 421839294 421334534 420082550
3234.5 420082550 420348740 419713898 417160263 416133575 416132240 415645256 415042496 413994865 412945518
3243.2 412945518 412488556 410906868 410654373 410603485 409211731 409424248 409962959 409416924 407865334
3251.9 407865334 407469101 407336540 406316185 406183319 406087875 405835457 404372978 402596893 401101112
3260.5 401101112 399687958 400050583 400858116 399345856 396622314 396224289 396131439 396012192 396265259
3269.2 396265259 395550461 395864525 395373039 393909721 393275528 393390312 392360115 390236702 390545349
3277.9 390545349 391440125 392117348 390924072 388057632 387493134 386398506 384988098 385328140 385144806
3286.6 385144806 383617401 383139992 384615860 384710236 383805389 383034973 381992760 381239777 379397316
3295.3 379397316 378212547 378421211 378116798 378424263 378208237 377412453 377307129 376654587 375776329
3303.9 375776329 375282898 374453850 373299713 374146576 374445496 371598930 370520821 370655594 369169235
3312.6 369169235 368463326 369602737 369218597 367356110 366453285 364926071 363793411 364509697 365317459
3321.3 365317459 364013023 361931992 360620651 359529800 359607124 358322372 357265244 357983208 358458633
3330 358458633 358815880 357256622 356047020 356199265 356103516 354607315 353473778 353327980 350391006
3338.7 350391006 349032173 349097824 348297844 348000565 347197151 347234344 347675476 348249931 347144165 345933495
3348.3 345933495 343812447 339336090 338978157 339740982 338859406 337195435 336952477 338991737 337805290
3357 337805290 336506195 335524216 332964668 331705666 331154633 330171165 329511223 330199051 329712830
3365.7 329712830 328543587 328158073 327144203 325815353 324092255 323263474 323161583 322668991 322394562
3374.3 322394562 321729317 321272316 321053276 319007339 317639542 318543110 318293800 317046795 315704994
3383 315704994 314694481 314504070 315650978 317569866 316037083 313589859 313747959 314284763 313959389
3391.7 313959389 312156219 309763603 308548985 310163078 312161865 310965481 309180756 308671970
3399.4 308671970 308448105 307646847 306845303 306402206 305976658 306075611 305793114 305992279 306868591 306598740
3409.1 306598740 305833435 305246925 305985184 306051025 304622097 304692249 304179802 304140339 304287300 302483120
3418.7 302483120 301934814 301479378 301312904 301764374 301624374 302171154 302549400 302304268 302541771 304757423
3428.3 304757423 306260872 305955048 305212803 304466820 305533714 305870419 304971848 303950138 304235573
3437 304235573 305492020 304842415 305185318 305655823 306086941 307185307 306518726 307309895 309306507
3445.7 309306507 308427582 305792122 306197128 307790737 308587265 309123993 308381977 307719212 308524284
3454.4 308524284 310053177 310985909 311678352 311531315 311987801 314451962 314323559 313633175 315548420
3463.1 315548420 317673512 318201752 317378426 317800846 317871666 317058010 317923927 319731197 321983643
3471.7 321983643 323652687 322179947 321584969 323703423 324600639 326030884 326585617 325873718 325674324
3480.4 325674324 325850563 328275528 329727745 330140953 330412331 331006966 332738075 333070488 333781967
3489.1 333781967 334359398 333509445 332959061 335459099 339325562 340276299 340145378 339548912 340359497
3497.8 340359497 341524391 341064911 341941795 342726936 343675652 346296349 347991257 347063751 346359673
3506.5 346359673 348294334 350021400 349982414 349804344 351823349 353503876 353041191 354648666 356634636
3515.1 356634636 356339417 357361679 358645172 358962669 360356522 361387596 363317299 364545479 362757683
3523.8 362757683 362888718 365401154 368742409 370404396 370958252 371647110 372340584 374485664 374957428
3532.5 374957428 374049835 375074043 377510910 378349342 378270378 379509010 382044373 385432243 385269318
3541.2 385269318 384913864 386302376 386500778 387524796 388145561 390859451 392190475 391327362 393311234
3549.9 393311234 395365067 398154106 400797768 401239281 401101608 402227631 404690475 406247749 407356529
3558.5 407356529 406983910 407492905 410152893 412765274 414733429 415777817 417760696 418513832 420020294
3567.2 420020294 420871315 421455460 425258408 425944672 425840149 428082771 430990982 434104424 435991669
3575.9 435991669 437918587 439748306 441676369 442269211 441801033 444697227 449156570 451049004 451243820
3584.6 451243820 454301834 457303352 458500481 459374924 457669334 461096649 464609642 465675201
3592.3 465675201 467825203 470536537 474710464 475919037 476841164 479546204 481311455 484694595
3600 484694595 486998215 489278297 492069664 493813248 495321236 496949310 498700867 499195251 504279518
3608.7 504279518 505802307 504466743 510819397 512850380 512822990 517189865 516613808 520472870 525835381
3617.4 525835381 527060547 530194511 531755714 532948036 535357170 536685715 538685341 542938881
3625.1 542938881 545568848 545579605 551766624 556399002 550806198 554921761 557165680 562419739 568071976
3633.8 568071976 567973557 570696754 574594765 577872963 578116531 578896103 582044144 585629692 589940758
3642.4 589940758 591118317 591541138 594059715 600315819 602962112 601905022 608100662 604681282
3650.1 604681282 601424904 604814644 610446472 615391541 620035439 625702362 619829445 620474091
3657.9 620474091 625371933 627317429 629159698 630934677 633619537 633766747 636143188 638397751
3665.6 638397751 639013863 644077988 645700912 647352829 652065201 644614334 644539413 651570435 657981415
3674.3 657981415 658005066 645009918 645498581 655257339 661437531 658837433 657771912 659870453 663820190
3682.9 663820190 667768936 667757492 664304886 666908112 677651443 673912125 665464859 670365448
3690.6 670365448 667393951 666912994 671403809 672553329 675864563 677867737 675145874 675701904 676338501
3699.3 676338501 677137146 680595245 677850494 676696091 680442963 680833664 681786270 683570251 685691528
3708 685691528 686963654 681288910 688031769 697239380 685254135 682983093 686287079 688001328
3715.7 688001328 688858719 690344238 691687393 690044174 689050751 693099899 691954803 687122421 691573181
3724.4 691573181 693606339 694356613 692605820 692403564 696850891 696557922 700131302 697651367 690545273
3733.1 690545273 697940674 694686737 686058884 690526199 695784988 695322723 696723557 702818069
3740.8 702818069 699078674 696834183 705706787 700471420 683055115 691940842 700352020 706784210
3748.5 706784210 700820541 688649597 698216705 693936844 687572784 694069824 699528198 703449173
3756.2 703449173 696380920 697443466 705145187 698276749 695593643 699536514 701562729 702106171
3763.9 702106171 703499374 703589554 701657333 701813278 704836121 706703796 699361725 699593887 702332001
3772.6 702332001 703076859 704888382 703668976 702450867 702285538 705102081 708109894 701056213 700871582
3781.3 700871582 702844009 702093124 703801193 703455124 703470917 704391632 703458023 703707657 703727951 703874588
3790.9 703874588 704411240 704227219 703777771 704506760 707117920 704398651 699618149 702827225 708514709
3799.6 708514709 714469986 715432434 704600220 704197617 706896896 708980408 711731033 701929169
3807.3 701929169 698122406 703913498 706321869 707153931 707005463 705144196 705142441 713118286 719358368
3816 719358368 702185593 701129150 705962143 712654419 718671570 701346436 698016281 702953110
3823.7 702953110 705047836 704785080 704581757 703959808 703915482 704238968 706154480 709644775 704756851
3832.4 704756851 705845108 711777039 705577164 704894180 713463669 705011520 699418411 708542557
3840.1 708542557 707677536 704143906 705861435 705223160 702808380 704748154 708586960 707592926 707812347
3848.8 707812347 707784348 708270416 713188477 709352570 715692062 704385605 696786880 704806061 705948257
3857.5 705948257 706152802 706814651 707337799 710959091 705728455 703675461 710161285 705735703 700123215
3866.2 700123215 703107605 706016846 709986496 702000046 693614731 698816299 706029282 711501236
3873.9 711501236 703595047 703225250 706778183 705329895 707332916 713388062 711221237 702590485
3881.6 702590485 705429687 705717087 706120377 711372223 701711807 702055206 705840302 706282654 711054077
3890.3 711054077 712361984 703422165 701248779 705168686 706809006 707658463 705908356 704701843
3898 704701843 707614441 700407715 701528549 705272293 702351608 706172256 706173859 704595871 704775314
3906.7 704775314 704153442 705197830 705093536 705140533 706835785 706988373 705470963 705003738 706494293
3915.3 706494293 709535904 706423874 702216187 706009140 706343079 703569031 704014893 704746628 706787491
3924 706787491 705073929 701489029 702118225 704528122 707225876 706330338 703532944 702723312 701413727
3932.7 701413727 702106857 704049759 702973938 702579422 705118637 706359024 705146866 703649902 704779968
3941.4 704779968 705710068 701715393 701760712 704441681 704966278 705738373 705369568 706170578 705765228
3950.1 705765228 702792358 703736725 704211426 703063812 703040161 703529510 704128265 704702988 706126938
3958.7 706126938 706034775 705487747 707066574 707087173 704189529 702489395 703377991 704011078 704398804
3967.4 704398804 705069733 704489059 703623581 705154495 706244431 703993988 704253082 706686325 706237946
3976.1 706237946 705890656 705536652 702822037 702127838 702981262 702542267 703740158 705368195 705364380
3984.8 705364380 704183578 704238815 705365067 703944550 703207092 704102249 704834366 705449677 705573578
3993.5 705573578 705684662 703417511 701653595 703041763 703866043 703366623 703470917
4000.2 703470917
##END=$$ End of the data block
