##TITLE=$$ Begin of the data block
##JCAMP-DX=5.00 $$ ACD/SpecManager v 10.08
##SPECTROMETER/DATA SYSTEM=Varian
##DATE=07 Jan 2013 10:17:44
##DATA TYPE=INFRARED SPECTRUM
##DATA CLASS=XYDATA
##ORIGIN=
##OWNER=
##NPOINTS=3735
##FIRSTX=399.26403809
##LASTX=4000.35498047
##MAXX=4000.35498047
##MINX=399.26403809
##MAXY=70.34741211
##MINY=2.55032277
##XFACTOR=1.0000000000
##YFACTOR=0.000000100000000
##FIRSTY=25.74838257
##DELTAX=0.96440572
##XUNITS=1/CM
##YUNITS=TRANSMITTANCE
##XYDATA=(X++(Y..Y))
399.3B57483826J43794632P886276O549835J5677567k4125710j21829891M5304317
406C30740852Q4215699m2760621J4426079o0574150m230346N2786598L3643913N4610062
413.7D62858086j7180062R583550K2778282l7226219j77415066k00698757K11957035
420.5B74656849J36501102K6418610J9883499j6131706J2786140m9841957p3536529
427.2C30736008o707230J7955399N8182335K7834816q3585701p007103O4389877m169197
434.9C97629204p6747704j4740848P3741474J8332977j1032410k5368080k2361107
441.7C39453506Q6652756j8276558p7896232K3925972M552803k3154183K1096916n663604
449.4C50691376m4553070K403545O3605824J858215k7590981q097038J2096329L1721077
$$ y = [257483826, 401278458, 409164734, 415714569, 431392136, 407266426, 285436535, 330740852, 414956551, 372195930, 386622009, 326047859, 321817513, 374604111, 408248024, 462858086, 445678024, 455261574, 478039856, 440813637, 263398571, 62699814, 274656849, 411157951, 437576561, 457460060, 441328354, 454114494, 404272537, 330736008, 324028778, 341984177, 400166512, 428001328, 344415627, 337408524, 401798401, 397629204, 320881500, 306140652, 379882126, 398215103, 387182693, 361814613, 339453506, 426106262, 407829704, 329933472, 353859444, 358412247, 335258064, 356354980, 350691376, 306138306, 308541851, 372147675, 374005890, 346414909, 338317871, 350414200, 382135277]
457.1C82135277j3130417L118896l0900726p5858269M2261105R9564304p11708l3768768
464.8C72709694k7508431J0926438K3958931o0091419n4754143n356655q712750Q2399159
472.6C33570824J09462242j6535683l2592773j5841599p141456J2687225j8529282
479.3C65079498m2303276l2444248L694096M8316459j0009575q553695L5899467m4601707
487C15077019k0195523J7833062j4649048l376408k5394535M288197Q0981483K5913201
494.7C80477448k2920075J445656L495140K9971123n173607p7833748r938202N2408104
502.5C51931839K3434067L6035995n832214p8758659k0186310L5098762P596817m090614
510.2C45229683J9638328M376183k0368500j3695907j3932724M954681L4312859j3874588
$$ y = [382135277, 369004860, 372123756, 341223030, 265364761, 307625866, 407190170, 406478462, 372709694, 345201263, 356127701, 380086632, 319995213, 265241070, 259884415, 251171665, 333570824, 443033066, 426497383, 393904610, 378063011, 370921555, 383608780, 365079498, 322776222, 290331974, 294026070, 342342529, 332332954, 323779259, 359678726, 315077019, 294881496, 312714558, 298065510, 294689102, 269294567, 273582764, 354564247, 380477448, 357557373, 359003029, 362498169, 392469292, 387295685, 309461937, 299523735, 351931839, 375365906, 411401901, 405569687, 326811028, 306624718, 341723480, 349320297, 345229683, 364868011, 369244194, 348875694, 335179787, 321247063, 326201744, 360514603, 346640015]
517.9C46640015k2106057J4550095o741257j1587066k2125283j3566818M3630486q930455
525.6C19763660n9485931J1121521K8312836L0454349J1771775k5564766k0954972
532.4B95418472n762291p814350k9431457R649334M2374992l946819n426369J4636536
540.1C09698048K4189891P986832j9626541O856995J1491775k7147827j4579563L712025
547.8C02581635j9694615n15690K0773640J0385208J1477184j3915939q591709J3515549
555.5C16015263N913524M808045q203621j7251454n704708K2625714J2810421k6967202
563.2C04045982r24587K0648823P070656j373444j1577148k0156975K030678J8734150
570.9C18498135o493035n18608J0044041j358757p925358j0470352P614517l528652
$$ y = [346640015, 324533958, 339084053, 332342796, 320755730, 298630447, 285063629, 328694115, 319763660, 260277729, 271399250, 299712086, 330166435, 341938210, 316373444, 295418472, 289656181, 281841831, 252410374, 262059708, 304434700, 300487881, 295061512, 309698048, 333887939, 341874771, 322248230, 329105225, 340597000, 313449173, 298869610, 302581635, 282887020, 282371330, 303144970, 313530178, 325007362, 311091423, 302499714, 316015263, 321928787, 326736832, 318533211, 301281757, 295577049, 318202763, 331013184, 304045982, 303121395, 323770218, 330840874, 329467430, 317890282, 297733307, 299763985, 318498135, 312005100, 311486492, 321530533, 320171776, 312246418, 301776066, 309390583, 305861931]
578.6C05861931j3315354o061210M792785K1934758P574062j578217N224305M154815
586.4C28587875O720314L204346n220146q986893p791443j1964702J226139K786484
594.1C08561974q304100M667778L031520m844188k172375R327335K408600j6708870
601.8B95967674k977371l475494j0442067K227345L911190l462219j1260529j3755188
609.5B56733341q199844j5394116k8916072n976487O888256q519172m76036O960945
617.2B03100815J2318420M733620j7732849j6757946p839947j1441936j9481507N575934
624.9A52474604L2468595K077542j0579682J8212490K6885967J0060273L184089R277840
632.7B44061718R940262r448509j1438866n535202j0977039j410618q860951o649551
$$ y = [305861931, 292546577, 286485367, 291278152, 313212910, 320786972, 319208755, 324433060, 328587875, 335308189, 338512535, 333292389, 324305496, 316514053, 304549351, 305775490, 308561974, 300257874, 304925652, 307957172, 303112984, 300940609, 310267944, 312676544, 295967674, 292990303, 289514809, 279072742, 281300087, 285211277, 281749058, 270488529, 256733341, 248533497, 233139381, 204223309, 198246822, 205135078, 196615906, 196139870, 203100815, 215419235, 220152855, 202420006, 185662060, 177822113, 166380177, 146898670, 152474604, 184943199, 187020741, 176441059, 194653549, 221539516, 231599789, 234783878, 244061718, 254001980, 244553471, 233114605, 227579403, 216602364, 215191746, 206330795, 199681244]
640.4A99681244J8150997K4727039K4330082J4864350J7618942J1973591m10576R285850
648.1C20221519J4641152L918114n881119j676903L256874L287888Q190498J1995125
655.8C57953148k486916j3126144l611450J2018394J7651901J864396l439217K277946
663.5C69102058N171700q63495m500580J505966l1258888J0786629J5954933J87683
671.2C66086006l066673o11572Q916473O269379k82173j30120J202431M623146L031120
679.9C86038017o77147n693855j56898K630500j684303k552719k932854q650322j1196174
688.6C55124245N7411M65469N213852Q671379o665497j3103370o821099q26339l722496
697.3C38393555K901382p77054j618538Q280640N32036L960724j942635l993187j801300
$$ y = [199681244, 217832241, 242559280, 266889362, 281753712, 299372654, 311346245, 310935669, 320221519, 334862671, 338780785, 332899666, 331222763, 334479637, 337767525, 345958023, 357953148, 355466232, 342340088, 338728638, 350747032, 368398933, 370263329, 366824112, 369102058, 374273758, 373410263, 368909683, 370415649, 339156761, 349943390, 365898323, 366086006, 363019333, 362407761, 371324234, 377593613, 377311440, 377181320, 378383751, 383006897, 386038017, 385360870, 379667015, 379510117, 382140617, 380456314, 377903595, 374970741, 366320419, 355124245, 355181656, 355647125, 360860977, 369532356, 362866859, 349763489, 342942390, 342116051, 338393555, 341294937, 340517883, 338899345, 347179985, 347712021, 351672745, 349730110, 345736923, 343935623]
705.9C43935623m062233O523972K534408L350487r142990j1477966R398460J6207695
713.7C57267456J3897324m731675J198845J1370774M020958k242546o097222R678650
721.4C84362564N730743L032189K914925p945977k645683l395500J923790L485908
729.1C87462959o931038J818276P257156l806686j434784P167969k123795j0250854
736.8C79159203p891846l644219N019379J2610207L499489o642266k506866P134514
744.5C86737595O377868j0608444L006935J2993622j540604J578789M379654J4683228
752.2D17608643P325973l999634N455475l79028k133637j466636O255417R509162j413192
760.9D36762543j989289j145210P480469J2497101O424637m831315j0125541l644028
$$ y = [343935623, 339873390, 346397362, 348931770, 352282257, 343139267, 331661301, 341059761, 357267456, 371164780, 366433105, 367631950, 379002724, 383023682, 380781136, 374683914, 384362564, 390093307, 393125496, 396040421, 388094444, 385448761, 382053261, 383977051, 387462959, 380531921, 382350197, 389607353, 385800667, 384365883, 391533852, 389410057, 379159203, 371267357, 367623138, 372642517, 385252724, 388752213, 382109947, 379603081, 386737595, 393115463, 382507019, 385513954, 398507576, 396966972, 398545761, 402925415, 417608643, 424934616, 420934982, 426390457, 426011429, 423877792, 422411156, 428666573, 438175735, 436762543, 434773254, 433628044, 441108513, 453605614, 460030251, 455198936, 445073395, 441429367]
768.6D41429367m069672n48935J122284q313980r346084J0646553J7067947m45747
776.4D47541733N34668J899719j228180L535690J0164528P547531l619651N397834
784.1D71773872J0811539n99632m464760L908043L501816l754235P089157N056420
791.8D93322220j449852m479523r737854K075386L06549k818374K221984M481011P705688
800.5D91627235n665397o666985Q973465M256783q556938k237053M838218m969825
808.2D81599503P1029P008667Q65212Q808708L298187j2690086q406639K345543P588882
816.9D90489006O71196L707924N783462j0040397n783920M069328j980095p115860
824.6D79800644P41577L398247j71929P293854k413215o620255l770905j2145767n983925
$$ y = [441429367, 437359695, 436810760, 437933044, 429619064, 420272980, 430919533, 447987480, 447541733, 448076401, 449976120, 448747940, 452283630, 462448158, 469995689, 466376038, 471773872, 482585411, 481985779, 477521019, 481429062, 484930878, 481176643, 488265800, 493322220, 491872368, 487392845, 477654991, 479730377, 480036926, 477218552, 479440536, 483921547, 491627235, 485961838, 479294853, 488268318, 492525101, 483968163, 481731110, 486569328, 481599503, 481670532, 488679199, 489544411, 498353119, 501651306, 488961220, 480554581, 482900124, 490489006, 491160202, 494868126, 500651588, 490611191, 484827271, 488896599, 486916504, 479800644, 480542221, 483940468, 483768539, 491062393, 488649178, 482028923, 478258018, 466112251, 460128326]
833.3D60128326r479942j4462814q170014j743049k664452p664528m250068p653046
841D04040413n863152k669906n954819o67648L283844l108330l041649N972710p24793
849.6C91266670J18218N424690m870110o69632R122315J0783157O308289K748718K628555
858.3D22860870J874886J0398559N880700l406067L884201K676506n252457m053345
866D34863853O54908K84614M575501J2249832K461929q644218J220O496468J550484
874.7D54494591j35002O145362Q663369m03595j774712n07889j303138M97322r552117
883.4D56124191j0485496k099419j807976j662750n36194K647705N200882J431275
891.1D48812218n414772k012749j437912n968437K639389L141441j493263J584511
$$ y = [460128326, 450648384, 436185570, 428015556, 426272507, 423608055, 415943527, 411693459, 404040413, 398177261, 395507355, 389552536, 388884888, 392168732, 389060402, 386018753, 391991463, 391266670, 391384888, 396809578, 391939468, 391269836, 400392151, 411175308, 417483597, 420232315, 422860870, 424735756, 435134315, 441015015, 437608948, 441493149, 444169655, 438917198, 434863853, 435518761, 435803375, 440378876, 452628708, 455090637, 446446419, 446447639, 452944107, 454494591, 454359589, 460504951, 469168320, 468764725, 466990013, 466482124, 465178986, 465676308, 456124191, 445638695, 443539276, 441731300, 440068550, 439532356, 442180061, 447380943, 448812218, 443397446, 441384697, 439946785, 433978348, 436617737, 439759178, 438265915, 439850426]
898.8D39850426M27284k800713k103538K047806K218437l309708k345009J695519n287857
907.5D30392647m649887K629013J99852k051125r173698r733048k271499l19367l934288
916.2D01088600j5009231j1317101J968918N37834o703567n761948k373810m630127
923.9C57799568j481781Q82149p51648m9019m242935n636444l032456j097183l88412
932.6C42001839n12772K613869N129852J739121l39623N562592O912193Q594513J0545387
941.3C82246971L781853n18379J923217J0082970P110634O57997P405777J2185631
949D24876671P674522j542167k357254J352233k0065k717857p72782K3766n728951
957.7D20788116m853134o255874m066010L469696j228752l001137o536979p969056
$$ y = [439850426, 440277710, 437476997, 435373459, 437421265, 439639702, 436329994, 433984985, 435680504, 430392647, 425742760, 428371773, 428571625, 426520500, 417346802, 407613754, 405342255, 405022888, 401088600, 386079369, 374762268, 376731186, 377269020, 370565453, 364803505, 362429695, 357799568, 356317787, 357199936, 356448288, 356399269, 352156334, 346519890, 343487434, 342390251, 342001839, 341489067, 344102936, 349232788, 350971909, 350632286, 356194878, 363107071, 371701584, 382246971, 386028824, 385510445, 387433662, 397516632, 404627266, 405285263, 412691040, 424876671, 432551193, 431009026, 428651772, 430004005, 429983940, 427266083, 426493301, 426517067, 420788116, 415934982, 409679108, 405613098, 409082794, 407854042, 404852905, 398315926, 390346870]
965.4C90346870l556442k254486K635307l053321q823243k752571L729935J196594
973.1C77468643p964935n606156K610093N177726k27661l714599l511849o310997j646156
981.8C56274109K039986J797523J534958m311333q662529q102607m867669l946228
989.5C31756210m792175n980530o842689n483647j3874168k4353542j3086567M785747
997.2B62128639J1768513J2945785Q744069N473652M00047k354851J31531j966191
1004.9B97271194k355937k286225l498077j221314M540806K560349p739315o854535
1012.6B80416946k165279j078873K56977K280598l402882j2099266j286773M686870
1020.3B67608318l886699o572514l164844K309112R90601l037510m764767p519493
$$ y = [390346870, 386790428, 384535942, 387171249, 384117928, 375294685, 372542114, 376272049, 377468643, 369503708, 363897552, 366507645, 371685371, 371457710, 367743111, 364231262, 357920265, 356274109, 358314095, 360111618, 361646576, 357335243, 348672714, 340570107, 335702438, 331756210, 326964035, 320983505, 314140816, 308657169, 294783001, 270429459, 257342892, 262128639, 273897152, 286842937, 295587006, 301060658, 301460705, 299105854, 299237385, 297271194, 294915257, 292629032, 289130955, 287909641, 292450447, 295010796, 287271481, 280416946, 278251667, 277172794, 277429771, 279710369, 276307487, 264208221, 262921448, 267608318, 263721619, 257149105, 253984261, 256293373, 257283974, 254246464, 249481697, 241962204]
1028.1B41962204p059803j616898P11384l124447n391559m410935Q59223J070003m299011
1036.7B18700161R43985K210941n059261J715603K598152m831295n37167k596950j684704
1045.4B11459465L700581r28803J94798J529407l183594j504554M748954N464268J680737
1054.1B23161259l263645k416077K61841k711354N67150K950840J685277Q23917m102001
1062.8B16957207p402191k322197O877212L437405j100636j229477n576725k235183
1070.5B07405415l52555l314228K71664M323597J158943j585503p72056j5125N73959
1079.2B07694111J684189k394886r209366j884499L210488J776580K068139m704228
1086.9A98240528m687595j204949M56982k216663n217438k604885m538384l512172
$$ y = [241962204, 234902401, 233285503, 233996887, 230872440, 225480881, 221069946, 221929169, 222999172, 218700161, 219644146, 221855087, 216795826, 218511429, 221109581, 216278286, 215741119, 213144169, 211459465, 215160046, 214231243, 214426041, 215955448, 212771854, 211267300, 216016254, 221480522, 223161259, 219897614, 217481537, 217743378, 215032024, 215599174, 218550014, 220235291, 221059208, 216957207, 209555016, 207232819, 214110031, 217547436, 216446800, 215217323, 209640598, 207405415, 207052860, 203738632, 204010296, 208333893, 209492836, 207907333, 207135277, 207120152, 207694111, 209378300, 206983414, 197774048, 195889549, 199100037, 200876617, 202944756, 198240528, 193552933, 192347984, 192804966, 190588303, 185370865, 182765980, 178227596, 174715424]
1094.6A74715424l717823l141652o850109j6157903q725119l75328o369829j1607390
1102.3A17770271m532308k530003n812864p829848j3052759r563265k677764m118395
1110F7653065r610629k050538L107304R10826k56930p915716m963550k120557K008471
1118.7D6761746M385715j836467p71708J344323J338901l156871L516941R634065K520766
1127.4F3737411j937017j390219K496391j170254p50899l03097m231963q40016J504574
1136.1E7114911m741449j0184908p35150K621751J812668Q10766l075332l450227n444584
1144.8C4728446Q64615j751778o424515k75974K233794j45369k672141N60642j95630
1153.4B6922090N24397j090596q52663J924629R55586M764986k30581J222875L997469
$$ y = [174715424, 170997601, 167855949, 161005840, 144847937, 136122818, 135747490, 129377661, 117770271, 113237963, 110707960, 104895096, 97065248, 84012489, 74449224, 71771460, 67653065, 58042436, 55991898, 59099202, 60010028, 59753098, 51837382, 46873832, 44753275, 46761746, 51147461, 49310994, 48539286, 49883609, 51222510, 48065639, 51582580, 61216645, 63737411, 61800394, 60410175, 62906566, 61736312, 60985413, 60682316, 56450353, 55610337, 57114911, 52373462, 42188554, 41453404, 44075155, 45887823, 46698589, 43623257, 40173030, 34728446, 35593061, 33841283, 27416768, 27140794, 29374588, 29229219, 26557078, 27117720, 26922090, 27446487, 26355891, 25503228, 27427857, 28383443, 33148429, 32917848, 34140723, 38138192]
1162.1C8138192P23588J524944j768322k215325j695884M759603Q665657M951806M132218
1170.8E7216477M130817J109109J368541Q375559O540909O138616P071295L784456
1178.5I5735779L004999L898268O336202M954625P295846M455901J196565P057200
1186.2A33935385Q879299P073164M034395M555016K642183N053272Q254261K746735
1193.9A77173710M062710L804512J776867M350891M130268J187038M222870R721336
1201.6B10430202O419354L073597K110939N022430M819966j190319K270717K876892
1209.4B35833778K56348M017735N086422M376621J685295j061230k7084K45094K997017
1218B53409996K765522k764130q89453J963806n07565q79593K902756L122711N64613
$$ y = [38138192, 38861780, 40386724, 38618402, 36403077, 34707193, 39466796, 48132453, 53084259, 57216477, 61347294, 62456403, 63824944, 72200503, 78741412, 84880028, 91951323, 95735779, 98740778, 102639046, 108975248, 113929873, 121225719, 125681620, 126878185, 133935385, 142814684, 149887848, 153922243, 158477259, 161119442, 166172714, 174426975, 177173710, 181236420, 185040932, 186817799, 191168690, 195298958, 196485996, 200708866, 210430202, 216849556, 219923153, 222034092, 227056522, 231876488, 230686169, 232956886, 235833778, 236090126, 240107861, 245194283, 249570904, 251256199, 250194969, 250167885, 250412979, 253409996, 256175518, 253411388, 252521935, 254485741, 253978176, 253098583, 256001339, 259124050, 259688663]
1226.7B59688663J139451j328602r50642K89478j288566P61528Q65078O86035M39262
1235.4B60301685J120110J884613J183891J108742o05602Q82358J671524N64652k07520
1244.1B67904453k41642K94934j163197K075977K306557j783104J490402M412346j306019
1252.8B73990707m797592n05371J594505P60498p09819p1793P59258q32004k96993
1261.4B69891396J531009L274613J838073R17607M14715J94835J799870J298561K772770
1270.1B83933449M601345L530941j807594k233315K686958J200314N30071M044132
1277.8B96486301M891415K673912L716316K732106P98778K179604q65994Q68511L852444
1286.5C17333393L902607N551186K311363J567306M249001K376289Q84285M351311
$$ y = [259688663, 260828114, 259499512, 258548870, 258838348, 257549782, 258311310, 259176388, 259862423, 260301685, 261421795, 263306408, 264490299, 265599041, 264993439, 265875797, 267547321, 268111973, 267904453, 267662811, 267957745, 266794548, 268870525, 271177082, 269393978, 270884380, 275296726, 273990707, 269193115, 268687744, 270282249, 271042747, 270332928, 270261135, 271020393, 270188389, 269891396, 271422405, 274697018, 276535091, 277452698, 277867413, 278062248, 279862118, 281160679, 283933449, 288534794, 292065735, 290258141, 288024826, 290711784, 291912098, 292442169, 296486301, 301377716, 304051628, 307767944, 310500050, 311298828, 313478432, 312612438, 313480949, 317333393, 321236000, 326787186, 329098549, 330665855, 334914856, 337291145, 338175430, 342526741]
1294.2C42526741M720268J767960P45697L58772J236267J677475K466088K320709K075729
1302.9C59895706K711983J219292L062210N124817K273101l44543J06621J94320M65355
1311.6C74708862K162628P32689n37719q49686n25131L509140L316879l17268N73311
1320.3C82773705K785224J688881M42582J655235J382065M7950m84733N5847J263542
1328.9C91610298P54090L95660N72281M70276L54423N55763O46821n04189m73175j739616
1338.6C92642632k668458J649285K371902n14526l46375J192093O83785k57836j008491
1347.3C93744011o83708R36889Q18482j611061l310700P76291L125229l90358p64160
1355.9C92640915n54924j599236j554222j191292r04922j899490j037980J825104r03206
$$ y = [342526741, 347247009, 349014969, 349760666, 350119438, 351355705, 353033180, 355499268, 357819977, 359895706, 362607689, 363826981, 366889191, 372014008, 374287109, 373942566, 374049187, 374243507, 374708862, 376871490, 377604179, 377066460, 376216774, 375691643, 379200783, 382517662, 382200394, 382773705, 385558929, 387247810, 387690392, 389345627, 390727692, 390775642, 390290909, 390346756, 391610298, 392364388, 392760048, 393332329, 393802605, 394157028, 394712791, 395359612, 394855423, 394382248, 392642632, 389974174, 391623459, 393995361, 393480835, 393134460, 394326553, 395010338, 394752502, 393744011, 393060303, 393997192, 394815674, 393204613, 389893913, 390670204, 393795433, 393405075, 392640915, 392085991, 390486755, 388932533, 387741241, 386836319, 384936829, 383898849, 385723953, 384820747]
1364.6C84820747k611198j531029j135864J19171M88930j704064j899032L26195j050911
1373.3C75822945m429818n84602Q58193J254196O87713k973518k044563M21562Q63609
1382C69875717o62994n26505j31492o74057K193832K317734q32596j249313j119728
1390.7C69190598j57853p73620j252327P9956N094566K001190k107505r53827k456131
1399.3C68665047j468773J022873m53682m015427l729935J558457J195755j507378
1407.1C61266937j988678n27611M77906j319580q62542r47456j244697l47672m79622
1415.7C54026985k036857j731263J512871K371178K441253o62841l358383r54094M09050
1424.4C52017899K936096K627525m47121k27050R86213L267250J203385q65212R39675
$$ y = [384820747, 382209549, 380678520, 379542656, 379661827, 380150757, 378446693, 376547661, 376873856, 375822945, 371393127, 370808525, 371666718, 372920914, 373608627, 370635109, 368590546, 369012108, 369875717, 369212723, 368686218, 368554726, 367880669, 370074501, 372392235, 371559639, 370310326, 369190598, 369032745, 368259125, 367006798, 367086754, 372181320, 374182510, 372075005, 371121178, 368665047, 367196274, 368219147, 367765465, 363750038, 360020103, 361578560, 362774315, 361266937, 359278259, 358750648, 359228554, 357908974, 357046432, 356098976, 354854279, 354506607, 354026985, 351990128, 350258865, 351771736, 354142914, 356584167, 355921326, 352562943, 351608849, 352017899, 354953995, 357581520, 357134399, 356907349, 357893562, 361160812, 362364197, 361498985, 362438660]
1433.1C62438660L737106L503189J077805j710968m86870J585007J761512J735955
1440.8C73641396J634216J038208m58183r52187J287994J080094J610718K415580O13251
1449.5C81911087K15302j70632J708183J983796M88624R53713N489807L354072m963874
1458.2C90970078J370391K473145K445564K393036L428764L743019K310410k432938
1465.9D06701469j216621L202057K982979L990288K946929j312522J468429Q48084
1473.6D19611092L111343L498840N476075O552429K885971K562904M370613L880844
1481.3D51950111l7231Q69980J819801O19774J03950j879501K74849M673576O80848
1490D59076157m707947J531753K156029n3024q91380j508599k917633j2474l185310
$$ y = [362438660, 366175766, 369678955, 370756760, 369045792, 368558922, 370143929, 371905441, 373641396, 375275612, 376313820, 375855637, 374903450, 376191444, 377271538, 378882256, 381297836, 381911087, 382126389, 381955757, 383663940, 385647736, 386136360, 387090073, 392579880, 395933952, 390970078, 392340469, 394813614, 397259178, 399652214, 403080978, 406823997, 409134407, 406701469, 405484848, 408686905, 411669884, 415660172, 418607101, 417294579, 418763008, 419611092, 422722435, 426221275, 431697350, 438249779, 441135750, 443698654, 448069267, 451950111, 451912880, 452782860, 454602661, 455222435, 455326385, 453446884, 453721733, 458395309, 459076157, 454368210, 455899963, 458055992, 458002968, 457111588, 455602989, 452685356, 452672882, 449487572]
1498.7D49487572l503228R81713k32201j215019l55110L47976l509n17654j3939476
1507.3D31051064j130906K458001n942650j295166J028633m457627m675750k875366
1515.1D14160233r75304n704727k864571L633003L347741p12014m45404l540840k996674
1523.7D03901443J176415k380600R8190J488495K41471p70531j980019n59921j825905
1532.4C99389038n322380j664085K203598p74117k32773J729203r52454j448402l918000
1541.1C89009628k395057k006798K580871K981148k153473P13234R7618R95941M02413
1549.8C90225525J0910K945023J543617J504211j645698R62219L676224L810005R771499
1558.5D12803535L369980q150787j046906J366005J284562K543296j139068j860848
$$ y = [449487572, 445984344, 446966057, 446733856, 445518837, 445163727, 445511703, 445508194, 444990540, 431051064, 429920158, 432378159, 426435509, 425140343, 426168976, 421711349, 417035599, 414160233, 413184929, 407480202, 404615631, 408248634, 411596375, 410884361, 410438957, 406898117, 403901443, 405077858, 402697258, 402795448, 404283943, 404525414, 403754883, 401774864, 401214943, 399389038, 394066658, 392402573, 394606171, 393832054, 393599281, 395328484, 394376030, 392927628, 389009628, 386614571, 384607773, 387188644, 390169792, 388016319, 388729553, 388827171, 389823112, 390225525, 390236435, 393181458, 394725075, 396229286, 394583588, 395545807, 399222031, 403032036, 412803535, 416173515, 408022728, 406975822, 408341827, 409626389, 412169685, 411030617, 409169769]
1566.2D09169769L717919L502121L883400j014214k604446n27726j415329J055985
1573.9D15767479K64931k657357k836113K065773N2185p50579j911850m446869k434082
1582.6D03113518k143708l76205j042480J64222L48015m087677k356605l478814l071403
1591.2C87068863l633690m376373l163796k906112k398949m356194k379951m121208
1599C59732590m160309l837471l321648j092529l464584k317162k543335j419983k702217
1607.6C34873352k662430l502998n721398k175025l461209j287384k380886k781658
1615.4C10900364m243240q802681J560268K46353J070156j839008k238369o113262
1623.1B90540581n237656K006893j123352m3354l509426q82492k864361l686905j253071
$$ y = [409169769, 412887688, 416389809, 420273209, 419258995, 416654549, 416126823, 414711494, 415767479, 416032410, 413375053, 410538940, 412604713, 412656898, 411906319, 409994469, 405547600, 403113518, 400969810, 400593605, 399551125, 399715347, 400063362, 395975685, 393619080, 390140266, 387068863, 383435173, 379058800, 375895004, 372988892, 370589943, 366233749, 363853798, 359732590, 355572281, 351734810, 348413162, 347320633, 343856049, 341538887, 338995552, 337575569, 334873352, 332210922, 328707924, 322986526, 320811501, 317350292, 316062908, 313682022, 310900364, 306657124, 297854443, 299414711, 299661064, 300731220, 298892212, 296653843, 290540581, 285302925, 287309818, 286186466, 286143112, 282633686, 281751194, 278886833, 275199928, 273946857]
1631.7B73946857l337421o52237l768692k276287K781105J916714r4223j286583j160507
1640.4B66068726k879219J850204j113129J14975K90470p28378L680153l836079K369442
1649.1B65817165o8569K778549M851609J2467899p104511r768429L725109Q21877K514476
1657.8B76035175J561985J389847K337322K128277N971375n70660K132874J293411
1665.5B92279606J709919K564735j034031K437744K763501M359340N420933M337654
1673.2C14839401J688500K865524M375420J344146L096390K281609N777130L479843
1680.9C39747963L838119P621689K691956j039963K398033N336838K945938L532295
1688.6C67072868N887146N600930N392990M410591O951523N238304J258316L426475
$$ y = [273946857, 270609436, 269957199, 266188507, 263912220, 266693325, 268610039, 268515816, 267229233, 266068726, 263189507, 265039711, 263926582, 264041557, 264332027, 263603649, 267283802, 263447723, 265817165, 265748596, 268527145, 273378754, 285846653, 278742142, 268973713, 272698822, 273520699, 276035175, 277597160, 278987007, 281324329, 283452606, 289423981, 288853321, 290986195, 292279606, 293989525, 296554260, 295520229, 297957973, 300721474, 305080814, 310501747, 314839401, 316527901, 319393425, 323768845, 325112991, 328209381, 330490990, 336268120, 339747963, 343586082, 351207771, 353899727, 352859764, 355257797, 360594635, 363540573, 367072868, 372960014, 378560944, 383953934, 388364525, 395316048, 400554352, 401812668, 405239143]
1696.4D05239143J0406990O947937N445328P021179M85878Q847886O987152P495880
1704.1D58877373P666397N095634N041542M566880N566597K436981M253540O367378
1711.8D99872322L779755M055290K525864M327468L227425n15213L079987L978233
1719.5E24331131K190094K93808K431641L209877J595687K102204J04904J683731L386841
1728.2E41329918J789627J16577o24847K926292M654465J960373l889466K576371L749046
1736.9E54588356P94945J464424K064133L190918M729728K743759K605706J961479
1744.6E74143448K256317K107048J044273L043557M546966P258225L512191K80114
1752.3E98192139M291153M450912N772858J469459j768341M749680M724121L341980
$$ y = [405239143, 415646133, 422594070, 428039398, 435060577, 435546455, 444394341, 451381493, 458877373, 466543770, 471639404, 476680946, 481247826, 486814423, 489251404, 493504944, 499872322, 503652077, 507707367, 510233231, 514560699, 517788124, 517272911, 520352898, 524331131, 526521225, 526815033, 529246674, 532456551, 534052238, 536154442, 536259346, 537943077, 541329918, 543119545, 543236122, 542611275, 545537567, 550192032, 552152405, 548262939, 550839310, 554588356, 555383301, 556847725, 558911858, 562102776, 566832504, 569576263, 572181969, 574143448, 576399765, 578506813, 579551086, 582594643, 587141609, 594399834, 597912025, 598192139, 602483292, 606934204, 612707062, 614176521, 612408180, 617157860, 621881981, 625223961]
1760F25223961K368049J15853P50961K696686L046417J282807J110611J877632l090821
1768.7F35382156J489945O609039M713745k454529l954010L685151P96279k561874
1776.4F43705902K102432K000199K934341Q99277j365433M46243q1100K439346K611161
1785.1F55692368N91659K427826J537170q52584J43203J276856J491775p94449J020813
1793.8F62534637L044510j48315j914139j031799K008972R93271l003235K220154J817550
1802.4F66521606J066514J687469l59726R56345J554718Q32748R78241o62155j179276
1811.1F71396484L449860J869507j432648l36456R2850M48684m59137J983643K720260
1819.8F79733047j84783M09545j29547K511597L969040m503555k900696K246322J701279
$$ y = [625223961, 627592010, 627707863, 628458824, 631155510, 634201927, 635484734, 636595345, 638472977, 635382156, 636872101, 643481140, 648194885, 645740356, 641786346, 645471497, 646267776, 643705902, 645808334, 647808533, 650742874, 651642151, 650276718, 650722961, 650641861, 653081207, 655692368, 656284027, 658711853, 660249023, 659396439, 659539642, 660816498, 662308273, 661513824, 662534637, 665579147, 665430832, 663516693, 662484894, 664493866, 665487137, 662483902, 664704056, 666521606, 667588120, 669275589, 668915863, 669872208, 671426926, 672259674, 673237915, 672575760, 671396484, 674846344, 676715851, 675283203, 674946747, 675039597, 675488281, 675029144, 677012787, 679733047, 679548264, 679957809, 679828262, 682339859, 686308899, 681805344, 678904648, 681150970, 682852249]
1828.5F82852249r35974l466110L188782L073730J4420J718978N26123N49469P32041
1837.2F88253708j438675k36359Q85773O00967k570037N94787J181717k955398M647979
1845.8F88964462J800690j550674M6157J804428R40934K23312J177216J98974R41620
1854.5F94547119r27505J1902J632308r73434k7618m72336J92642J254959j46103j230697
1864.2F93861237k89994K222901K048568q6364k289811o51245J231919K036056J291733
1872.8F99375000K04391l30505j907883M30222Q02841n6076j148605j912003R91287
1881.5F96448669J164246J277161R45739N76630L99475N02243P35932j752777q72574
1890.2F99424744Q23135J268539Q33436j37940r75265j290436J061401O70395L86124
$$ y = [682852249, 681916275, 678450165, 681638947, 684712677, 684727097, 686446075, 686972198, 687521667, 688253708, 686815033, 686578674, 687464447, 688065414, 685495377, 686090164, 687271881, 684316483, 688964462, 690765152, 689214478, 689260635, 691065063, 692005997, 692229309, 693406525, 693605499, 694547119, 693619614, 693631516, 695263824, 694290390, 694262772, 693790436, 693983078, 695238037, 695091934, 693861237, 693571243, 695794144, 697842712, 697756348, 695466537, 694815292, 696047211, 698083267, 699375000, 699579391, 699248886, 697341003, 697771225, 698574066, 698517990, 697369385, 695457382, 696448669, 697612915, 698890076, 699835815, 700412445, 700811920, 701314163, 702050095, 700297318, 699424744, 700247879, 701516418, 702349854, 702211914, 701236649, 699946213, 701007614, 701678009, 702064133]
1898.9G02064133j85471n35355j79595p39975O1340Q07342J147309j067353n97839
1907.6G00774536L84674r7427J002197k79922n12085j219712K9221P37228J167374
1916.2G01986084J488037m280624j988678K012405J855927J627197O64902j384583
1923.9G01980667k057724M25263J368331J148606m97894j188050m36325p75909l42713
1932.6F99624252O23703J433335o09894J39770Q9798j460724M34876N03693J181182
1941.3G01959991k12783j418305l81775P95670J407928r84115N34363k2507L4256J520843
1951G03233566o40487j618729j469345N9738l30582N10559J712571O22177O91681r85871
1960.6G01785278j317978j55868L23257J55259l77808j43509j029053j224594J131897
$$ y = [702064133, 701878662, 701343307, 701163712, 700423737, 700485077, 701292419, 702439728, 701372375, 700774536, 701159210, 701061783, 702063980, 701784058, 701271973, 700052261, 700081482, 700818710, 701986084, 703474121, 699193497, 697204819, 699217224, 701073151, 702700348, 703365250, 701980667, 699922943, 700348206, 701716537, 702865143, 702367249, 701179199, 700742874, 699966965, 699624252, 700247955, 701681290, 701071396, 701211166, 701300964, 699840240, 700275116, 700778809, 701959991, 701747208, 700328903, 699947128, 700742798, 702150726, 701166611, 701700974, 701678467, 701712723, 703233566, 702593079, 700974350, 699505005, 699564743, 699234161, 699744720, 701457291, 702079468, 702771149, 701785278, 700467300, 700311432, 700634689, 700789948, 700412140, 700268631, 699239578, 698014984, 699146881]
1969.3F99146881J756897m40216L2654N84717o81229k84424K54669j108169j921082
1978F97340698P40586J052856j268845j719436P64770K691727l68576k103577q28323
1986.6F96301880R1476r21783j549454Q58841K239914J90735j445084N2185J75171
1995.3F95993881N39322o6833j684494o51856k4490L25470n60456l90548J64337K41394
2005F93885727K54059j326752j95770O23703J177521n45273j722184P17545q02078
2013.6F92066498m21219M5090p37458Q12607Q97293P83539J84021j421280k341919
2022.3F89867172J12381L40882p20215P31125O77185N55114j646041j875153N0201
2031F88092651j113128j695938n34668J192550N44968q43582m57306p1259O24771O10047
$$ y = [699146881, 700903778, 700463562, 700496216, 701080933, 700399704, 700115280, 700369949, 699261780, 697340698, 698081284, 699134140, 697865295, 696145859, 696910629, 699602356, 699233780, 697130203, 696301880, 696393356, 695471573, 693922119, 694780960, 697020874, 697211609, 695766525, 695818710, 695993881, 696533203, 696466370, 694781876, 694130020, 694105530, 694431000, 693870544, 693479996, 693644333, 693885727, 694139786, 692813034, 692617264, 693240967, 694418488, 693873215, 692151031, 692868576, 692066498, 691645279, 691690369, 690952911, 691765518, 692662811, 693446350, 693630371, 692209091, 689867172, 689979553, 690320435, 689600220, 690331345, 691008530, 691563644, 689917603, 688042450, 688092651, 686979523, 685283585, 684748917, 685941467, 686486435, 685642853, 685185547, 685114288, 685739059, 686349106]
2040.6F86349106n57861M68368J053848j138839r36661L29590L44848j263351j018448
2049.3F83630600P54929p22809l8452o64597j414185R45969m53491p27310N7983j498871
2059F79869766j762314J63880K143326N87997k922363k162857J723327J467133r24835
2067.6F78183060m37317O92520j63193m67224j177292k288208j390381k23617K27813
2076.3F72956161j083908o4773L56064j072922J241913Q43658j007538j429672n39703
2085F70199280R79843k13013q28933j98060O55213l45001q51517M39224Q89969M43802
2094.6F71170807m57916k44294r34295k29035o3934n65872M62875n61065P88879J386032
2104.3F70752182N02014J871643J651993p9193j126099j132354K975J838303m67224
$$ y = [686349106, 685791245, 686259613, 687313461, 686174622, 685237961, 685567551, 685912399, 684649048, 683630600, 684385529, 683662720, 683624268, 682959671, 681545486, 682491455, 682037964, 681310654, 681368637, 679869766, 678107452, 678271332, 680414658, 681002655, 678080292, 675917435, 677640762, 679107895, 678183060, 677745743, 678438263, 678275070, 677807846, 676630554, 674342346, 672951965, 672728348, 672956161, 671872253, 671807480, 672163544, 671090622, 672332535, 673176193, 672168655, 670738983, 670199280, 671179123, 670966110, 670137177, 669939117, 670594330, 670249329, 669397812, 669837036, 670727005, 671170807, 670712891, 670468597, 669534302, 669305267, 669241333, 668675461, 669138336, 668577271, 669366150, 670752182, 671254196, 673125839, 674777832, 674698639, 673572540, 672440186, 672443161, 674281464, 673814240]
2113F73814240j438675J155395J100845L20511o54449P64007J099244j243439n70908
2121.6F74346771M93317p78351o13556J216965M4021r90753j289062r57489N73883
2130.3F72045746J301346N92498r22470K82441o33774j541596p98721p10373R40704
2139F70555801Q48160J098938N46646O62461J071319L58200K2278r15909R76944n01709
2148.6F74723129n06286J029281n68847J932220J623459j236038n59922J284256l62854
2157.3F77358398j350784k10724P84989J852646j069794r9640L94134L81928K600632
2166F80641785j53504m80270j011963j100006K94113M79279j126175j705170J216278
2174.7F77054367j118088j417923P60498J696549J83945k478180K38571K46277J181335
$$ y = [673814240, 672375565, 673530960, 674631805, 674952316, 674297867, 675061874, 676161118, 674917679, 674346771, 674840088, 674061737, 673448181, 674665146, 674709167, 673718414, 672429352, 671471863, 672045746, 673347092, 673939590, 673017120, 673299561, 672665787, 671124191, 670325470, 669615097, 670555801, 671403961, 672502899, 673049545, 673712006, 674783325, 675141525, 675163803, 674247894, 675224838, 674723129, 674216843, 675246124, 674677277, 676609497, 678232956, 676996918, 676436996, 677721252, 677358398, 676007614, 675796890, 676581879, 678434525, 677364731, 677265091, 677659225, 678041153, 680641785, 680488281, 680008011, 678996048, 677896042, 678190155, 678669434, 677543259, 675838089, 677054367, 675936279, 674518356, 675278854, 676975403, 677159348, 674681168, 674919739, 675166016, 676347351]
2183.4F76347351J324463N1422J304016R99680O72302j765823o90461J072770N59234
2192F79874954m95453r26895K005158J654586Q35801M97589J250229N12619j149445
2200.7F84059143J308289O05240p8888p71332o57730Q12301n69763r21478r689J874542
2210.4F85650635P88879r00802J128997J574784p67365o43616L23945p35627Q16956
2219F87236786K125320J856690j585999l201675N92727j15966l32108J831360K029343
2227.7F90436478n25208k759704l30430J852570M56390j982345l36456M75387M578
2236.4F87291260Q85391N81360K8229j250687M98962O54297o6223R8190j305542L33939
2246F87749176K58484k2736o28967n06210J596451M76760j18713r13620l3035R79538
$$ y = [676347351, 677671814, 677723236, 679027252, 680026932, 680699234, 678933411, 678242950, 679315720, 679874954, 679379501, 678452606, 680457764, 682112350, 682948151, 683445740, 684695969, 685208588, 684059143, 685367432, 685972672, 685893784, 685122452, 684464722, 685277023, 684707260, 683785782, 683776093, 685650635, 686439514, 685538712, 686667709, 688242493, 687475128, 686831512, 687155457, 686419830, 687236786, 689362106, 691218796, 689632797, 686431122, 687023849, 686907883, 686575775, 688407135, 690436478, 689911270, 687151566, 686821136, 688673706, 689130096, 687147751, 686811295, 687286682, 687291260, 688176651, 688758011, 688786240, 687535553, 688034515, 688688812, 688622589, 688720779, 687415237, 687749176, 688007660, 687984924, 687355957, 686849747, 688446198, 688922958, 688804245, 687890625, 687857590, 688837128]
2255.7F88837128n14603j096878r65347K26364Q12149J094971j52436j208420L13263
2264.4F87346191J207047k01035j579818N67627R49096n74035Q4762M04053O09436
2273F88813324J231918l04107j856461K6779M63791m91257L42713R59167k84576j017456
2282.7F87883835N00564K45743K54746P35397j27716Q3237m33960n28107J014481O63299
2292.3F90291519j650009r13925J459045J199723O84509J505050k05612k578659l03573
2301F89488068P00225k83737r51690l76206K060471L80478r29108k46201N98450L38974
2310.7F90779724j129837j158523j920395J779327K798157l67356K29493K77252p06940
2319.3F90580902p56912j301499m929275K32086N517502J709595Q24127m336319m082337
$$ y = [688837128, 688322525, 687225647, 686260300, 686486664, 687298813, 688393784, 688241348, 687032928, 687346191, 688553238, 688352203, 686772385, 687340012, 688289108, 687715073, 687799835, 688203888, 688813324, 690045242, 689741135, 687884674, 687911453, 688375244, 687883987, 688226700, 689185867, 688901291, 687883835, 688384399, 688630142, 688884888, 689620285, 689492569, 689575806, 689141846, 688613739, 689628220, 690291519, 688641510, 687727585, 689186630, 690386353, 691070862, 692575912, 692370300, 689791641, 689488068, 690188293, 689904556, 688952866, 688576660, 690637131, 691017609, 690088501, 689842300, 690440750, 690779724, 689649887, 688491364, 686570969, 688350296, 691148453, 690781097, 691010590, 691287842, 690580902, 689823990, 688522491, 683593216, 683825302, 689342804, 691052399, 691876526, 687540207, 683457870]
2328F83457870J635819L817215L437271l2196m5700k801895k656479Q21381K638855
2336.7F90272141L231201j985321m589539n64346K605362N30624J999054M927292j65329
2345.4F96261139m200134j435776J054153O10581M16946P5760k205429j709595N002976
2354.1F93870621N000686L02201q20389q707962l600235N624924L28292n28106K614364
2362.7F94084396k06451l254089K891922K162246j602859J670151M14123M81110J562423
2371.4F98202972j739273q12149J895523m99572J203155P03735k336044K578888K410278
2380.1G01607513j922302j563110J85165J208420l38745r34296O67115L64456P58667
2388.8G00032883K000656j388779j763840R53293k93045m55627j132813p53402L36761
$$ y = [683457870, 685093689, 688910904, 692348175, 692315979, 692270279, 689468384, 686811905, 687633286, 690272141, 693503342, 691518021, 686928482, 686364136, 688969498, 689500122, 691499176, 696426468, 696261139, 692061005, 690625229, 691679382, 692289963, 692706909, 692782669, 690577240, 688867645, 693870621, 698871307, 699173508, 698353119, 689645157, 686044922, 691669846, 691998138, 691470032, 694084396, 693877945, 690623856, 693515778, 695678024, 694075165, 695745316, 696159439, 696640549, 698202972, 696463699, 695651550, 697547073, 697047501, 698250656, 698954391, 696618347, 699197235, 701607513, 699685211, 698122101, 698307266, 699515686, 699176941, 698242645, 698909760, 699274216, 700032883, 702033539, 700644760, 698880920, 699834213, 699541168, 699085541, 697952728, 697199326, 697536087]
2397.4F97536087j83029J75781o15387L59574J150970M23584n52063p48901J263656
2406.1F98810272O54755p45545j026306j017837l86887k42691k30789O89468R63745
2414.8F97468185r15527j181183j98288m76074o16150O42777K43530j70746J232986
2423.5F96029510n09719o58493J09405O02875J696014l62854q73108q89587J19324
2432.2F95263367M29229j602859n35507N28640O1722j607132k086105n13992Q69522
2440.8F90806885R76639N53665Q06884o85043r09805r10797j402588o98013q5221J369477
2450.5F89822083M01992p13195r54209j145325J082459J443710o49109j186752l55682
2459.2F87745972k68555k42767l08762j1368K36969j51748J77307m64173j015930j055374
$$ y = [697536087, 697353058, 697528839, 696913452, 697273026, 698423996, 698847580, 698295517, 697546616, 698810272, 699465027, 698719482, 697693176, 696675339, 696288452, 696045761, 695814972, 696504440, 697468185, 696552658, 695371475, 695173187, 694697113, 694080963, 694723740, 694967270, 694796524, 696029510, 695519791, 694861298, 694970703, 695573578, 697269592, 696906738, 696033630, 695144043, 695263367, 695692596, 694089737, 693554230, 694082870, 694144592, 692537460, 690451355, 689937363, 690806885, 691783524, 692337189, 693144073, 692459030, 691549225, 690638428, 689235840, 688537827, 688452606, 689822083, 690224075, 689510880, 688556671, 687411346, 688493805, 689937515, 689288406, 688101654, 687745972, 687477417, 687234650, 686925888, 686914520, 687151489, 686999741, 687177048, 686712875, 685696945, 684641571]
2468.8F84641571o53915R3460j62506k23542L94211L92761m99115l69186j055679J49078
2478.5F82707138J020050j054916M80880o18896j968384l3111l16239o04477j08032
2487.1F79504013N35049j877212j707764J807633J446075P2937r70230q49075j097260
2495.8F76864166q66775k20719j315002m52957R33227N56259p46078q42590k77634
2504.5F73631897O89011J337127p91702q43811N21622k53830l35083k49405q47016
2513.2F72858810K81830j37787j862945l00064j21384J37863J763153K96402j856765
2521.9F71059113j965561N60989J032944o12870p88803j231613n16968J021424M25567
2530.5F68984222j253967m50821R01871J82190l46069q12378k36588J379242N10025
$$ y = [684641571, 683987656, 684081116, 683918610, 683695068, 684089279, 684482040, 683982925, 683613739, 682558060, 682707138, 683727188, 682672272, 683153152, 682534256, 680565872, 680532761, 680216522, 679612045, 679504013, 680039062, 678161850, 676454086, 678261719, 679707794, 679780731, 678810501, 677961426, 676864166, 675997391, 675776672, 674461670, 674008713, 674941940, 675498199, 674752121, 673909531, 673631897, 674320908, 675658035, 674866333, 674022522, 674544144, 674290314, 673955231, 673705826, 672858810, 673140640, 673002853, 671139908, 670839844, 670718460, 670856323, 672619476, 672915878, 671059113, 669093552, 669654541, 670687485, 670074615, 669285812, 668054199, 667537231, 668558655, 668984222, 667730255, 667279434, 668181305, 668363495, 668017426, 667205048, 666968460, 668347702, 668857727]
2539.2F68857727j145782n15061k88696j84326O26373l86200Q6899J100616n73578
2547.9F67577972j635437j584472j026459L57895J998749J309127l45077J74026j156311
2556.6F65670013j652374M40674J12991P172n722r00116j356659j607971Q84781K880401
2566.2F64473190L19596j582184m14810r30710l95737J374436L891k80686q70209j189270
2575.9F60507507R9869l90091r32693k85645J609268j88293j121369N82428j293640
2584.5F58587341o43539L7002N31159J609573m80194j202545j181870j58309O98013
2593.2F57796631m14505j194000m75388P67593n74112k082901j677169r49860n17654
2601.9F50678635P45315O18820o21872N96009L58276l87421K16294k87171j634063
$$ y = [668857727, 667711945, 667196884, 666908188, 666723862, 667350235, 666964035, 667050934, 668151550, 667577972, 665942535, 664358063, 663331604, 663689499, 665688248, 666997375, 666652298, 666826324, 665670013, 664017639, 664458313, 664571304, 664578476, 664572754, 663672638, 662315979, 660708008, 661592789, 664473190, 664792786, 663210602, 662795792, 661865082, 661469345, 662843781, 662847672, 662566986, 661696777, 660507507, 660607376, 660217285, 659284592, 658998947, 660608215, 660419922, 659298553, 659880981, 658587341, 657943802, 657980804, 658511963, 660121536, 659641342, 658438797, 657256927, 657098618, 657796631, 657382126, 656188126, 655712738, 656480331, 655906219, 653823318, 652146149, 651196289, 650678635, 651423950, 652042770, 651420898, 652016907, 652375183, 651987762, 652204056, 651916885, 650282822]
2610.6F50282822j956406N95398K019806p41348k466889m47006q8654k02179J98517
2619.3F47194061j332473j340714j074295L72772J564560L3875m41819j017303k094269
2627.9F41864395j813278R17740J571960k38266O16837n5466k780380j714974J530991
2636.6F39899559J032906q44574j105538q46023L74260L14979j068916j001320j16806
2645.3F36638527j240120q44879J122398n07736j497002J77613P66296j114807j227760
2654F32272530J69563m48876q01773j196937n2605N19028m35104K74124n11666j588783
2663.6F28199501q95271K26516j18179p82852M5013K31705q2207m18205j203918j521950
2673.3F23680153q3466L66478o70852M6386N29480p41729j480027k47001L86734m24462
$$ y = [650282822, 648326416, 648921814, 650941620, 650200272, 647733383, 647286377, 647197723, 646995544, 647194061, 645861588, 644520874, 643446579, 643819351, 645383911, 645417786, 644975967, 643958664, 641864395, 640051117, 640968857, 642540817, 642302551, 642919388, 642863922, 640083542, 638368568, 639899559, 640932465, 640087891, 638982353, 638136330, 638510590, 638825569, 637756653, 636755333, 636638527, 635398407, 634553528, 635675926, 635168190, 633671188, 633848801, 634615097, 633500290, 632272530, 632442093, 631993217, 631191444, 629994507, 629941902, 630460930, 630025826, 630299950, 629788284, 628199501, 627304230, 627530746, 627412567, 626629715, 626674728, 626906433, 626824226, 626406021, 625202103, 623680153, 623596687, 623963165, 623292313, 623338699, 623868179, 623126450, 621646423, 621399422, 621786156, 621361694]
2682.9F21361694o15616l9520L26576J39542j099739k117462k41928K39181K03476
2691.6F18156204Q56552p59582l68462l37677n02128P67898m75311k218933j751328
2700.3F13367233L73879J336288O74744l18718l30010j226005j328316L94669j148567
2708.9F11795197j406479j105194r69544J026573k0103j154251p69806r9640J25008
2717.6F07421761n45464m97856P4653o19087q41598Q69941L434j070938j394730o36063
2727.3F02764053O29273j284371j193771j45035K46086k60811O7673P85485k189141
2735.9E99419441j403084K37389N81093Q45718j528854r82971k68364k45972O14243
2744.6E97268639p87049j640320j9111P35512j77346j113739j542549k72980M06189
$$ y = [621361694, 620746078, 620706558, 621033134, 621172676, 620072937, 617955475, 617713547, 617952728, 618156204, 619012756, 618253174, 617884712, 617547035, 617044907, 617812805, 617337494, 615118561, 613367233, 613741112, 615077400, 615752144, 615433426, 615103416, 613877411, 612549095, 612943764, 611795197, 610388718, 609283524, 608313980, 609340553, 609320450, 608166199, 607396393, 607296753, 607421761, 606876297, 606378441, 606453094, 605834007, 604992409, 605862350, 605865784, 604794846, 603400116, 602764053, 603393326, 602108955, 600915184, 600770149, 601016235, 600755424, 600823097, 601608582, 599419441, 598016357, 598253746, 598834839, 599680557, 598151703, 597168732, 596900368, 596654396, 597268639, 596481590, 594841270, 594822159, 595557671, 595380325, 594266586, 592724037, 592451057, 592857246]
2753.3E92857246M73900m99763j529732j39580l87764L0289j13678j484604j90315
2762E89015999m00238p65228l1281l85399l48625l15971j198693j480331n83649K00806
2771.6E83707390K72407L08152o21033k223663j093789q51211j435433N4017k13280
2780.3E77903557j084061j268921l39126N798n88951l62511m97093P61070N30091j836663
2789.9E73223190k795181j283493K86446Q9836Q25271R2659j000976k134781k868080
2798.6E64434891l27339N54046n26733j884346j957474m45404J58691m34990r96208
2807.3E58575134q39958k116127j620483k38190q99353r10454j100120j96343O10275
2816E51264381p80601j606445j362687r52949l29857l56178j627350k276039j643639
$$ y = [592857246, 593331146, 592831383, 591301651, 591162071, 590774307, 590804596, 590690918, 589206314, 589015999, 588615761, 587850533, 587819252, 587433853, 587085228, 586769257, 585570564, 584090233, 583506584, 583707390, 583979797, 584287949, 583666916, 581443253, 580349464, 579498253, 578062820, 578116837, 577903557, 576819496, 575550575, 575211449, 575217247, 574628296, 574265785, 573768692, 574529762, 575059853, 573223190, 570428009, 569144516, 569430962, 569520798, 570346069, 570438728, 569437752, 567302971, 564434891, 564107552, 564661598, 564134865, 562250519, 560293045, 559847641, 560006332, 559571342, 558575134, 557735176, 555619049, 553998566, 553760376, 552861023, 551950569, 550850449, 550654106, 551264381, 550483780, 548877335, 547514648, 546561699, 546231842, 545875664, 544248314, 541972275, 540328636]
2824.7E40328636j102485j281395r50280j701317k336196k1706M47121q58651j353416
2833.3E31170311r78088j019402k624321k307510j556702j953812j634521j395493
2841.1E17700462k965850m853402m138145j858635j075287l176155l757439l271904
2848.8D92603645l392372k145843k809601j839485J65519q16421l27301L86886m7950
2857.4D81777077o29158o78635l97987r42879p32079j100387j388703N95780m40292
2866.1D76062737k815400r34219j032410k130508j016388j720810j296005n82848p19833
2874.8D63814316p85866k513046k064629m05998j83334L06053l93830j803550j061898
2883.5D54908218Q0338j287766k494850j601410j422348j616058m41551o23741j917954
$$ y = [540328636, 539226151, 537944756, 536994476, 535293159, 532956963, 532935257, 533382378, 532523727, 531170311, 530192223, 529172821, 526548500, 524240990, 522684288, 520730476, 519095955, 517700462, 514734612, 509881210, 505743065, 503884430, 502809143, 499632988, 495875549, 492603645, 489211273, 487065430, 484255829, 482416344, 482581863, 481765442, 481438141, 481825027, 481777077, 481147919, 480469284, 480071297, 479128418, 478396339, 477295952, 475907249, 476503029, 476062737, 473247337, 472313118, 471280708, 469150200, 468133812, 466413002, 465116997, 464534149, 463814316, 463028450, 460515404, 458450775, 458044777, 457861443, 458167496, 457773666, 455970116, 454908218, 454988556, 453700790, 451205940, 449604530, 448182182, 446566124, 446124573, 445500832, 443582878]
2892.2D43582878j940994j254349n93719j664200j841736j091309j435775J52893O1645
2900.8D33975334r88235o08788j802559j505623n84869q33359p85370m62684m35562
2909.5D25968285j348038j380768j283073j614914j199532j516380k643395k056007
2917.2D12926178m88777p61070j488915j334457j223107k306060j185647O41022j24473
2925.9D04654694K017631J964455j85051j66512j440506L82805J253433j236572r45549
2934.6D06298828K012520K804489m9820L64075J292496j95542M96865J478614J015892
2943.3D15518417j53656n99899J22566J075974n722j147003P69310J112747m37241
2952D16255493o59675P8353Q5030k48642j37100j039009j289482l39280J38093N02624
$$ y = [443582878, 441641884, 440387535, 439793816, 438129616, 436287880, 435196571, 433760796, 433913689, 433975334, 432987099, 432378311, 430575752, 429070129, 428485260, 427651901, 426866531, 426403847, 425968285, 424620247, 423239479, 421956406, 420341492, 419141960, 417625580, 414982185, 412926178, 412437401, 411676331, 410187416, 408852959, 407629852, 405323792, 404138145, 404779167, 404654694, 406672325, 408636780, 408451729, 408285217, 406844711, 407227516, 408480949, 407244377, 406298828, 408311348, 411115837, 411066017, 411430092, 412722588, 412527046, 413023911, 414502525, 415518417, 415364761, 414764862, 414887428, 415963402, 415957680, 414810677, 415579987, 416692734, 416255493, 415595818, 415674171, 415759201, 415510559, 415373459, 414334450, 413044968, 412705688, 412843781, 413346405]
2961.6D13346405J006317R52759J282577J025620K03094J009751P14111J180802K231903
2970.3D22953339J210632Q11729R97200K017708J591568J093865K440452K572518J203231
2979D36892242n76629J076965K221527J115074J353493k79426r09501K100220L506699
2987.6D46500664Q15887j46332J153183J156731J498528K029419J786575q33626p92732
2996.3D53168297J527862R70154Q91190L9024k23694M08974K81181j23481j041565
3005D55897942k67373O6681K61155m95301m06761J488457n92575q87795O96678k60200
3014.6D55500908n56908q43277o55822l58010j181946r46579R3079M91638M92974j94397
3024.3D51841660j091385k068177j851043K69012Q74176k63138j760902j536751M67835
$$ y = [413346405, 414352722, 415305481, 416588058, 417613678, 417816772, 418826523, 419540634, 420721436, 422953339, 424163971, 424975700, 425972900, 427990608, 429582176, 430676041, 433116493, 435689011, 436892242, 436315613, 437392578, 439614105, 440729179, 442082672, 441803246, 440893745, 442993965, 446500664, 447316551, 447170219, 448323402, 449480133, 450978661, 453008080, 454794655, 453961029, 453168297, 454696159, 455666313, 456557503, 456596527, 456372833, 456781807, 457062988, 456939507, 455897942, 455630569, 455697250, 455958405, 455463104, 455056343, 456544800, 455952225, 455064430, 455761108, 455500908, 454944000, 454100723, 453444901, 453086891, 451904945, 450958366, 451051445, 451543083, 452036057, 451841660, 450750275, 448682098, 446831055, 447100067, 447974243, 447711105, 445950203, 444413452, 444881287]
3033D44881287P70263r77897k514687m81377M95072j410713q79746j97258m05998j994324
3042.6D37284622k967758p2403R68552o62079j671028q96073R1820j362305j641006
3051.3D29072342o47049j1406n07278j528054j016922j542587J69411R67178j580849
3060D23374786p03849j692353k471657k42004j68419j793j91116p67136j417312j382103
3069.6D14337044p45812j347732l62168J133957N67551j489830k307625m84924L69072
3078.3D09669533k029267k253074J162109K52381j300889p4310j779785k324944J53122
3087D01474876J41678j465225j013641K9335n35012k168769j432343N67627j173859
3095.6C94424667k275886K14042J316872p94411k136383p57141q32710j617050j74713
$$ y = [444881287, 445651550, 444673653, 442158966, 441677589, 442172661, 440761948, 439882202, 439684944, 439278946, 437284622, 434316864, 434244461, 435213013, 434550934, 432879906, 431983833, 432075653, 430713348, 429072342, 428425293, 428413887, 427906609, 426378555, 425361633, 423819046, 423988457, 424955635, 423374786, 422670937, 420978584, 418506927, 418264923, 418096504, 418094711, 417903595, 417136459, 415719147, 414337044, 413591232, 412243500, 411881332, 413015289, 413582840, 412093010, 409785385, 409300461, 409669533, 407640266, 405387192, 406549301, 406801682, 405500793, 405426483, 403646698, 401321754, 401474876, 401616554, 400151329, 399137688, 399167023, 398632011, 396463242, 395030899, 395598526, 394424667, 392148781, 392362823, 393679695, 392885284, 390748901, 389991760, 389159050, 387542000, 387367287]
3104.3C87367287J298179l60756j766357n28641j368408k349205r76982j05591m21944
3113C80787582j277198j899910j839600j097984m83322N9471j06049j611786j606064
3121.7C70925140o10313q78067q63915j492347j415558o65054j668129m97094j91002
3130.4C62643661j222381o00395m47655o60019k317543j291962m19883j022149l89289
3139C54272385k440453j219139P8964m57344n34172k270393r69200q89397j613922
3147.7C43957329j384850j032982n2795j070709j125374j503601j061516n21774r82781
3156.4C35220947M921j358909k668419j831055n57671n42945o63987m85611j971588
3165.1C25145683j362228L3569j022682j974487p76902j026325j972141n56431n3310
$$ y = [387367287, 388665466, 388304710, 386538353, 386009712, 384641304, 382292099, 381315117, 381209526, 380787582, 379510384, 377610474, 375770874, 374672890, 374189568, 374249039, 374142990, 372531204, 370925140, 370314827, 369436760, 368572845, 367080498, 365664940, 364999886, 363331757, 362834663, 362643661, 361421280, 360820885, 360373230, 359713211, 357395668, 356103706, 355683823, 354661674, 354272385, 351831932, 350612793, 350691757, 350234413, 349700241, 347429848, 346460648, 345571251, 343957329, 342572479, 341539497, 341486702, 340415993, 339290619, 337787018, 336725502, 336203728, 335220947, 335225868, 333866959, 331198540, 329367485, 328809814, 328266869, 327602882, 327117271, 325145683, 323783455, 323817024, 322794342, 320819855, 320042953, 319016628, 317044487, 316488056, 316434746]
3173.8C16434746M2476q28437j345559j557331k262725j401272j837712r64012n29632
3182.4C05750542k94819P8773k858085q82950N48763j938343q98437j008187p04574
3191.1B97792683J80053j998062j472473j75991j163502j072101k23027n56507k177257
3199.8B89133816m56181Q29888j896000j585331l20282m22230j753349j712475M30603
3208.5B82248459j082306j870956o94123J065407R09081k781182k308140o82964o02150
3217.2B74201126j66473n34096o28090j000175j513176j348248n51605k58103m41856
3225.8B67759304r34601j256218j071472j066952o8702k46277p43313J29642o65836
3234.5B61835575j330948L1815j23368j469898l83568O30475L67603j819210l277416
$$ y = [316434746, 316477222, 315648785, 314303226, 312745895, 310483170, 309081898, 307244186, 306280174, 305750542, 305455723, 305534496, 302676411, 301793461, 302342224, 300403881, 299505444, 298497257, 297792683, 297972736, 295974674, 294502201, 294326210, 293162708, 292090607, 291867580, 291311073, 289133816, 288677635, 289507523, 287611523, 286026192, 285705910, 285283680, 283530331, 281817856, 282248459, 281166153, 279295197, 278601074, 279666481, 280575562, 277794380, 275486240, 274803276, 274201126, 274034653, 273500557, 272872467, 271872292, 270359116, 269010868, 268459263, 268201160, 267759304, 266824703, 265568485, 264497013, 263430061, 263361359, 263115082, 262371769, 262501411, 261835575, 260504627, 260536442, 260413074, 258943176, 258559608, 259190083, 259557686, 257738476, 254461060]
3243.2B54461060k53411k56309j960373k24934M60243k16541l74374m21849j291751
3251.9B49921761q78945o618r98249j928254j506710q53119j901950j417466N85595
3260.5B41016045Q41388P64675k13375j014251l31250L03135o9484j331463j209584
3269.2B38755836o63185l42064L39604j165772j946926j056690q00495O72398P73983
3277.9B34566689M1770p89680k072010n66540m1885n51396L52269P49473M04701n48553
3287.5B31544838m93145o42815j336670j446418j508122n3863J312923O20766q07572
3296.2B27189922k225589j487198J031913N9700j320819o28453o60057L72601j26934
3304.9B22205086p36389O65283j62392j389828o99710R4146p46021m31461m17710j704502
$$ y = [254461060, 254207649, 253951340, 251990967, 251766033, 252226276, 252009735, 251635361, 251213512, 249921761, 249042816, 249036198, 248037949, 246109695, 244602985, 243749866, 241847916, 240430450, 241016045, 241857433, 242622108, 242408733, 241394482, 241063232, 241366367, 241296883, 239965420, 238755836, 238092651, 237750587, 238090191, 236924419, 234977493, 233920803, 233120308, 233792706, 234566689, 234608459, 233818779, 231746769, 231180229, 231138344, 230586948, 230939217, 231688690, 232093391, 231544838, 231051693, 230408878, 229072208, 227625790, 226117668, 226063805, 227376728, 227997494, 227189922, 224964333, 223477135, 224509048, 224568748, 223247929, 222619476, 221959419, 222332020, 222205086, 221468697, 222133980, 221971588, 220581760, 219882050, 219976196, 219230175, 218798714, 218381004, 216676502]
3314.6B16676502n78480k27527Q6441K67143K5177N22118j293202j744842r65557j220074
3324.2B11547699l31726N78976p50561k120915k85205M29916R0179O10600m02947j326751
3333.8B08039265j836148j248283j51577k08149O8913k95105n93090j03894r74731
3342.5B02697201r06887m42486j066895J31359m79679j876316j27029R39636J124020
3351.2A99992924k87819j564694n14259p04555j751080k173729o32744P65400l89004
3359.9A92740440o20403M29897J95218j272126n76839P16648q05435j107159K53105
3368.6A89953346K86045j703109k151661J103115R02920k179242j833896l28121L05748
3377.2A84355145K54535N6229l98979q56896q3237O36883L14389p12510m71630j70650
$$ y = [216676502, 216098022, 215870495, 215956936, 216224079, 216249256, 216771374, 215478172, 213733330, 212767773, 211547699, 211215973, 211794949, 211044388, 208923473, 208638268, 209068184, 209158363, 209768963, 209366016, 208039265, 206203117, 204954834, 204803257, 204595108, 204664021, 204368916, 203775826, 203671932, 202697201, 201790314, 201347828, 200280933, 200412292, 199932613, 198056297, 197929268, 198868904, 199992924, 199705105, 198140411, 197626152, 196921597, 195170517, 192996788, 192364044, 193129444, 192740440, 192120037, 192549934, 192745152, 191473026, 190896187, 191612835, 190807400, 189700241, 189953346, 190239391, 188536282, 186384621, 187487736, 188390656, 186211414, 184377518, 184049397, 184355145, 184609680, 184665909, 184266930, 183410034, 183326797, 183963680, 184278069, 183565559, 183093929, 182923279]
3386.9A82923279j652737j477146K65636J627484J485348j298790k673893o69175L22857
3395.6A78852863k27241n34859k9545R77383L99494p73716j523056r39693N37185p53555
3405.2A75985260o94466J171093R12590n75981j562176p65666j04962J690121J201057
3413.9A77256870m23946J124477j933803k451954J709556J475048Q99239k28958r55124
3422.6A76471405j67484p90158r75742o83842R66168J945438p13558j277809O41384
3431.2A75415802J044807M15516p39441N31617K449932J170616j271362j735897K68116
3439.9A77549706L0574l88336Q52394N86224Q87108J184921J162014q1310j067677
3448.6A80715618K24838M81739K6017J15165P05605P56741R19742O65855n43193j090088
$$ y = [182923279, 181270542, 179793396, 180059032, 181686516, 183171864, 181873074, 179199181, 178530006, 178852863, 178625622, 178090763, 178061218, 179038601, 179438095, 178664379, 177141323, 176201630, 176738815, 175985260, 175290794, 176461887, 177374477, 176798496, 175236320, 174470654, 174365692, 176055813, 177256870, 176832924, 177957401, 176023598, 173571644, 175281200, 176756248, 177655487, 177426529, 176471405, 176303921, 175513763, 174538021, 173854179, 174820347, 176765785, 176052227, 174774418, 175415802, 176460609, 176876125, 176136684, 176668301, 179118233, 180288849, 179017487, 177281590, 177549706, 177580280, 177191944, 178044338, 178630562, 179517670, 180702591, 181864605, 181783295, 180715618, 180940456, 181422195, 181448212, 181563377, 182268982, 183025723, 183945465, 184611320, 184068127, 182978039]
3458.2A82978039n05963J272965J481476J153717K29702l92914O07624R50775K252178
3466.9A90027599M32148r42077L32279q19397N95665K717323J388664j494140n69210
3475.6A91668854J860599R61838J392841M90380R7694J318188l27931j68953P50409
3484.3A98043919K43644k04277K85473J583023J080227O78578J437835M30985n65548
3493B03013859K06299J499424J811847L11852k53964p09381k2468K301349J098690
3501.6B09257507m15992J138610L147259J203823j140613J028576J439247j14804K16427
3510.3B15760040O12393O60343J531563J927490J147728P77874m2153M86374O86894
3519B23548546J67351J718597J515770K28481n98278O65760K195187J039581N88246
$$ y = [182978039, 182472076, 183745041, 185226517, 186380234, 186609936, 186217022, 186824646, 187775421, 190027599, 190459747, 189517670, 189849949, 189030552, 189626217, 192343540, 193732204, 192238064, 191668854, 193529453, 194491291, 195884132, 196374512, 196472206, 197790394, 197462463, 197293510, 198043919, 198287563, 198083286, 198368759, 199951782, 201032009, 201710587, 203148422, 203579407, 203013859, 203220158, 204719582, 206531429, 206843281, 206589317, 205879936, 205857468, 208158817, 209257507, 208841515, 209980125, 213127384, 214331207, 213190594, 214219170, 215658417, 215543613, 215760040, 216372433, 217032776, 218564339, 220491829, 221639557, 222417431, 222375278, 222861652, 223548546, 223715897, 225434494, 226950264, 227178745, 226580467, 227246227, 229441414, 230480995, 231069241]
3527.7B31069241J746311L050079J059666k019940r39903J267719K509995K634868
3535.4B40378036Q70324J20010Q45394Q42209J311836R87130R63802K346229K997590
3544.1B51662560J387290k138290j360760J169415K645988K486401N30662j45206o87256
3552.7B55550804K740631M240399O79130k2468J314373L142662K219562q01525M48647
3561.4B69512215K169323J004486J250457K547608J19324j17283K883777K151223J920948
3570.1B83442078K243442O69804P99274K611084K49081n0469K472344L039818K584991
3578.8B98061447J085205K518273K137127M57496J415825J818009K711124J086235
3586.5C11290741K142429L963623L67413J926079K861137K751694J047363O22635L766480
$$ y = [231069241, 232815552, 235865631, 236925297, 234905357, 233965454, 235233173, 237743168, 240378036, 241248360, 241368370, 242213764, 243055973, 244367809, 245354939, 246318741, 248664970, 251662560, 253049850, 250911560, 249550800, 250720215, 253366203, 255852604, 256383266, 256238060, 255550804, 258291435, 262531834, 263210964, 263188496, 264502869, 267645531, 269865093, 269063568, 269512215, 271681538, 272686024, 273936481, 276484089, 276603413, 276486130, 279369907, 281521130, 283442078, 285685520, 286355324, 287154598, 289765682, 290014763, 289964294, 292436638, 295476456, 298061447, 299146652, 301664925, 303802052, 304259548, 305675373, 307493382, 310204506, 311290741, 313433170, 317396793, 317764206, 319690285, 322551422, 325303116, 326350479, 326973114, 330739594]
3595.2C30739594K031822K415237K380448J845703M311981L88412Q45833L355141J839332
3603.9C50153503K469941J941223K518196K696533L976135K824326J287269N529023
3611.6C73396149O93741J73339O155053J662712K759628L974838L612480L669892r56040
3620.3C95141792L59040M411544M503136L110237L627663L743172L484153L807984
3628D22188721J18179k540359O465606Q130036M733619J774788J508446L860550N044021
3636.6D51283607L049202J593361L676796N014611K764816K14157L181648N948258
3644.4D76726456M042396M056664N17425J85318P898712J289101m10271N038681P587891
3653E06932373N154991L554192O060371m410896K979965N966683P34977L999558L455887
$$ y = [330739594, 332771416, 335186653, 337567101, 339412804, 343724785, 344113197, 344959030, 348314171, 350153503, 352623444, 354564667, 357082863, 359779396, 363755531, 366579857, 367867126, 373396149, 374089890, 374263229, 380418282, 382080994, 384840622, 388815460, 392427940, 396097832, 395141792, 395500832, 399912376, 404415512, 407525749, 411153412, 414896584, 418380737, 422188721, 422306900, 419766541, 426232147, 434362183, 439095802, 440870590, 442379036, 446239586, 451283607, 454332809, 455926170, 459602966, 464617577, 467382393, 467596550, 470778198, 476726456, 480768852, 484825516, 485342941, 485528259, 493426971, 494716072, 494305801, 499344482, 506932373, 512087364, 515641556, 521701927, 517291031, 520270996, 526237679, 526972656, 530972214, 534428101]
3661.7E34428101K975120K135201L074035K149506L90549O185569K819825K809677
3669.4E56967583Q453216n762710j606102O462478R487801L492088j4382171o10085
3677.1E62502098R058266O902694j946907J477395J874465J390954L402481N93032
3684.9E85254478N32036L728562N099373p658806k550164J0341988o46896j775933
3692.6E92324638K630349n22538K809105J344338j246414K757873K113037K688065
3700.3F04898453K929153n533943o20460O039352K946014J381760O88286J604538K435493
3709F16768646m982681M438133N043450j1964875L864136N755043M45366J083565J768570
3717.7F22219353J767540q70552k0104N890846J203156o169815L33252J501922J103974
$$ y = [534428101, 537403221, 539538422, 542612457, 544761963, 545152512, 551338081, 554157906, 556967583, 565420799, 559658089, 558051987, 564514465, 574002266, 577494354, 563112183, 562502098, 571560364, 578463058, 576516151, 577993546, 579868011, 581258965, 584661446, 585254478, 585786514, 589515076, 594614449, 586955643, 584405479, 594747467, 594100571, 592324638, 594954987, 594432449, 597241554, 598585892, 597339478, 600097351, 602210388, 604898453, 607827606, 602293663, 601673203, 607712555, 610658569, 612040329, 612728615, 614333153, 616768646, 611785965, 616224098, 621267548, 609302673, 613166809, 618921852, 619367218, 620450783, 622219353, 623986893, 623116341, 623096237, 628987083, 630190239, 624020424, 624353676, 625855598, 626959572]
3726.3F26959572l652840l57399M833946L676377P345581k019997q364754P594109
3734F36014595M65164r651756K16980J941948l74375K638474K773895k562332M652443
3742.7F36115036J0432434j1344337j4167862Q174247N059853P585487J072693q766823
3750.4F34160728J0093499n126267j0912666L266220M481583N353736m417152K221603
3758.2F39121284O156502p974891k752533L000526K300224K043877L938370k60163
3765.9F45573196m733429L018189O662369k62451j1809502j84097L501548J767655
3773.6F43533478J243744l98865J087799k7542K267074j255111r219284K942505K379989
3782.3F42553787O23932L364945r5139J40305m99878j07117J713791K49786n44510
$$ y = [626959572, 623306732, 622949333, 627783279, 631459656, 638805237, 636785240, 628420486, 636014595, 636479759, 626828003, 627044983, 628986931, 628612556, 631251030, 634024925, 631462593, 636115036, 646547470, 635203133, 621035271, 629209518, 634269371, 641854858, 642927551, 634160728, 644254227, 639127960, 628215294, 631481514, 635963097, 641316833, 636899681, 639121284, 645277786, 637302895, 634550362, 637550888, 639851112, 641894989, 645833359, 645573196, 640839767, 643857956, 650520325, 650257874, 638448372, 638264275, 641765823, 643533478, 644777222, 644378357, 645466156, 645438614, 647705688, 646450577, 637231293, 640173798, 642553787, 643177719, 646542664, 646447525, 646587830, 646087952, 645980835, 647694626, 647944412, 647399902]
3790.9F47399902q32443J374436L68957J012344J932984o874085j802215M808578N064011
3799.6F52452469O393051n223694j0263595J597519J505508K061005N703735m120941
3807.3F50105057p111359K549362J703263J264877M59290j031876k52380L072814O85959
3816F51445007j1285629L864594P012100O239471L796845k1095085l537064N206108
3823.7F41646347L811340L821259J765747l701248j541062L641739N220948K035827
3831.4F56700897q395080J450424P394409n913696l649903N520859n687866l283005
3839.2F44137039O999207n845413j252900Q559189n19028l802413J202926J508103
3846.9F50986710J116104J107712j719208j06888L794250m886245K521667q930130
$$ y = [647399902, 646567459, 647941895, 648310852, 649323196, 651256180, 644382095, 642579880, 647388458, 652452469, 658845520, 653621826, 643358231, 644955750, 646461258, 648522263, 654225998, 650105057, 642993698, 645543060, 647246323, 648511200, 648970490, 647938614, 647686234, 650759048, 651445007, 640159378, 644023972, 651036072, 657275543, 661072388, 639977303, 636440239, 641646347, 645457687, 649278946, 651044693, 647343445, 645802383, 649444122, 654665070, 656700897, 648305817, 649756241, 657150650, 651236954, 647587051, 653107910, 647420044, 644137039, 651136246, 645290833, 644037933, 652597122, 652078094, 648275681, 649478607, 650986710, 652102814, 653210526, 651491318, 651384430, 655178680, 650292435, 652814102, 643883972]
3854.6F43883972j268081R657440j132355m717484K77634K379761R09805m928589M055481
3863.3F49117584P998734o368943p343978L511657M443055K386093p365265k320252
3871F44058685L994675N085373M793777j0835342k038040L692245k85873J595764K221298
3879.7F52282562m886703l886566Q425293K701110j487884J507645j1275406Q97445
3887.4F44277496K244339J048966M328613l55987o012726k3117N106887o82983N4016
3896.1F49985504M33579M09698K299423r561691N082550N149460o840057K436523k110825
3904.7F47284164k210083q73870J623153L517533j004715j30158J194153m0665o04934
3913.4F48754578j312485k96707P29599n165634k238388O882629K771912k383576K17819
$$ y = [643883972, 642615891, 652273331, 651140976, 646423492, 646701126, 649080887, 649990692, 645062103, 649117584, 657116318, 650747375, 643403397, 646915054, 651358109, 653744202, 646378937, 644058685, 648053360, 653138733, 657932510, 647097168, 645059128, 648751373, 648465500, 650061264, 652282562, 647395859, 643509293, 651934586, 654635696, 653147812, 654655457, 643380051, 644277496, 646521835, 647570801, 651899414, 651543427, 645530701, 645507584, 650614471, 649931488, 649985504, 650419083, 650828781, 653128204, 643566513, 648649063, 653798523, 646958466, 649394989, 647284164, 645074081, 644200211, 645823364, 649340897, 648336182, 648206024, 649400177, 649359512, 648754578, 647442093, 647145386, 647874985, 642709351, 640470963, 647353592, 650125504, 647741928, 647959747]
3922.1F47959747Q41675Q71430j302643k161408P47834M63104j696701j303101J827011
3930.8F46246948K355194j876831j10702J571579k383347j408462J188278O38809o93664
3939.5F45527802o5842J870498J573945j730347j541061R09957R85413L92151k381745
3948.1F45540771r4451J199493k644806J650543J742935j428451N39398j75171j726532
3956.8F44603729P2708J403885j386032o49948J137390m88434k34604q163L15247j53428
3966.5F44612350p98873J058807K314300L78113j722030j768952P85675K968445J71204
3975.1F47999039k805405j750259J269989J2664j808929M97360K40174J027374P77206
3983.8F45459213q28247j01394k13395J712113J329193j895676k054596J227036J270904
$$ y = [647959747, 648801422, 649672852, 648370209, 646208801, 646956635, 647419739, 645723038, 644419937, 646246948, 648602142, 646725311, 646614609, 648186188, 645802841, 644394379, 645582657, 646221466, 645527802, 645461960, 647332458, 648906403, 647176056, 645634995, 646544952, 647530365, 647922516, 645540771, 645446320, 646645813, 644001007, 645651550, 647394485, 645966034, 646505432, 646330261, 644603729, 644676437, 646080322, 644694290, 644044342, 645181732, 644693298, 644458694, 644450531, 644765778, 644612350, 643813477, 644872284, 647186584, 647564697, 645842667, 644073715, 644859390, 647827835, 647999039, 645193634, 643443375, 644713364, 644726028, 642917099, 643414459, 643654633, 644682007, 645459213, 644630966, 644529572, 644316177, 646028290, 647357483, 645461807, 643407211, 644634247, 645905151]
3992.5F45905151j720047l61862m82254n30777J881790j42593j569290J547699
4000.2F44527817
$$ y = [645905151, 644185104, 643823242, 643340988, 642810211, 644692001, 644549408, 642980118, 644527817]
##END=$$ End of the data block
